lucene-dev mailing list archives

Site index · List index
Message view « Date » · « Thread »
Top « Date » · « Thread »
From Policeman Jenkins Server <jenk...@sd-datasolutions.de>
Subject [JENKINS] Lucene-Solr-4.x-Linux-Java6-64 - Build # 588 - Failure!
Date Sun, 22 Jul 2012 15:29:24 GMT
Build: http://jenkins.sd-datasolutions.de/job/Lucene-Solr-4.x-Linux-Java6-64/588/

7 tests failed.
REGRESSION:  org.apache.solr.handler.dataimport.TestSqlEntityProcessorDelta2.testCompositePk_DeltaImport_empty

Error Message:
org.apache.lucene.store.AlreadyClosedException: this IndexWriter is closed

Stack Trace:
org.apache.solr.common.SolrException: org.apache.lucene.store.AlreadyClosedException: this IndexWriter is closed
	at __randomizedtesting.SeedInfo.seed([89D3329D540FF084:4ED0A9F2F59AAD86]:0)
	at org.apache.solr.util.TestHarness.update(TestHarness.java:248)
	at org.apache.solr.util.TestHarness.checkUpdateStatus(TestHarness.java:294)
	at org.apache.solr.util.TestHarness.validateUpdate(TestHarness.java:264)
	at org.apache.solr.SolrTestCaseJ4.checkUpdateU(SolrTestCaseJ4.java:440)
	at org.apache.solr.SolrTestCaseJ4.assertU(SolrTestCaseJ4.java:419)
	at org.apache.solr.SolrTestCaseJ4.assertU(SolrTestCaseJ4.java:413)
	at org.apache.solr.SolrTestCaseJ4.clearIndex(SolrTestCaseJ4.java:785)
	at org.apache.solr.handler.dataimport.TestSqlEntityProcessorDelta2.setUp(TestSqlEntityProcessorDelta2.java:68)
	at sun.reflect.NativeMethodAccessorImpl.invoke0(Native Method)
	at sun.reflect.NativeMethodAccessorImpl.invoke(NativeMethodAccessorImpl.java:39)
	at sun.reflect.DelegatingMethodAccessorImpl.invoke(DelegatingMethodAccessorImpl.java:25)
	at java.lang.reflect.Method.invoke(Method.java:597)
	at com.carrotsearch.randomizedtesting.RandomizedRunner.invoke(RandomizedRunner.java:1995)
	at com.carrotsearch.randomizedtesting.RandomizedRunner.access$1100(RandomizedRunner.java:132)
	at com.carrotsearch.randomizedtesting.RandomizedRunner$7.evaluate(RandomizedRunner.java:875)
	at com.carrotsearch.randomizedtesting.RandomizedRunner$8.evaluate(RandomizedRunner.java:891)
	at com.carrotsearch.randomizedtesting.rules.SystemPropertiesRestoreRule$1.evaluate(SystemPropertiesRestoreRule.java:53)
	at org.apache.lucene.util.TestRuleSetupTeardownChained$1.evaluate(TestRuleSetupTeardownChained.java:50)
	at org.apache.lucene.util.TestRuleFieldCacheSanity$1.evaluate(TestRuleFieldCacheSanity.java:32)
	at org.apache.lucene.util.AbstractBeforeAfterRule$1.evaluate(AbstractBeforeAfterRule.java:45)
	at com.carrotsearch.randomizedtesting.rules.SystemPropertiesInvariantRule$1.evaluate(SystemPropertiesInvariantRule.java:55)
	at org.apache.lucene.util.TestRuleReportUncaughtExceptions$1.evaluate(TestRuleReportUncaughtExceptions.java:68)
	at org.apache.lucene.util.TestRuleThreadAndTestName$1.evaluate(TestRuleThreadAndTestName.java:48)
	at org.apache.lucene.util.TestRuleIgnoreAfterMaxFailures$1.evaluate(TestRuleIgnoreAfterMaxFailures.java:70)
	at org.apache.lucene.util.TestRuleMarkFailure$1.evaluate(TestRuleMarkFailure.java:48)
	at com.carrotsearch.randomizedtesting.RandomizedRunner.runSingleTest(RandomizedRunner.java:825)
	at com.carrotsearch.randomizedtesting.RandomizedRunner.access$700(RandomizedRunner.java:132)
	at com.carrotsearch.randomizedtesting.RandomizedRunner$3$1.run(RandomizedRunner.java:671)
	at com.carrotsearch.randomizedtesting.RandomizedRunner$3.evaluate(RandomizedRunner.java:697)
	at com.carrotsearch.randomizedtesting.RandomizedRunner$4.evaluate(RandomizedRunner.java:736)
	at com.carrotsearch.randomizedtesting.RandomizedRunner$5.evaluate(RandomizedRunner.java:747)
	at com.carrotsearch.randomizedtesting.rules.SystemPropertiesRestoreRule$1.evaluate(SystemPropertiesRestoreRule.java:53)
	at org.apache.lucene.util.AbstractBeforeAfterRule$1.evaluate(AbstractBeforeAfterRule.java:45)
	at org.apache.lucene.util.TestRuleReportUncaughtExceptions$1.evaluate(TestRuleReportUncaughtExceptions.java:68)
	at org.apache.lucene.util.TestRuleStoreClassName$1.evaluate(TestRuleStoreClassName.java:38)
	at org.apache.lucene.util.TestRuleIcuHack$1.evaluate(TestRuleIcuHack.java:51)
	at com.carrotsearch.randomizedtesting.rules.SystemPropertiesInvariantRule$1.evaluate(SystemPropertiesInvariantRule.java:55)
	at org.apache.lucene.util.TestRuleNoInstanceHooksOverrides$1.evaluate(TestRuleNoInstanceHooksOverrides.java:53)
	at org.apache.lucene.util.TestRuleNoStaticHooksShadowing$1.evaluate(TestRuleNoStaticHooksShadowing.java:52)
	at org.apache.lucene.util.TestRuleAssertionsRequired$1.evaluate(TestRuleAssertionsRequired.java:36)
	at org.apache.lucene.util.TestRuleMarkFailure$1.evaluate(TestRuleMarkFailure.java:48)
	at org.apache.lucene.util.TestRuleIgnoreAfterMaxFailures$1.evaluate(TestRuleIgnoreAfterMaxFailures.java:70)
	at org.apache.lucene.util.TestRuleIgnoreTestSuites$1.evaluate(TestRuleIgnoreTestSuites.java:55)
	at com.carrotsearch.randomizedtesting.RandomizedRunner.runSuite(RandomizedRunner.java:605)
	at com.carrotsearch.randomizedtesting.RandomizedRunner.access$400(RandomizedRunner.java:132)
	at com.carrotsearch.randomizedtesting.RandomizedRunner$2.run(RandomizedRunner.java:551)
Caused by: org.apache.lucene.store.AlreadyClosedException: this IndexWriter is closed
	at org.apache.lucene.index.IndexWriter.ensureOpen(IndexWriter.java:553)
	at org.apache.lucene.index.IndexWriter.ensureOpen(IndexWriter.java:558)
	at org.apache.lucene.index.IndexWriter.deleteAll(IndexWriter.java:1883)
	at org.apache.solr.update.DirectUpdateHandler2.deleteAll(DirectUpdateHandler2.java:142)
	at org.apache.solr.update.DirectUpdateHandler2.deleteByQuery(DirectUpdateHandler2.java:361)
	at org.apache.solr.update.processor.RunUpdateProcessor.processDelete(RunUpdateProcessorFactory.java:67)
	at org.apache.solr.update.processor.UpdateRequestProcessor.processDelete(UpdateRequestProcessor.java:55)
	at org.apache.solr.update.processor.DistributedUpdateProcessor.doDeleteByQuery(DistributedUpdateProcessor.java:733)
	at org.apache.solr.update.processor.DistributedUpdateProcessor.processDelete(DistributedUpdateProcessor.java:606)
	at org.apache.solr.update.processor.UpdateRequestProcessor.processDelete(UpdateRequestProcessor.java:55)
	at org.apache.solr.handler.dataimport.AbstractDataImportHandlerTestCase$TestUpdateRequestProcessor.processDelete(AbstractDataImportHandlerTestCase.java:364)
	at org.apache.solr.handler.loader.XMLLoader.processDelete(XMLLoader.java:330)
	at org.apache.solr.handler.loader.XMLLoader.processUpdate(XMLLoader.java:261)
	at org.apache.solr.handler.loader.XMLLoader.load(XMLLoader.java:157)
	at org.apache.solr.handler.UpdateRequestHandler$1.load(UpdateRequestHandler.java:92)
	at org.apache.solr.handler.ContentStreamHandlerBase.handleRequestBody(ContentStreamHandlerBase.java:74)
	at org.apache.solr.handler.RequestHandlerBase.handleRequest(RequestHandlerBase.java:129)
	at org.apache.solr.core.SolrCore.execute(SolrCore.java:1624)
	at org.apache.solr.servlet.DirectSolrConnection.request(DirectSolrConnection.java:131)
	at org.apache.solr.util.TestHarness.update(TestHarness.java:244)
	... 45 more


REGRESSION:  org.apache.solr.handler.dataimport.TestSqlEntityProcessorDelta2.testCompositePk_DeltaImport_add_delete

Error Message:
org.apache.lucene.store.AlreadyClosedException: this IndexWriter is closed

Stack Trace:
org.apache.solr.common.SolrException: org.apache.lucene.store.AlreadyClosedException: this IndexWriter is closed
	at __randomizedtesting.SeedInfo.seed([89D3329D540FF084:5B721AF2DD08FB76]:0)
	at org.apache.solr.util.TestHarness.update(TestHarness.java:248)
	at org.apache.solr.util.TestHarness.checkUpdateStatus(TestHarness.java:294)
	at org.apache.solr.util.TestHarness.validateUpdate(TestHarness.java:264)
	at org.apache.solr.SolrTestCaseJ4.checkUpdateU(SolrTestCaseJ4.java:440)
	at org.apache.solr.SolrTestCaseJ4.assertU(SolrTestCaseJ4.java:419)
	at org.apache.solr.SolrTestCaseJ4.assertU(SolrTestCaseJ4.java:413)
	at org.apache.solr.SolrTestCaseJ4.clearIndex(SolrTestCaseJ4.java:785)
	at org.apache.solr.handler.dataimport.TestSqlEntityProcessorDelta2.setUp(TestSqlEntityProcessorDelta2.java:68)
	at sun.reflect.NativeMethodAccessorImpl.invoke0(Native Method)
	at sun.reflect.NativeMethodAccessorImpl.invoke(NativeMethodAccessorImpl.java:39)
	at sun.reflect.DelegatingMethodAccessorImpl.invoke(DelegatingMethodAccessorImpl.java:25)
	at java.lang.reflect.Method.invoke(Method.java:597)
	at com.carrotsearch.randomizedtesting.RandomizedRunner.invoke(RandomizedRunner.java:1995)
	at com.carrotsearch.randomizedtesting.RandomizedRunner.access$1100(RandomizedRunner.java:132)
	at com.carrotsearch.randomizedtesting.RandomizedRunner$7.evaluate(RandomizedRunner.java:875)
	at com.carrotsearch.randomizedtesting.RandomizedRunner$8.evaluate(RandomizedRunner.java:891)
	at com.carrotsearch.randomizedtesting.rules.SystemPropertiesRestoreRule$1.evaluate(SystemPropertiesRestoreRule.java:53)
	at org.apache.lucene.util.TestRuleSetupTeardownChained$1.evaluate(TestRuleSetupTeardownChained.java:50)
	at org.apache.lucene.util.TestRuleFieldCacheSanity$1.evaluate(TestRuleFieldCacheSanity.java:32)
	at org.apache.lucene.util.AbstractBeforeAfterRule$1.evaluate(AbstractBeforeAfterRule.java:45)
	at com.carrotsearch.randomizedtesting.rules.SystemPropertiesInvariantRule$1.evaluate(SystemPropertiesInvariantRule.java:55)
	at org.apache.lucene.util.TestRuleReportUncaughtExceptions$1.evaluate(TestRuleReportUncaughtExceptions.java:68)
	at org.apache.lucene.util.TestRuleThreadAndTestName$1.evaluate(TestRuleThreadAndTestName.java:48)
	at org.apache.lucene.util.TestRuleIgnoreAfterMaxFailures$1.evaluate(TestRuleIgnoreAfterMaxFailures.java:70)
	at org.apache.lucene.util.TestRuleMarkFailure$1.evaluate(TestRuleMarkFailure.java:48)
	at com.carrotsearch.randomizedtesting.RandomizedRunner.runSingleTest(RandomizedRunner.java:825)
	at com.carrotsearch.randomizedtesting.RandomizedRunner.access$700(RandomizedRunner.java:132)
	at com.carrotsearch.randomizedtesting.RandomizedRunner$3$1.run(RandomizedRunner.java:671)
	at com.carrotsearch.randomizedtesting.RandomizedRunner$3.evaluate(RandomizedRunner.java:697)
	at com.carrotsearch.randomizedtesting.RandomizedRunner$4.evaluate(RandomizedRunner.java:736)
	at com.carrotsearch.randomizedtesting.RandomizedRunner$5.evaluate(RandomizedRunner.java:747)
	at com.carrotsearch.randomizedtesting.rules.SystemPropertiesRestoreRule$1.evaluate(SystemPropertiesRestoreRule.java:53)
	at org.apache.lucene.util.AbstractBeforeAfterRule$1.evaluate(AbstractBeforeAfterRule.java:45)
	at org.apache.lucene.util.TestRuleReportUncaughtExceptions$1.evaluate(TestRuleReportUncaughtExceptions.java:68)
	at org.apache.lucene.util.TestRuleStoreClassName$1.evaluate(TestRuleStoreClassName.java:38)
	at org.apache.lucene.util.TestRuleIcuHack$1.evaluate(TestRuleIcuHack.java:51)
	at com.carrotsearch.randomizedtesting.rules.SystemPropertiesInvariantRule$1.evaluate(SystemPropertiesInvariantRule.java:55)
	at org.apache.lucene.util.TestRuleNoInstanceHooksOverrides$1.evaluate(TestRuleNoInstanceHooksOverrides.java:53)
	at org.apache.lucene.util.TestRuleNoStaticHooksShadowing$1.evaluate(TestRuleNoStaticHooksShadowing.java:52)
	at org.apache.lucene.util.TestRuleAssertionsRequired$1.evaluate(TestRuleAssertionsRequired.java:36)
	at org.apache.lucene.util.TestRuleMarkFailure$1.evaluate(TestRuleMarkFailure.java:48)
	at org.apache.lucene.util.TestRuleIgnoreAfterMaxFailures$1.evaluate(TestRuleIgnoreAfterMaxFailures.java:70)
	at org.apache.lucene.util.TestRuleIgnoreTestSuites$1.evaluate(TestRuleIgnoreTestSuites.java:55)
	at com.carrotsearch.randomizedtesting.RandomizedRunner.runSuite(RandomizedRunner.java:605)
	at com.carrotsearch.randomizedtesting.RandomizedRunner.access$400(RandomizedRunner.java:132)
	at com.carrotsearch.randomizedtesting.RandomizedRunner$2.run(RandomizedRunner.java:551)
Caused by: org.apache.lucene.store.AlreadyClosedException: this IndexWriter is closed
	at org.apache.lucene.index.IndexWriter.ensureOpen(IndexWriter.java:553)
	at org.apache.lucene.index.IndexWriter.ensureOpen(IndexWriter.java:558)
	at org.apache.lucene.index.IndexWriter.deleteAll(IndexWriter.java:1883)
	at org.apache.solr.update.DirectUpdateHandler2.deleteAll(DirectUpdateHandler2.java:142)
	at org.apache.solr.update.DirectUpdateHandler2.deleteByQuery(DirectUpdateHandler2.java:361)
	at org.apache.solr.update.processor.RunUpdateProcessor.processDelete(RunUpdateProcessorFactory.java:67)
	at org.apache.solr.update.processor.UpdateRequestProcessor.processDelete(UpdateRequestProcessor.java:55)
	at org.apache.solr.update.processor.DistributedUpdateProcessor.doDeleteByQuery(DistributedUpdateProcessor.java:733)
	at org.apache.solr.update.processor.DistributedUpdateProcessor.processDelete(DistributedUpdateProcessor.java:606)
	at org.apache.solr.update.processor.UpdateRequestProcessor.processDelete(UpdateRequestProcessor.java:55)
	at org.apache.solr.handler.dataimport.AbstractDataImportHandlerTestCase$TestUpdateRequestProcessor.processDelete(AbstractDataImportHandlerTestCase.java:364)
	at org.apache.solr.handler.loader.XMLLoader.processDelete(XMLLoader.java:330)
	at org.apache.solr.handler.loader.XMLLoader.processUpdate(XMLLoader.java:261)
	at org.apache.solr.handler.loader.XMLLoader.load(XMLLoader.java:157)
	at org.apache.solr.handler.UpdateRequestHandler$1.load(UpdateRequestHandler.java:92)
	at org.apache.solr.handler.ContentStreamHandlerBase.handleRequestBody(ContentStreamHandlerBase.java:74)
	at org.apache.solr.handler.RequestHandlerBase.handleRequest(RequestHandlerBase.java:129)
	at org.apache.solr.core.SolrCore.execute(SolrCore.java:1624)
	at org.apache.solr.servlet.DirectSolrConnection.request(DirectSolrConnection.java:131)
	at org.apache.solr.util.TestHarness.update(TestHarness.java:244)
	... 45 more


REGRESSION:  org.apache.solr.handler.dataimport.TestSqlEntityProcessorDelta2.testCompositePk_DeltaImport_delete

Error Message:
org.apache.lucene.store.AlreadyClosedException: this IndexWriter is closed

Stack Trace:
org.apache.solr.common.SolrException: org.apache.lucene.store.AlreadyClosedException: this IndexWriter is closed
	at __randomizedtesting.SeedInfo.seed([89D3329D540FF084:A8EEC4833172D8E8]:0)
	at org.apache.solr.util.TestHarness.update(TestHarness.java:248)
	at org.apache.solr.util.TestHarness.checkUpdateStatus(TestHarness.java:294)
	at org.apache.solr.util.TestHarness.validateUpdate(TestHarness.java:264)
	at org.apache.solr.SolrTestCaseJ4.checkUpdateU(SolrTestCaseJ4.java:440)
	at org.apache.solr.SolrTestCaseJ4.assertU(SolrTestCaseJ4.java:419)
	at org.apache.solr.SolrTestCaseJ4.assertU(SolrTestCaseJ4.java:413)
	at org.apache.solr.SolrTestCaseJ4.clearIndex(SolrTestCaseJ4.java:785)
	at org.apache.solr.handler.dataimport.TestSqlEntityProcessorDelta2.setUp(TestSqlEntityProcessorDelta2.java:68)
	at sun.reflect.NativeMethodAccessorImpl.invoke0(Native Method)
	at sun.reflect.NativeMethodAccessorImpl.invoke(NativeMethodAccessorImpl.java:39)
	at sun.reflect.DelegatingMethodAccessorImpl.invoke(DelegatingMethodAccessorImpl.java:25)
	at java.lang.reflect.Method.invoke(Method.java:597)
	at com.carrotsearch.randomizedtesting.RandomizedRunner.invoke(RandomizedRunner.java:1995)
	at com.carrotsearch.randomizedtesting.RandomizedRunner.access$1100(RandomizedRunner.java:132)
	at com.carrotsearch.randomizedtesting.RandomizedRunner$7.evaluate(RandomizedRunner.java:875)
	at com.carrotsearch.randomizedtesting.RandomizedRunner$8.evaluate(RandomizedRunner.java:891)
	at com.carrotsearch.randomizedtesting.rules.SystemPropertiesRestoreRule$1.evaluate(SystemPropertiesRestoreRule.java:53)
	at org.apache.lucene.util.TestRuleSetupTeardownChained$1.evaluate(TestRuleSetupTeardownChained.java:50)
	at org.apache.lucene.util.TestRuleFieldCacheSanity$1.evaluate(TestRuleFieldCacheSanity.java:32)
	at org.apache.lucene.util.AbstractBeforeAfterRule$1.evaluate(AbstractBeforeAfterRule.java:45)
	at com.carrotsearch.randomizedtesting.rules.SystemPropertiesInvariantRule$1.evaluate(SystemPropertiesInvariantRule.java:55)
	at org.apache.lucene.util.TestRuleReportUncaughtExceptions$1.evaluate(TestRuleReportUncaughtExceptions.java:68)
	at org.apache.lucene.util.TestRuleThreadAndTestName$1.evaluate(TestRuleThreadAndTestName.java:48)
	at org.apache.lucene.util.TestRuleIgnoreAfterMaxFailures$1.evaluate(TestRuleIgnoreAfterMaxFailures.java:70)
	at org.apache.lucene.util.TestRuleMarkFailure$1.evaluate(TestRuleMarkFailure.java:48)
	at com.carrotsearch.randomizedtesting.RandomizedRunner.runSingleTest(RandomizedRunner.java:825)
	at com.carrotsearch.randomizedtesting.RandomizedRunner.access$700(RandomizedRunner.java:132)
	at com.carrotsearch.randomizedtesting.RandomizedRunner$3$1.run(RandomizedRunner.java:671)
	at com.carrotsearch.randomizedtesting.RandomizedRunner$3.evaluate(RandomizedRunner.java:697)
	at com.carrotsearch.randomizedtesting.RandomizedRunner$4.evaluate(RandomizedRunner.java:736)
	at com.carrotsearch.randomizedtesting.RandomizedRunner$5.evaluate(RandomizedRunner.java:747)
	at com.carrotsearch.randomizedtesting.rules.SystemPropertiesRestoreRule$1.evaluate(SystemPropertiesRestoreRule.java:53)
	at org.apache.lucene.util.AbstractBeforeAfterRule$1.evaluate(AbstractBeforeAfterRule.java:45)
	at org.apache.lucene.util.TestRuleReportUncaughtExceptions$1.evaluate(TestRuleReportUncaughtExceptions.java:68)
	at org.apache.lucene.util.TestRuleStoreClassName$1.evaluate(TestRuleStoreClassName.java:38)
	at org.apache.lucene.util.TestRuleIcuHack$1.evaluate(TestRuleIcuHack.java:51)
	at com.carrotsearch.randomizedtesting.rules.SystemPropertiesInvariantRule$1.evaluate(SystemPropertiesInvariantRule.java:55)
	at org.apache.lucene.util.TestRuleNoInstanceHooksOverrides$1.evaluate(TestRuleNoInstanceHooksOverrides.java:53)
	at org.apache.lucene.util.TestRuleNoStaticHooksShadowing$1.evaluate(TestRuleNoStaticHooksShadowing.java:52)
	at org.apache.lucene.util.TestRuleAssertionsRequired$1.evaluate(TestRuleAssertionsRequired.java:36)
	at org.apache.lucene.util.TestRuleMarkFailure$1.evaluate(TestRuleMarkFailure.java:48)
	at org.apache.lucene.util.TestRuleIgnoreAfterMaxFailures$1.evaluate(TestRuleIgnoreAfterMaxFailures.java:70)
	at org.apache.lucene.util.TestRuleIgnoreTestSuites$1.evaluate(TestRuleIgnoreTestSuites.java:55)
	at com.carrotsearch.randomizedtesting.RandomizedRunner.runSuite(RandomizedRunner.java:605)
	at com.carrotsearch.randomizedtesting.RandomizedRunner.access$400(RandomizedRunner.java:132)
	at com.carrotsearch.randomizedtesting.RandomizedRunner$2.run(RandomizedRunner.java:551)
Caused by: org.apache.lucene.store.AlreadyClosedException: this IndexWriter is closed
	at org.apache.lucene.index.IndexWriter.ensureOpen(IndexWriter.java:553)
	at org.apache.lucene.index.IndexWriter.ensureOpen(IndexWriter.java:558)
	at org.apache.lucene.index.IndexWriter.deleteAll(IndexWriter.java:1883)
	at org.apache.solr.update.DirectUpdateHandler2.deleteAll(DirectUpdateHandler2.java:142)
	at org.apache.solr.update.DirectUpdateHandler2.deleteByQuery(DirectUpdateHandler2.java:361)
	at org.apache.solr.update.processor.RunUpdateProcessor.processDelete(RunUpdateProcessorFactory.java:67)
	at org.apache.solr.update.processor.UpdateRequestProcessor.processDelete(UpdateRequestProcessor.java:55)
	at org.apache.solr.update.processor.DistributedUpdateProcessor.doDeleteByQuery(DistributedUpdateProcessor.java:733)
	at org.apache.solr.update.processor.DistributedUpdateProcessor.processDelete(DistributedUpdateProcessor.java:606)
	at org.apache.solr.update.processor.UpdateRequestProcessor.processDelete(UpdateRequestProcessor.java:55)
	at org.apache.solr.handler.dataimport.AbstractDataImportHandlerTestCase$TestUpdateRequestProcessor.processDelete(AbstractDataImportHandlerTestCase.java:364)
	at org.apache.solr.handler.loader.XMLLoader.processDelete(XMLLoader.java:330)
	at org.apache.solr.handler.loader.XMLLoader.processUpdate(XMLLoader.java:261)
	at org.apache.solr.handler.loader.XMLLoader.load(XMLLoader.java:157)
	at org.apache.solr.handler.UpdateRequestHandler$1.load(UpdateRequestHandler.java:92)
	at org.apache.solr.handler.ContentStreamHandlerBase.handleRequestBody(ContentStreamHandlerBase.java:74)
	at org.apache.solr.handler.RequestHandlerBase.handleRequest(RequestHandlerBase.java:129)
	at org.apache.solr.core.SolrCore.execute(SolrCore.java:1624)
	at org.apache.solr.servlet.DirectSolrConnection.request(DirectSolrConnection.java:131)
	at org.apache.solr.util.TestHarness.update(TestHarness.java:244)
	... 45 more


REGRESSION:  org.apache.solr.handler.dataimport.TestSqlEntityProcessorDelta2.testCompositePk_DeltaImport_replace_delete

Error Message:
org.apache.lucene.store.AlreadyClosedException: this IndexWriter is closed

Stack Trace:
org.apache.solr.common.SolrException: org.apache.lucene.store.AlreadyClosedException: this IndexWriter is closed
	at __randomizedtesting.SeedInfo.seed([89D3329D540FF084:8B9C5232BA8BE881]:0)
	at org.apache.solr.util.TestHarness.update(TestHarness.java:248)
	at org.apache.solr.util.TestHarness.checkUpdateStatus(TestHarness.java:294)
	at org.apache.solr.util.TestHarness.validateUpdate(TestHarness.java:264)
	at org.apache.solr.SolrTestCaseJ4.checkUpdateU(SolrTestCaseJ4.java:440)
	at org.apache.solr.SolrTestCaseJ4.assertU(SolrTestCaseJ4.java:419)
	at org.apache.solr.SolrTestCaseJ4.assertU(SolrTestCaseJ4.java:413)
	at org.apache.solr.SolrTestCaseJ4.clearIndex(SolrTestCaseJ4.java:785)
	at org.apache.solr.handler.dataimport.TestSqlEntityProcessorDelta2.setUp(TestSqlEntityProcessorDelta2.java:68)
	at sun.reflect.NativeMethodAccessorImpl.invoke0(Native Method)
	at sun.reflect.NativeMethodAccessorImpl.invoke(NativeMethodAccessorImpl.java:39)
	at sun.reflect.DelegatingMethodAccessorImpl.invoke(DelegatingMethodAccessorImpl.java:25)
	at java.lang.reflect.Method.invoke(Method.java:597)
	at com.carrotsearch.randomizedtesting.RandomizedRunner.invoke(RandomizedRunner.java:1995)
	at com.carrotsearch.randomizedtesting.RandomizedRunner.access$1100(RandomizedRunner.java:132)
	at com.carrotsearch.randomizedtesting.RandomizedRunner$7.evaluate(RandomizedRunner.java:875)
	at com.carrotsearch.randomizedtesting.RandomizedRunner$8.evaluate(RandomizedRunner.java:891)
	at com.carrotsearch.randomizedtesting.rules.SystemPropertiesRestoreRule$1.evaluate(SystemPropertiesRestoreRule.java:53)
	at org.apache.lucene.util.TestRuleSetupTeardownChained$1.evaluate(TestRuleSetupTeardownChained.java:50)
	at org.apache.lucene.util.TestRuleFieldCacheSanity$1.evaluate(TestRuleFieldCacheSanity.java:32)
	at org.apache.lucene.util.AbstractBeforeAfterRule$1.evaluate(AbstractBeforeAfterRule.java:45)
	at com.carrotsearch.randomizedtesting.rules.SystemPropertiesInvariantRule$1.evaluate(SystemPropertiesInvariantRule.java:55)
	at org.apache.lucene.util.TestRuleReportUncaughtExceptions$1.evaluate(TestRuleReportUncaughtExceptions.java:68)
	at org.apache.lucene.util.TestRuleThreadAndTestName$1.evaluate(TestRuleThreadAndTestName.java:48)
	at org.apache.lucene.util.TestRuleIgnoreAfterMaxFailures$1.evaluate(TestRuleIgnoreAfterMaxFailures.java:70)
	at org.apache.lucene.util.TestRuleMarkFailure$1.evaluate(TestRuleMarkFailure.java:48)
	at com.carrotsearch.randomizedtesting.RandomizedRunner.runSingleTest(RandomizedRunner.java:825)
	at com.carrotsearch.randomizedtesting.RandomizedRunner.access$700(RandomizedRunner.java:132)
	at com.carrotsearch.randomizedtesting.RandomizedRunner$3$1.run(RandomizedRunner.java:671)
	at com.carrotsearch.randomizedtesting.RandomizedRunner$3.evaluate(RandomizedRunner.java:697)
	at com.carrotsearch.randomizedtesting.RandomizedRunner$4.evaluate(RandomizedRunner.java:736)
	at com.carrotsearch.randomizedtesting.RandomizedRunner$5.evaluate(RandomizedRunner.java:747)
	at com.carrotsearch.randomizedtesting.rules.SystemPropertiesRestoreRule$1.evaluate(SystemPropertiesRestoreRule.java:53)
	at org.apache.lucene.util.AbstractBeforeAfterRule$1.evaluate(AbstractBeforeAfterRule.java:45)
	at org.apache.lucene.util.TestRuleReportUncaughtExceptions$1.evaluate(TestRuleReportUncaughtExceptions.java:68)
	at org.apache.lucene.util.TestRuleStoreClassName$1.evaluate(TestRuleStoreClassName.java:38)
	at org.apache.lucene.util.TestRuleIcuHack$1.evaluate(TestRuleIcuHack.java:51)
	at com.carrotsearch.randomizedtesting.rules.SystemPropertiesInvariantRule$1.evaluate(SystemPropertiesInvariantRule.java:55)
	at org.apache.lucene.util.TestRuleNoInstanceHooksOverrides$1.evaluate(TestRuleNoInstanceHooksOverrides.java:53)
	at org.apache.lucene.util.TestRuleNoStaticHooksShadowing$1.evaluate(TestRuleNoStaticHooksShadowing.java:52)
	at org.apache.lucene.util.TestRuleAssertionsRequired$1.evaluate(TestRuleAssertionsRequired.java:36)
	at org.apache.lucene.util.TestRuleMarkFailure$1.evaluate(TestRuleMarkFailure.java:48)
	at org.apache.lucene.util.TestRuleIgnoreAfterMaxFailures$1.evaluate(TestRuleIgnoreAfterMaxFailures.java:70)
	at org.apache.lucene.util.TestRuleIgnoreTestSuites$1.evaluate(TestRuleIgnoreTestSuites.java:55)
	at com.carrotsearch.randomizedtesting.RandomizedRunner.runSuite(RandomizedRunner.java:605)
	at com.carrotsearch.randomizedtesting.RandomizedRunner.access$400(RandomizedRunner.java:132)
	at com.carrotsearch.randomizedtesting.RandomizedRunner$2.run(RandomizedRunner.java:551)
Caused by: org.apache.lucene.store.AlreadyClosedException: this IndexWriter is closed
	at org.apache.lucene.index.IndexWriter.ensureOpen(IndexWriter.java:553)
	at org.apache.lucene.index.IndexWriter.ensureOpen(IndexWriter.java:558)
	at org.apache.lucene.index.IndexWriter.deleteAll(IndexWriter.java:1883)
	at org.apache.solr.update.DirectUpdateHandler2.deleteAll(DirectUpdateHandler2.java:142)
	at org.apache.solr.update.DirectUpdateHandler2.deleteByQuery(DirectUpdateHandler2.java:361)
	at org.apache.solr.update.processor.RunUpdateProcessor.processDelete(RunUpdateProcessorFactory.java:67)
	at org.apache.solr.update.processor.UpdateRequestProcessor.processDelete(UpdateRequestProcessor.java:55)
	at org.apache.solr.update.processor.DistributedUpdateProcessor.doDeleteByQuery(DistributedUpdateProcessor.java:733)
	at org.apache.solr.update.processor.DistributedUpdateProcessor.processDelete(DistributedUpdateProcessor.java:606)
	at org.apache.solr.update.processor.UpdateRequestProcessor.processDelete(UpdateRequestProcessor.java:55)
	at org.apache.solr.handler.dataimport.AbstractDataImportHandlerTestCase$TestUpdateRequestProcessor.processDelete(AbstractDataImportHandlerTestCase.java:364)
	at org.apache.solr.handler.loader.XMLLoader.processDelete(XMLLoader.java:330)
	at org.apache.solr.handler.loader.XMLLoader.processUpdate(XMLLoader.java:261)
	at org.apache.solr.handler.loader.XMLLoader.load(XMLLoader.java:157)
	at org.apache.solr.handler.UpdateRequestHandler$1.load(UpdateRequestHandler.java:92)
	at org.apache.solr.handler.ContentStreamHandlerBase.handleRequestBody(ContentStreamHandlerBase.java:74)
	at org.apache.solr.handler.RequestHandlerBase.handleRequest(RequestHandlerBase.java:129)
	at org.apache.solr.core.SolrCore.execute(SolrCore.java:1624)
	at org.apache.solr.servlet.DirectSolrConnection.request(DirectSolrConnection.java:131)
	at org.apache.solr.util.TestHarness.update(TestHarness.java:244)
	... 45 more


REGRESSION:  org.apache.solr.handler.dataimport.TestSqlEntityProcessorDelta2.testCompositePk_FullImport

Error Message:
org.apache.lucene.store.AlreadyClosedException: this IndexWriter is closed

Stack Trace:
org.apache.solr.common.SolrException: org.apache.lucene.store.AlreadyClosedException: this IndexWriter is closed
	at __randomizedtesting.SeedInfo.seed([89D3329D540FF084:D7BA7CAA8E57A052]:0)
	at org.apache.solr.util.TestHarness.update(TestHarness.java:248)
	at org.apache.solr.util.TestHarness.checkUpdateStatus(TestHarness.java:294)
	at org.apache.solr.util.TestHarness.validateUpdate(TestHarness.java:264)
	at org.apache.solr.SolrTestCaseJ4.checkUpdateU(SolrTestCaseJ4.java:440)
	at org.apache.solr.SolrTestCaseJ4.assertU(SolrTestCaseJ4.java:419)
	at org.apache.solr.SolrTestCaseJ4.assertU(SolrTestCaseJ4.java:413)
	at org.apache.solr.SolrTestCaseJ4.clearIndex(SolrTestCaseJ4.java:785)
	at org.apache.solr.handler.dataimport.TestSqlEntityProcessorDelta2.setUp(TestSqlEntityProcessorDelta2.java:68)
	at sun.reflect.NativeMethodAccessorImpl.invoke0(Native Method)
	at sun.reflect.NativeMethodAccessorImpl.invoke(NativeMethodAccessorImpl.java:39)
	at sun.reflect.DelegatingMethodAccessorImpl.invoke(DelegatingMethodAccessorImpl.java:25)
	at java.lang.reflect.Method.invoke(Method.java:597)
	at com.carrotsearch.randomizedtesting.RandomizedRunner.invoke(RandomizedRunner.java:1995)
	at com.carrotsearch.randomizedtesting.RandomizedRunner.access$1100(RandomizedRunner.java:132)
	at com.carrotsearch.randomizedtesting.RandomizedRunner$7.evaluate(RandomizedRunner.java:875)
	at com.carrotsearch.randomizedtesting.RandomizedRunner$8.evaluate(RandomizedRunner.java:891)
	at com.carrotsearch.randomizedtesting.rules.SystemPropertiesRestoreRule$1.evaluate(SystemPropertiesRestoreRule.java:53)
	at org.apache.lucene.util.TestRuleSetupTeardownChained$1.evaluate(TestRuleSetupTeardownChained.java:50)
	at org.apache.lucene.util.TestRuleFieldCacheSanity$1.evaluate(TestRuleFieldCacheSanity.java:32)
	at org.apache.lucene.util.AbstractBeforeAfterRule$1.evaluate(AbstractBeforeAfterRule.java:45)
	at com.carrotsearch.randomizedtesting.rules.SystemPropertiesInvariantRule$1.evaluate(SystemPropertiesInvariantRule.java:55)
	at org.apache.lucene.util.TestRuleReportUncaughtExceptions$1.evaluate(TestRuleReportUncaughtExceptions.java:68)
	at org.apache.lucene.util.TestRuleThreadAndTestName$1.evaluate(TestRuleThreadAndTestName.java:48)
	at org.apache.lucene.util.TestRuleIgnoreAfterMaxFailures$1.evaluate(TestRuleIgnoreAfterMaxFailures.java:70)
	at org.apache.lucene.util.TestRuleMarkFailure$1.evaluate(TestRuleMarkFailure.java:48)
	at com.carrotsearch.randomizedtesting.RandomizedRunner.runSingleTest(RandomizedRunner.java:825)
	at com.carrotsearch.randomizedtesting.RandomizedRunner.access$700(RandomizedRunner.java:132)
	at com.carrotsearch.randomizedtesting.RandomizedRunner$3$1.run(RandomizedRunner.java:671)
	at com.carrotsearch.randomizedtesting.RandomizedRunner$3.evaluate(RandomizedRunner.java:697)
	at com.carrotsearch.randomizedtesting.RandomizedRunner$4.evaluate(RandomizedRunner.java:736)
	at com.carrotsearch.randomizedtesting.RandomizedRunner$5.evaluate(RandomizedRunner.java:747)
	at com.carrotsearch.randomizedtesting.rules.SystemPropertiesRestoreRule$1.evaluate(SystemPropertiesRestoreRule.java:53)
	at org.apache.lucene.util.AbstractBeforeAfterRule$1.evaluate(AbstractBeforeAfterRule.java:45)
	at org.apache.lucene.util.TestRuleReportUncaughtExceptions$1.evaluate(TestRuleReportUncaughtExceptions.java:68)
	at org.apache.lucene.util.TestRuleStoreClassName$1.evaluate(TestRuleStoreClassName.java:38)
	at org.apache.lucene.util.TestRuleIcuHack$1.evaluate(TestRuleIcuHack.java:51)
	at com.carrotsearch.randomizedtesting.rules.SystemPropertiesInvariantRule$1.evaluate(SystemPropertiesInvariantRule.java:55)
	at org.apache.lucene.util.TestRuleNoInstanceHooksOverrides$1.evaluate(TestRuleNoInstanceHooksOverrides.java:53)
	at org.apache.lucene.util.TestRuleNoStaticHooksShadowing$1.evaluate(TestRuleNoStaticHooksShadowing.java:52)
	at org.apache.lucene.util.TestRuleAssertionsRequired$1.evaluate(TestRuleAssertionsRequired.java:36)
	at org.apache.lucene.util.TestRuleMarkFailure$1.evaluate(TestRuleMarkFailure.java:48)
	at org.apache.lucene.util.TestRuleIgnoreAfterMaxFailures$1.evaluate(TestRuleIgnoreAfterMaxFailures.java:70)
	at org.apache.lucene.util.TestRuleIgnoreTestSuites$1.evaluate(TestRuleIgnoreTestSuites.java:55)
	at com.carrotsearch.randomizedtesting.RandomizedRunner.runSuite(RandomizedRunner.java:605)
	at com.carrotsearch.randomizedtesting.RandomizedRunner.access$400(RandomizedRunner.java:132)
	at com.carrotsearch.randomizedtesting.RandomizedRunner$2.run(RandomizedRunner.java:551)
Caused by: org.apache.lucene.store.AlreadyClosedException: this IndexWriter is closed
	at org.apache.lucene.index.IndexWriter.ensureOpen(IndexWriter.java:553)
	at org.apache.lucene.index.IndexWriter.ensureOpen(IndexWriter.java:558)
	at org.apache.lucene.index.IndexWriter.deleteAll(IndexWriter.java:1883)
	at org.apache.solr.update.DirectUpdateHandler2.deleteAll(DirectUpdateHandler2.java:142)
	at org.apache.solr.update.DirectUpdateHandler2.deleteByQuery(DirectUpdateHandler2.java:361)
	at org.apache.solr.update.processor.RunUpdateProcessor.processDelete(RunUpdateProcessorFactory.java:67)
	at org.apache.solr.update.processor.UpdateRequestProcessor.processDelete(UpdateRequestProcessor.java:55)
	at org.apache.solr.update.processor.DistributedUpdateProcessor.doDeleteByQuery(DistributedUpdateProcessor.java:733)
	at org.apache.solr.update.processor.DistributedUpdateProcessor.processDelete(DistributedUpdateProcessor.java:606)
	at org.apache.solr.update.processor.UpdateRequestProcessor.processDelete(UpdateRequestProcessor.java:55)
	at org.apache.solr.handler.dataimport.AbstractDataImportHandlerTestCase$TestUpdateRequestProcessor.processDelete(AbstractDataImportHandlerTestCase.java:364)
	at org.apache.solr.handler.loader.XMLLoader.processDelete(XMLLoader.java:330)
	at org.apache.solr.handler.loader.XMLLoader.processUpdate(XMLLoader.java:261)
	at org.apache.solr.handler.loader.XMLLoader.load(XMLLoader.java:157)
	at org.apache.solr.handler.UpdateRequestHandler$1.load(UpdateRequestHandler.java:92)
	at org.apache.solr.handler.ContentStreamHandlerBase.handleRequestBody(ContentStreamHandlerBase.java:74)
	at org.apache.solr.handler.RequestHandlerBase.handleRequest(RequestHandlerBase.java:129)
	at org.apache.solr.core.SolrCore.execute(SolrCore.java:1624)
	at org.apache.solr.servlet.DirectSolrConnection.request(DirectSolrConnection.java:131)
	at org.apache.solr.util.TestHarness.update(TestHarness.java:244)
	... 45 more


REGRESSION:  org.apache.solr.handler.dataimport.TestSqlEntityProcessorDelta2.testCompositePk_DeltaImport_replace_nodelete

Error Message:
org.apache.lucene.store.AlreadyClosedException: this IndexWriter is closed

Stack Trace:
org.apache.solr.common.SolrException: org.apache.lucene.store.AlreadyClosedException: this IndexWriter is closed
	at __randomizedtesting.SeedInfo.seed([89D3329D540FF084:4A9034C6F61B06E]:0)
	at org.apache.solr.util.TestHarness.update(TestHarness.java:248)
	at org.apache.solr.util.TestHarness.checkUpdateStatus(TestHarness.java:294)
	at org.apache.solr.util.TestHarness.validateUpdate(TestHarness.java:264)
	at org.apache.solr.SolrTestCaseJ4.checkUpdateU(SolrTestCaseJ4.java:440)
	at org.apache.solr.SolrTestCaseJ4.assertU(SolrTestCaseJ4.java:419)
	at org.apache.solr.SolrTestCaseJ4.assertU(SolrTestCaseJ4.java:413)
	at org.apache.solr.SolrTestCaseJ4.clearIndex(SolrTestCaseJ4.java:785)
	at org.apache.solr.handler.dataimport.TestSqlEntityProcessorDelta2.setUp(TestSqlEntityProcessorDelta2.java:68)
	at sun.reflect.NativeMethodAccessorImpl.invoke0(Native Method)
	at sun.reflect.NativeMethodAccessorImpl.invoke(NativeMethodAccessorImpl.java:39)
	at sun.reflect.DelegatingMethodAccessorImpl.invoke(DelegatingMethodAccessorImpl.java:25)
	at java.lang.reflect.Method.invoke(Method.java:597)
	at com.carrotsearch.randomizedtesting.RandomizedRunner.invoke(RandomizedRunner.java:1995)
	at com.carrotsearch.randomizedtesting.RandomizedRunner.access$1100(RandomizedRunner.java:132)
	at com.carrotsearch.randomizedtesting.RandomizedRunner$7.evaluate(RandomizedRunner.java:875)
	at com.carrotsearch.randomizedtesting.RandomizedRunner$8.evaluate(RandomizedRunner.java:891)
	at com.carrotsearch.randomizedtesting.rules.SystemPropertiesRestoreRule$1.evaluate(SystemPropertiesRestoreRule.java:53)
	at org.apache.lucene.util.TestRuleSetupTeardownChained$1.evaluate(TestRuleSetupTeardownChained.java:50)
	at org.apache.lucene.util.TestRuleFieldCacheSanity$1.evaluate(TestRuleFieldCacheSanity.java:32)
	at org.apache.lucene.util.AbstractBeforeAfterRule$1.evaluate(AbstractBeforeAfterRule.java:45)
	at com.carrotsearch.randomizedtesting.rules.SystemPropertiesInvariantRule$1.evaluate(SystemPropertiesInvariantRule.java:55)
	at org.apache.lucene.util.TestRuleReportUncaughtExceptions$1.evaluate(TestRuleReportUncaughtExceptions.java:68)
	at org.apache.lucene.util.TestRuleThreadAndTestName$1.evaluate(TestRuleThreadAndTestName.java:48)
	at org.apache.lucene.util.TestRuleIgnoreAfterMaxFailures$1.evaluate(TestRuleIgnoreAfterMaxFailures.java:70)
	at org.apache.lucene.util.TestRuleMarkFailure$1.evaluate(TestRuleMarkFailure.java:48)
	at com.carrotsearch.randomizedtesting.RandomizedRunner.runSingleTest(RandomizedRunner.java:825)
	at com.carrotsearch.randomizedtesting.RandomizedRunner.access$700(RandomizedRunner.java:132)
	at com.carrotsearch.randomizedtesting.RandomizedRunner$3$1.run(RandomizedRunner.java:671)
	at com.carrotsearch.randomizedtesting.RandomizedRunner$3.evaluate(RandomizedRunner.java:697)
	at com.carrotsearch.randomizedtesting.RandomizedRunner$4.evaluate(RandomizedRunner.java:736)
	at com.carrotsearch.randomizedtesting.RandomizedRunner$5.evaluate(RandomizedRunner.java:747)
	at com.carrotsearch.randomizedtesting.rules.SystemPropertiesRestoreRule$1.evaluate(SystemPropertiesRestoreRule.java:53)
	at org.apache.lucene.util.AbstractBeforeAfterRule$1.evaluate(AbstractBeforeAfterRule.java:45)
	at org.apache.lucene.util.TestRuleReportUncaughtExceptions$1.evaluate(TestRuleReportUncaughtExceptions.java:68)
	at org.apache.lucene.util.TestRuleStoreClassName$1.evaluate(TestRuleStoreClassName.java:38)
	at org.apache.lucene.util.TestRuleIcuHack$1.evaluate(TestRuleIcuHack.java:51)
	at com.carrotsearch.randomizedtesting.rules.SystemPropertiesInvariantRule$1.evaluate(SystemPropertiesInvariantRule.java:55)
	at org.apache.lucene.util.TestRuleNoInstanceHooksOverrides$1.evaluate(TestRuleNoInstanceHooksOverrides.java:53)
	at org.apache.lucene.util.TestRuleNoStaticHooksShadowing$1.evaluate(TestRuleNoStaticHooksShadowing.java:52)
	at org.apache.lucene.util.TestRuleAssertionsRequired$1.evaluate(TestRuleAssertionsRequired.java:36)
	at org.apache.lucene.util.TestRuleMarkFailure$1.evaluate(TestRuleMarkFailure.java:48)
	at org.apache.lucene.util.TestRuleIgnoreAfterMaxFailures$1.evaluate(TestRuleIgnoreAfterMaxFailures.java:70)
	at org.apache.lucene.util.TestRuleIgnoreTestSuites$1.evaluate(TestRuleIgnoreTestSuites.java:55)
	at com.carrotsearch.randomizedtesting.RandomizedRunner.runSuite(RandomizedRunner.java:605)
	at com.carrotsearch.randomizedtesting.RandomizedRunner.access$400(RandomizedRunner.java:132)
	at com.carrotsearch.randomizedtesting.RandomizedRunner$2.run(RandomizedRunner.java:551)
Caused by: org.apache.lucene.store.AlreadyClosedException: this IndexWriter is closed
	at org.apache.lucene.index.IndexWriter.ensureOpen(IndexWriter.java:553)
	at org.apache.lucene.index.IndexWriter.ensureOpen(IndexWriter.java:558)
	at org.apache.lucene.index.IndexWriter.deleteAll(IndexWriter.java:1883)
	at org.apache.solr.update.DirectUpdateHandler2.deleteAll(DirectUpdateHandler2.java:142)
	at org.apache.solr.update.DirectUpdateHandler2.deleteByQuery(DirectUpdateHandler2.java:361)
	at org.apache.solr.update.processor.RunUpdateProcessor.processDelete(RunUpdateProcessorFactory.java:67)
	at org.apache.solr.update.processor.UpdateRequestProcessor.processDelete(UpdateRequestProcessor.java:55)
	at org.apache.solr.update.processor.DistributedUpdateProcessor.doDeleteByQuery(DistributedUpdateProcessor.java:733)
	at org.apache.solr.update.processor.DistributedUpdateProcessor.processDelete(DistributedUpdateProcessor.java:606)
	at org.apache.solr.update.processor.UpdateRequestProcessor.processDelete(UpdateRequestProcessor.java:55)
	at org.apache.solr.handler.dataimport.AbstractDataImportHandlerTestCase$TestUpdateRequestProcessor.processDelete(AbstractDataImportHandlerTestCase.java:364)
	at org.apache.solr.handler.loader.XMLLoader.processDelete(XMLLoader.java:330)
	at org.apache.solr.handler.loader.XMLLoader.processUpdate(XMLLoader.java:261)
	at org.apache.solr.handler.loader.XMLLoader.load(XMLLoader.java:157)
	at org.apache.solr.handler.UpdateRequestHandler$1.load(UpdateRequestHandler.java:92)
	at org.apache.solr.handler.ContentStreamHandlerBase.handleRequestBody(ContentStreamHandlerBase.java:74)
	at org.apache.solr.handler.RequestHandlerBase.handleRequest(RequestHandlerBase.java:129)
	at org.apache.solr.core.SolrCore.execute(SolrCore.java:1624)
	at org.apache.solr.servlet.DirectSolrConnection.request(DirectSolrConnection.java:131)
	at org.apache.solr.util.TestHarness.update(TestHarness.java:244)
	... 45 more


REGRESSION:  org.apache.solr.handler.dataimport.TestSqlEntityProcessorDelta2.testCompositePk_DeltaImport_add

Error Message:
org.apache.lucene.store.AlreadyClosedException: this IndexWriter is closed

Stack Trace:
org.apache.solr.common.SolrException: org.apache.lucene.store.AlreadyClosedException: this IndexWriter is closed
	at __randomizedtesting.SeedInfo.seed([89D3329D540FF084:5B35E7C7EE2523CF]:0)
	at org.apache.solr.util.TestHarness.update(TestHarness.java:248)
	at org.apache.solr.util.TestHarness.checkUpdateStatus(TestHarness.java:294)
	at org.apache.solr.util.TestHarness.validateUpdate(TestHarness.java:264)
	at org.apache.solr.SolrTestCaseJ4.checkUpdateU(SolrTestCaseJ4.java:440)
	at org.apache.solr.SolrTestCaseJ4.assertU(SolrTestCaseJ4.java:419)
	at org.apache.solr.SolrTestCaseJ4.assertU(SolrTestCaseJ4.java:413)
	at org.apache.solr.SolrTestCaseJ4.clearIndex(SolrTestCaseJ4.java:785)
	at org.apache.solr.handler.dataimport.TestSqlEntityProcessorDelta2.setUp(TestSqlEntityProcessorDelta2.java:68)
	at sun.reflect.NativeMethodAccessorImpl.invoke0(Native Method)
	at sun.reflect.NativeMethodAccessorImpl.invoke(NativeMethodAccessorImpl.java:39)
	at sun.reflect.DelegatingMethodAccessorImpl.invoke(DelegatingMethodAccessorImpl.java:25)
	at java.lang.reflect.Method.invoke(Method.java:597)
	at com.carrotsearch.randomizedtesting.RandomizedRunner.invoke(RandomizedRunner.java:1995)
	at com.carrotsearch.randomizedtesting.RandomizedRunner.access$1100(RandomizedRunner.java:132)
	at com.carrotsearch.randomizedtesting.RandomizedRunner$7.evaluate(RandomizedRunner.java:875)
	at com.carrotsearch.randomizedtesting.RandomizedRunner$8.evaluate(RandomizedRunner.java:891)
	at com.carrotsearch.randomizedtesting.rules.SystemPropertiesRestoreRule$1.evaluate(SystemPropertiesRestoreRule.java:53)
	at org.apache.lucene.util.TestRuleSetupTeardownChained$1.evaluate(TestRuleSetupTeardownChained.java:50)
	at org.apache.lucene.util.TestRuleFieldCacheSanity$1.evaluate(TestRuleFieldCacheSanity.java:32)
	at org.apache.lucene.util.AbstractBeforeAfterRule$1.evaluate(AbstractBeforeAfterRule.java:45)
	at com.carrotsearch.randomizedtesting.rules.SystemPropertiesInvariantRule$1.evaluate(SystemPropertiesInvariantRule.java:55)
	at org.apache.lucene.util.TestRuleReportUncaughtExceptions$1.evaluate(TestRuleReportUncaughtExceptions.java:68)
	at org.apache.lucene.util.TestRuleThreadAndTestName$1.evaluate(TestRuleThreadAndTestName.java:48)
	at org.apache.lucene.util.TestRuleIgnoreAfterMaxFailures$1.evaluate(TestRuleIgnoreAfterMaxFailures.java:70)
	at org.apache.lucene.util.TestRuleMarkFailure$1.evaluate(TestRuleMarkFailure.java:48)
	at com.carrotsearch.randomizedtesting.RandomizedRunner.runSingleTest(RandomizedRunner.java:825)
	at com.carrotsearch.randomizedtesting.RandomizedRunner.access$700(RandomizedRunner.java:132)
	at com.carrotsearch.randomizedtesting.RandomizedRunner$3$1.run(RandomizedRunner.java:671)
	at com.carrotsearch.randomizedtesting.RandomizedRunner$3.evaluate(RandomizedRunner.java:697)
	at com.carrotsearch.randomizedtesting.RandomizedRunner$4.evaluate(RandomizedRunner.java:736)
	at com.carrotsearch.randomizedtesting.RandomizedRunner$5.evaluate(RandomizedRunner.java:747)
	at com.carrotsearch.randomizedtesting.rules.SystemPropertiesRestoreRule$1.evaluate(SystemPropertiesRestoreRule.java:53)
	at org.apache.lucene.util.AbstractBeforeAfterRule$1.evaluate(AbstractBeforeAfterRule.java:45)
	at org.apache.lucene.util.TestRuleReportUncaughtExceptions$1.evaluate(TestRuleReportUncaughtExceptions.java:68)
	at org.apache.lucene.util.TestRuleStoreClassName$1.evaluate(TestRuleStoreClassName.java:38)
	at org.apache.lucene.util.TestRuleIcuHack$1.evaluate(TestRuleIcuHack.java:51)
	at com.carrotsearch.randomizedtesting.rules.SystemPropertiesInvariantRule$1.evaluate(SystemPropertiesInvariantRule.java:55)
	at org.apache.lucene.util.TestRuleNoInstanceHooksOverrides$1.evaluate(TestRuleNoInstanceHooksOverrides.java:53)
	at org.apache.lucene.util.TestRuleNoStaticHooksShadowing$1.evaluate(TestRuleNoStaticHooksShadowing.java:52)
	at org.apache.lucene.util.TestRuleAssertionsRequired$1.evaluate(TestRuleAssertionsRequired.java:36)
	at org.apache.lucene.util.TestRuleMarkFailure$1.evaluate(TestRuleMarkFailure.java:48)
	at org.apache.lucene.util.TestRuleIgnoreAfterMaxFailures$1.evaluate(TestRuleIgnoreAfterMaxFailures.java:70)
	at org.apache.lucene.util.TestRuleIgnoreTestSuites$1.evaluate(TestRuleIgnoreTestSuites.java:55)
	at com.carrotsearch.randomizedtesting.RandomizedRunner.runSuite(RandomizedRunner.java:605)
	at com.carrotsearch.randomizedtesting.RandomizedRunner.access$400(RandomizedRunner.java:132)
	at com.carrotsearch.randomizedtesting.RandomizedRunner$2.run(RandomizedRunner.java:551)
Caused by: org.apache.lucene.store.AlreadyClosedException: this IndexWriter is closed
	at org.apache.lucene.index.IndexWriter.ensureOpen(IndexWriter.java:553)
	at org.apache.lucene.index.IndexWriter.ensureOpen(IndexWriter.java:558)
	at org.apache.lucene.index.IndexWriter.deleteAll(IndexWriter.java:1883)
	at org.apache.solr.update.DirectUpdateHandler2.deleteAll(DirectUpdateHandler2.java:142)
	at org.apache.solr.update.DirectUpdateHandler2.deleteByQuery(DirectUpdateHandler2.java:361)
	at org.apache.solr.update.processor.RunUpdateProcessor.processDelete(RunUpdateProcessorFactory.java:67)
	at org.apache.solr.update.processor.UpdateRequestProcessor.processDelete(UpdateRequestProcessor.java:55)
	at org.apache.solr.update.processor.DistributedUpdateProcessor.doDeleteByQuery(DistributedUpdateProcessor.java:733)
	at org.apache.solr.update.processor.DistributedUpdateProcessor.processDelete(DistributedUpdateProcessor.java:606)
	at org.apache.solr.update.processor.UpdateRequestProcessor.processDelete(UpdateRequestProcessor.java:55)
	at org.apache.solr.handler.dataimport.AbstractDataImportHandlerTestCase$TestUpdateRequestProcessor.processDelete(AbstractDataImportHandlerTestCase.java:364)
	at org.apache.solr.handler.loader.XMLLoader.processDelete(XMLLoader.java:330)
	at org.apache.solr.handler.loader.XMLLoader.processUpdate(XMLLoader.java:261)
	at org.apache.solr.handler.loader.XMLLoader.load(XMLLoader.java:157)
	at org.apache.solr.handler.UpdateRequestHandler$1.load(UpdateRequestHandler.java:92)
	at org.apache.solr.handler.ContentStreamHandlerBase.handleRequestBody(ContentStreamHandlerBase.java:74)
	at org.apache.solr.handler.RequestHandlerBase.handleRequest(RequestHandlerBase.java:129)
	at org.apache.solr.core.SolrCore.execute(SolrCore.java:1624)
	at org.apache.solr.servlet.DirectSolrConnection.request(DirectSolrConnection.java:131)
	at org.apache.solr.util.TestHarness.update(TestHarness.java:244)
	... 45 more




Build Log:
[...truncated 9038 lines...]
[junit4:junit4] Suite: org.apache.solr.handler.dataimport.TestSqlEntityProcessorDelta2
[junit4:junit4]    > (@BeforeClass output)
[junit4:junit4]   2> 0 T84 oas.SolrTestCaseJ4.initCore ####initCore
[junit4:junit4]   2> Creating dataDir: /mnt/ssd/jenkins/workspace/Lucene-Solr-4.x-Linux-Java6-64/checkout/solr/build/contrib/solr-dataimporthandler/test/J0/./solrtest-TestSqlEntityProcessorDelta2-1342970956089
[junit4:junit4]   2> 1 T84 oasc.SolrResourceLoader.<init> new SolrResourceLoader for directory: '/mnt/ssd/jenkins/workspace/Lucene-Solr-4.x-Linux-Java6-64/checkout/solr/build/contrib/solr-dataimporthandler/test-files/dih/solr/collection1/'
[junit4:junit4]   2> 25 T84 oasc.SolrConfig.<init> Using Lucene MatchVersion: LUCENE_40
[junit4:junit4]   2> 64 T84 oasc.SolrConfig.<init> Loaded SolrConfig: dataimport-solrconfig.xml
[junit4:junit4]   2> 64 T84 oass.IndexSchema.readSchema Reading Solr Schema
[junit4:junit4]   2> 72 T84 oass.IndexSchema.readSchema Schema name=test
[junit4:junit4]   2> 194 T84 oass.IndexSchema.readSchema default search field in schema is desc
[junit4:junit4]   2> 195 T84 oass.IndexSchema.readSchema query parser default operator is OR
[junit4:junit4]   2> 197 T84 oass.IndexSchema.readSchema unique key field: solr_id
[junit4:junit4]   2> 199 T84 oasc.SolrResourceLoader.locateSolrHome JNDI not configured for solr (NoInitialContextEx)
[junit4:junit4]   2> 199 T84 oasc.SolrResourceLoader.locateSolrHome using system property solr.solr.home: /mnt/ssd/jenkins/workspace/Lucene-Solr-4.x-Linux-Java6-64/checkout/solr/build/contrib/solr-dataimporthandler/test-files/dih/solr
[junit4:junit4]   2> 200 T84 oasc.SolrResourceLoader.<init> new SolrResourceLoader for directory: '/mnt/ssd/jenkins/workspace/Lucene-Solr-4.x-Linux-Java6-64/checkout/solr/build/contrib/solr-dataimporthandler/test-files/dih/solr/'
[junit4:junit4]   2> 200 T84 oasc.CoreContainer.<init> New CoreContainer 1156690526
[junit4:junit4]   2> 201 T84 oasc.SolrCore.<init> [collection1] Opening new SolrCore at /mnt/ssd/jenkins/workspace/Lucene-Solr-4.x-Linux-Java6-64/checkout/solr/build/contrib/solr-dataimporthandler/test-files/dih/solr/collection1/, dataDir=/mnt/ssd/jenkins/workspace/Lucene-Solr-4.x-Linux-Java6-64/checkout/solr/build/contrib/solr-dataimporthandler/test/J0/./solrtest-TestSqlEntityProcessorDelta2-1342970956089/
[junit4:junit4]   2> 201 T84 oasc.SolrCore.<init> JMX monitoring not detected for core: collection1
[junit4:junit4]   2> 202 T84 oasc.SolrCore.initListeners [collection1] Added SolrEventListener for newSearcher: org.apache.solr.core.QuerySenderListener{queries=[{q=solr,start=0,rows=10}, {q=rocks,start=0,rows=10}, {q=static newSearcher warming query from solrconfig.xml}]}
[junit4:junit4]   2> 202 T84 oasc.SolrCore.initListeners [collection1] Added SolrEventListener for firstSearcher: org.apache.solr.core.QuerySenderListener{queries=[]}
[junit4:junit4]   2> 203 T84 oasc.SolrCore.getNewIndexDir WARNING New index directory detected: old=null new=/mnt/ssd/jenkins/workspace/Lucene-Solr-4.x-Linux-Java6-64/checkout/solr/build/contrib/solr-dataimporthandler/test/J0/./solrtest-TestSqlEntityProcessorDelta2-1342970956089/index/
[junit4:junit4]   2> 204 T84 oasc.SolrCore.initIndex WARNING [collection1] Solr index directory '/mnt/ssd/jenkins/workspace/Lucene-Solr-4.x-Linux-Java6-64/checkout/solr/build/contrib/solr-dataimporthandler/test/J0/./solrtest-TestSqlEntityProcessorDelta2-1342970956089/index' doesn't exist. Creating new index...
[junit4:junit4]   2> 215 T84 oasc.SolrDeletionPolicy.onCommit SolrDeletionPolicy.onCommit: commits:num=1
[junit4:junit4]   2> 		commit{dir=MockDirWrapper(org.apache.lucene.store.RAMDirectory@3403f5a0 lockFactory=org.apache.lucene.store.NativeFSLockFactory@2025b64d),segFN=segments_1,generation=1,filenames=[segments_1]
[junit4:junit4]   2> 215 T84 oasc.SolrDeletionPolicy.updateCommits newest commit = 1
[junit4:junit4]   2> 216 T84 oasup.UpdateRequestProcessorChain.init inserting DistributedUpdateProcessorFactory into updateRequestProcessorChain "" (default)
[junit4:junit4]   2> 217 T84 oasc.RequestHandlers.initHandlersFromConfig created standard: solr.StandardRequestHandler
[junit4:junit4]   2> 217 T84 oasc.RequestHandlers.initHandlersFromConfig created /dataimport: org.apache.solr.handler.dataimport.DataImportHandler
[junit4:junit4]   2> 218 T84 oasc.RequestHandlers.initHandlersFromConfig created /search: org.apache.solr.handler.component.SearchHandler
[junit4:junit4]   2> 218 T84 oasc.RequestHandlers.initHandlersFromConfig created /update: solr.UpdateRequestHandler
[junit4:junit4]   2> 219 T84 oashl.XMLLoader.init xsltCacheLifetimeSeconds=60
[junit4:junit4]   2> 223 T84 oass.SolrIndexSearcher.<init> Opening Searcher@3850620f main
[junit4:junit4]   2> 224 T84 oass.SolrIndexSearcher.getIndexDir WARNING WARNING: Directory impl does not support setting indexDir: org.apache.lucene.store.MockDirectoryWrapper
[junit4:junit4]   2> 225 T84 oasu.CommitTracker.<init> Hard AutoCommit: disabled
[junit4:junit4]   2> 225 T84 oasu.CommitTracker.<init> Soft AutoCommit: disabled
[junit4:junit4]   2> 226 T84 oashc.HttpShardHandlerFactory.getParameter Setting socketTimeout to: 0
[junit4:junit4]   2> 226 T84 oashc.HttpShardHandlerFactory.getParameter Setting urlScheme to: http://
[junit4:junit4]   2> 226 T84 oashc.HttpShardHandlerFactory.getParameter Setting connTimeout to: 0
[junit4:junit4]   2> 227 T84 oashc.HttpShardHandlerFactory.getParameter Setting maxConnectionsPerHost to: 20
[junit4:junit4]   2> 228 T84 oashc.HttpShardHandlerFactory.getParameter Setting corePoolSize to: 0
[junit4:junit4]   2> 228 T84 oashc.HttpShardHandlerFactory.getParameter Setting maximumPoolSize to: 2147483647
[junit4:junit4]   2> 231 T84 oashc.HttpShardHandlerFactory.getParameter Setting maxThreadIdleTime to: 5
[junit4:junit4]   2> 231 T84 oashc.HttpShardHandlerFactory.getParameter Setting sizeOfQueue to: -1
[junit4:junit4]   2> 231 T84 oashc.HttpShardHandlerFactory.getParameter Setting fairnessPolicy to: false
[junit4:junit4]   2> 231 T84 oascsi.HttpClientUtil.createClient Creating new http client, config:maxConnectionsPerHost=20&maxConnections=10000&socketTimeout=0&connTimeout=0&retry=false
[junit4:junit4]   2> 234 T84 oasc.CoreContainer.register registering core: collection1
[junit4:junit4]   2> 235 T85 oasc.QuerySenderListener.newSearcher QuerySenderListener sending requests to Searcher@3850620f main{StandardDirectoryReader(segments_1:1)}
[junit4:junit4]   2> 241 T85 oasc.QuerySenderListener.newSearcher QuerySenderListener done.
[junit4:junit4]   2> 241 T85 oasc.SolrCore.registerSearcher [collection1] Registered new searcher Searcher@3850620f main{StandardDirectoryReader(segments_1:1)}
[junit4:junit4]   2> 241 T84 oas.SolrTestCaseJ4.initCore ####initCore end
[junit4:junit4]   2> 
[junit4:junit4] ERROR   0.05s J0 | TestSqlEntityProcessorDelta2.testCompositePk_DeltaImport_empty
[junit4:junit4]    > Throwable #1: org.apache.solr.common.SolrException: org.apache.lucene.store.AlreadyClosedException: this IndexWriter is closed
[junit4:junit4]    > 	at __randomizedtesting.SeedInfo.seed([89D3329D540FF084:4ED0A9F2F59AAD86]:0)
[junit4:junit4]    > 	at org.apache.solr.util.TestHarness.update(TestHarness.java:248)
[junit4:junit4]    > 	at org.apache.solr.util.TestHarness.checkUpdateStatus(TestHarness.java:294)
[junit4:junit4]    > 	at org.apache.solr.util.TestHarness.validateUpdate(TestHarness.java:264)
[junit4:junit4]    > 	at org.apache.solr.SolrTestCaseJ4.checkUpdateU(SolrTestCaseJ4.java:440)
[junit4:junit4]    > 	at org.apache.solr.SolrTestCaseJ4.assertU(SolrTestCaseJ4.java:419)
[junit4:junit4]    > 	at org.apache.solr.SolrTestCaseJ4.assertU(SolrTestCaseJ4.java:413)
[junit4:junit4]    > 	at org.apache.solr.SolrTestCaseJ4.clearIndex(SolrTestCaseJ4.java:785)
[junit4:junit4]    > 	at org.apache.solr.handler.dataimport.TestSqlEntityProcessorDelta2.setUp(TestSqlEntityProcessorDelta2.java:68)
[junit4:junit4]    > 	at sun.reflect.NativeMethodAccessorImpl.invoke0(Native Method)
[junit4:junit4]    > 	at sun.reflect.NativeMethodAccessorImpl.invoke(NativeMethodAccessorImpl.java:39)
[junit4:junit4]    > 	at sun.reflect.DelegatingMethodAccessorImpl.invoke(DelegatingMethodAccessorImpl.java:25)
[junit4:junit4]    > 	at java.lang.reflect.Method.invoke(Method.java:597)
[junit4:junit4]    > 	at com.carrotsearch.randomizedtesting.RandomizedRunner.invoke(RandomizedRunner.java:1995)
[junit4:junit4]    > 	at com.carrotsearch.randomizedtesting.RandomizedRunner.access$1100(RandomizedRunner.java:132)
[junit4:junit4]    > 	at com.carrotsearch.randomizedtesting.RandomizedRunner$7.evaluate(RandomizedRunner.java:875)
[junit4:junit4]    > 	at com.carrotsearch.randomizedtesting.RandomizedRunner$8.evaluate(RandomizedRunner.java:891)
[junit4:junit4]    > 	at com.carrotsearch.randomizedtesting.rules.SystemPropertiesRestoreRule$1.evaluate(SystemPropertiesRestoreRule.java:53)
[junit4:junit4]    > 	at org.apache.lucene.util.TestRuleSetupTeardownChained$1.evaluate(TestRuleSetupTeardownChained.java:50)
[junit4:junit4]    > 	at org.apache.lucene.util.TestRuleFieldCacheSanity$1.evaluate(TestRuleFieldCacheSanity.java:32)
[junit4:junit4]    > 	at org.apache.lucene.util.AbstractBeforeAfterRule$1.evaluate(AbstractBeforeAfterRule.java:45)
[junit4:junit4]    > 	at com.carrotsearch.randomizedtesting.rules.SystemPropertiesInvariantRule$1.evaluate(SystemPropertiesInvariantRule.java:55)
[junit4:junit4]    > 	at org.apache.lucene.util.TestRuleReportUncaughtExceptions$1.evaluate(TestRuleReportUncaughtExceptions.java:68)
[junit4:junit4]    > 	at org.apache.lucene.util.TestRuleThreadAndTestName$1.evaluate(TestRuleThreadAndTestName.java:48)
[junit4:junit4]    > 	at org.apache.lucene.util.TestRuleIgnoreAfterMaxFailures$1.evaluate(TestRuleIgnoreAfterMaxFailures.java:70)
[junit4:junit4]    > 	at org.apache.lucene.util.TestRuleMarkFailure$1.evaluate(TestRuleMarkFailure.java:48)
[junit4:junit4]    > 	at com.carrotsearch.randomizedtesting.RandomizedRunner.runSingleTest(RandomizedRunner.java:825)
[junit4:junit4]    > 	at com.carrotsearch.randomizedtesting.RandomizedRunner.access$700(RandomizedRunner.java:132)
[junit4:junit4]    > 	at com.carrotsearch.randomizedtesting.RandomizedRunner$3$1.run(RandomizedRunner.java:671)
[junit4:junit4]    > 	at com.carrotsearch.randomizedtesting.RandomizedRunner$3.evaluate(RandomizedRunner.java:697)
[junit4:junit4]    > 	at com.carrotsearch.randomizedtesting.RandomizedRunner$4.evaluate(RandomizedRunner.java:736)
[junit4:junit4]    > 	at com.carrotsearch.randomizedtesting.RandomizedRunner$5.evaluate(RandomizedRunner.java:747)
[junit4:junit4]    > 	at com.carrotsearch.randomizedtesting.rules.SystemPropertiesRestoreRule$1.evaluate(SystemPropertiesRestoreRule.java:53)
[junit4:junit4]    > 	at org.apache.lucene.util.AbstractBeforeAfterRule$1.evaluate(AbstractBeforeAfterRule.java:45)
[junit4:junit4]    > 	at org.apache.lucene.util.TestRuleReportUncaughtExceptions$1.evaluate(TestRuleReportUncaughtExceptions.java:68)
[junit4:junit4]    > 	at org.apache.lucene.util.TestRuleStoreClassName$1.evaluate(TestRuleStoreClassName.java:38)
[junit4:junit4]    > 	at org.apache.lucene.util.TestRuleIcuHack$1.evaluate(TestRuleIcuHack.java:51)
[junit4:junit4]    > 	at com.carrotsearch.randomizedtesting.rules.SystemPropertiesInvariantRule$1.evaluate(SystemPropertiesInvariantRule.java:55)
[junit4:junit4]    > 	at org.apache.lucene.util.TestRuleNoInstanceHooksOverrides$1.evaluate(TestRuleNoInstanceHooksOverrides.java:53)
[junit4:junit4]    > 	at org.apache.lucene.util.TestRuleNoStaticHooksShadowing$1.evaluate(TestRuleNoStaticHooksShadowing.java:52)
[junit4:junit4]    > 	at org.apache.lucene.util.TestRuleAssertionsRequired$1.evaluate(TestRuleAssertionsRequired.java:36)
[junit4:junit4]    > 	at org.apache.lucene.util.TestRuleMarkFailure$1.evaluate(TestRuleMarkFailure.java:48)
[junit4:junit4]    > 	at org.apache.lucene.util.TestRuleIgnoreAfterMaxFailures$1.evaluate(TestRuleIgnoreAfterMaxFailures.java:70)
[junit4:junit4]    > 	at org.apache.lucene.util.TestRuleIgnoreTestSuites$1.evaluate(TestRuleIgnoreTestSuites.java:55)
[junit4:junit4]    > 	at com.carrotsearch.randomizedtesting.RandomizedRunner.runSuite(RandomizedRunner.java:605)
[junit4:junit4]    > 	at com.carrotsearch.randomizedtesting.RandomizedRunner.access$400(RandomizedRunner.java:132)
[junit4:junit4]    > 	at com.carrotsearch.randomizedtesting.RandomizedRunner$2.run(RandomizedRunner.java:551)
[junit4:junit4]    > Caused by: org.apache.lucene.store.AlreadyClosedException: this IndexWriter is closed
[junit4:junit4]    > 	at org.apache.lucene.index.IndexWriter.ensureOpen(IndexWriter.java:553)
[junit4:junit4]    > 	at org.apache.lucene.index.IndexWriter.ensureOpen(IndexWriter.java:558)
[junit4:junit4]    > 	at org.apache.lucene.index.IndexWriter.deleteAll(IndexWriter.java:1883)
[junit4:junit4]    > 	at org.apache.solr.update.DirectUpdateHandler2.deleteAll(DirectUpdateHandler2.java:142)
[junit4:junit4]    > 	at org.apache.solr.update.DirectUpdateHandler2.deleteByQuery(DirectUpdateHandler2.java:361)
[junit4:junit4]    > 	at org.apache.solr.update.processor.RunUpdateProcessor.processDelete(RunUpdateProcessorFactory.java:67)
[junit4:junit4]    > 	at org.apache.solr.update.processor.UpdateRequestProcessor.processDelete(UpdateRequestProcessor.java:55)
[junit4:junit4]    > 	at org.apache.solr.update.processor.DistributedUpdateProcessor.doDeleteByQuery(DistributedUpdateProcessor.java:733)
[junit4:junit4]    > 	at org.apache.solr.update.processor.DistributedUpdateProcessor.processDelete(DistributedUpdateProcessor.java:606)
[junit4:junit4]    > 	at org.apache.solr.update.processor.UpdateRequestProcessor.processDelete(UpdateRequestProcessor.java:55)
[junit4:junit4]    > 	at org.apache.solr.handler.dataimport.AbstractDataImportHandlerTestCase$TestUpdateRequestProcessor.processDelete(AbstractDataImportHandlerTestCase.java:364)
[junit4:junit4]    > 	at org.apache.solr.handler.loader.XMLLoader.processDelete(XMLLoader.java:330)
[junit4:junit4]    > 	at org.apache.solr.handler.loader.XMLLoader.processUpdate(XMLLoader.java:261)
[junit4:junit4]    > 	at org.apache.solr.handler.loader.XMLLoader.load(XMLLoader.java:157)
[junit4:junit4]    > 	at org.apache.solr.handler.UpdateRequestHandler$1.load(UpdateRequestHandler.java:92)
[junit4:junit4]    > 	at org.apache.solr.handler.ContentStreamHandlerBase.handleRequestBody(ContentStreamHandlerBase.java:74)
[junit4:junit4]    > 	at org.apache.solr.handler.RequestHandlerBase.handleRequest(RequestHandlerBase.java:129)
[junit4:junit4]    > 	at org.apache.solr.core.SolrCore.execute(SolrCore.java:1624)
[junit4:junit4]    > 	at org.apache.solr.servlet.DirectSolrConnection.request(DirectSolrConnection.java:131)
[junit4:junit4]    > 	at org.apache.solr.util.TestHarness.update(TestHarness.java:244)
[junit4:junit4]    > 	... 45 more
[junit4:junit4]    > 
[junit4:junit4]   2> 383 T84 oas.SolrTestCaseJ4.setUp ###Starting testCompositePk_DeltaImport_empty
[junit4:junit4]   2> 387 T84 C11 oasu.DirectUpdateHandler2.deleteAll [collection1] REMOVING ALL DOCUMENTS FROM INDEX
[junit4:junit4]   2> 387 T84 C11 UPDATE [collection1] webapp=null path=null params={} {} 0 1
[junit4:junit4]   2> 388 T84 C11 oasc.SolrException.log SEVERE org.apache.lucene.store.AlreadyClosedException: this IndexWriter is closed
[junit4:junit4]   2> 		at org.apache.lucene.index.IndexWriter.ensureOpen(IndexWriter.java:553)
[junit4:junit4]   2> 		at org.apache.lucene.index.IndexWriter.ensureOpen(IndexWriter.java:558)
[junit4:junit4]   2> 		at org.apache.lucene.index.IndexWriter.deleteAll(IndexWriter.java:1883)
[junit4:junit4]   2> 		at org.apache.solr.update.DirectUpdateHandler2.deleteAll(DirectUpdateHandler2.java:142)
[junit4:junit4]   2> 		at org.apache.solr.update.DirectUpdateHandler2.deleteByQuery(DirectUpdateHandler2.java:361)
[junit4:junit4]   2> 		at org.apache.solr.update.processor.RunUpdateProcessor.processDelete(RunUpdateProcessorFactory.java:67)
[junit4:junit4]   2> 		at org.apache.solr.update.processor.UpdateRequestProcessor.processDelete(UpdateRequestProcessor.java:55)
[junit4:junit4]   2> 		at org.apache.solr.update.processor.DistributedUpdateProcessor.doDeleteByQuery(DistributedUpdateProcessor.java:733)
[junit4:junit4]   2> 		at org.apache.solr.update.processor.DistributedUpdateProcessor.processDelete(DistributedUpdateProcessor.java:606)
[junit4:junit4]   2> 		at org.apache.solr.update.processor.UpdateRequestProcessor.processDelete(UpdateRequestProcessor.java:55)
[junit4:junit4]   2> 		at org.apache.solr.handler.dataimport.AbstractDataImportHandlerTestCase$TestUpdateRequestProcessor.processDelete(AbstractDataImportHandlerTestCase.java:364)
[junit4:junit4]   2> 		at org.apache.solr.handler.loader.XMLLoader.processDelete(XMLLoader.java:330)
[junit4:junit4]   2> 		at org.apache.solr.handler.loader.XMLLoader.processUpdate(XMLLoader.java:261)
[junit4:junit4]   2> 		at org.apache.solr.handler.loader.XMLLoader.load(XMLLoader.java:157)
[junit4:junit4]   2> 		at org.apache.solr.handler.UpdateRequestHandler$1.load(UpdateRequestHandler.java:92)
[junit4:junit4]   2> 		at org.apache.solr.handler.ContentStreamHandlerBase.handleRequestBody(ContentStreamHandlerBase.java:74)
[junit4:junit4]   2> 		at org.apache.solr.handler.RequestHandlerBase.handleRequest(RequestHandlerBase.java:129)
[junit4:junit4]   2> 		at org.apache.solr.core.SolrCore.execute(SolrCore.java:1624)
[junit4:junit4]   2> 		at org.apache.solr.servlet.DirectSolrConnection.request(DirectSolrConnection.java:131)
[junit4:junit4]   2> 		at org.apache.solr.util.TestHarness.update(TestHarness.java:244)
[junit4:junit4]   2> 		at org.apache.solr.util.TestHarness.checkUpdateStatus(TestHarness.java:294)
[junit4:junit4]   2> 		at org.apache.solr.util.TestHarness.validateUpdate(TestHarness.java:264)
[junit4:junit4]   2> 		at org.apache.solr.SolrTestCaseJ4.checkUpdateU(SolrTestCaseJ4.java:440)
[junit4:junit4]   2> 		at org.apache.solr.SolrTestCaseJ4.assertU(SolrTestCaseJ4.java:419)
[junit4:junit4]   2> 		at org.apache.solr.SolrTestCaseJ4.assertU(SolrTestCaseJ4.java:413)
[junit4:junit4]   2> 		at org.apache.solr.SolrTestCaseJ4.clearIndex(SolrTestCaseJ4.java:785)
[junit4:junit4]   2> 		at org.apache.solr.handler.dataimport.TestSqlEntityProcessorDelta2.setUp(TestSqlEntityProcessorDelta2.java:68)
[junit4:junit4]   2> 		at sun.reflect.NativeMethodAccessorImpl.invoke0(Native Method)
[junit4:junit4]   2> 		at sun.reflect.NativeMethodAccessorImpl.invoke(NativeMethodAccessorImpl.java:39)
[junit4:junit4]   2> 		at sun.reflect.DelegatingMethodAccessorImpl.invoke(DelegatingMethodAccessorImpl.java:25)
[junit4:junit4]   2> 		at java.lang.reflect.Method.invoke(Method.java:597)
[junit4:junit4]   2> 		at com.carrotsearch.randomizedtesting.RandomizedRunner.invoke(RandomizedRunner.java:1995)
[junit4:junit4]   2> 		at com.carrotsearch.randomizedtesting.RandomizedRunner.access$1100(RandomizedRunner.java:132)
[junit4:junit4]   2> 		at com.carrotsearch.randomizedtesting.RandomizedRunner$7.evaluate(RandomizedRunner.java:875)
[junit4:junit4]   2> 		at com.carrotsearch.randomizedtesting.RandomizedRunner$8.evaluate(RandomizedRunner.java:891)
[junit4:junit4]   2> 		at com.carrotsearch.randomizedtesting.rules.SystemPropertiesRestoreRule$1.evaluate(SystemPropertiesRestoreRule.java:53)
[junit4:junit4]   2> 		at org.apache.lucene.util.TestRuleSetupTeardownChained$1.evaluate(TestRuleSetupTeardownChained.java:50)
[junit4:junit4]   2> 		at org.apache.lucene.util.TestRuleFieldCacheSanity$1.evaluate(TestRuleFieldCacheSanity.java:32)
[junit4:junit4]   2> 		at org.apache.lucene.util.AbstractBeforeAfterRule$1.evaluate(AbstractBeforeAfterRule.java:45)
[junit4:junit4]   2> 		at com.carrotsearch.randomizedtesting.rules.SystemPropertiesInvariantRule$1.evaluate(SystemPropertiesInvariantRule.java:55)
[junit4:junit4]   2> 		at org.apache.lucene.util.TestRuleReportUncaughtExceptions$1.evaluate(TestRuleReportUncaughtExceptions.java:68)
[junit4:junit4]   2> 		at org.apache.lucene.util.TestRuleThreadAndTestName$1.evaluate(TestRuleThreadAndTestName.java:48)
[junit4:junit4]   2> 		at org.apache.lucene.util.TestRuleIgnoreAfterMaxFailures$1.evaluate(TestRuleIgnoreAfterMaxFailures.java:70)
[junit4:junit4]   2> 		at org.apache.lucene.util.TestRuleMarkFailure$1.evaluate(TestRuleMarkFailure.java:48)
[junit4:junit4]   2> 		at com.carrotsearch.randomizedtesting.RandomizedRunner.runSingleTest(RandomizedRunner.java:825)
[junit4:junit4]   2> 		at com.carrotsearch.randomizedtesting.RandomizedRunner.access$700(RandomizedRunner.java:132)
[junit4:junit4]   2> 		at com.carrotsearch.randomizedtesting.RandomizedRunner$3$1.run(RandomizedRunner.java:671)
[junit4:junit4]   2> 		at com.carrotsearch.randomizedtesting.RandomizedRunner$3.evaluate(RandomizedRunner.java:697)
[junit4:junit4]   2> 		at com.carrotsearch.randomizedtesting.RandomizedRunner$4.evaluate(RandomizedRunner.java:736)
[junit4:junit4]   2> 		at com.carrotsearch.randomizedtesting.RandomizedRunner$5.evaluate(RandomizedRunner.java:747)
[junit4:junit4]   2> 		at com.carrotsearch.randomizedtesting.rules.SystemPropertiesRestoreRule$1.evaluate(SystemPropertiesRestoreRule.java:53)
[junit4:junit4]   2> 		at org.apache.lucene.util.AbstractBeforeAfterRule$1.evaluate(AbstractBeforeAfterRule.java:45)
[junit4:junit4]   2> 		at org.apache.lucene.util.TestRuleReportUncaughtExceptions$1.evaluate(TestRuleReportUncaughtExceptions.java:68)
[junit4:junit4]   2> 		at org.apache.lucene.util.TestRuleStoreClassName$1.evaluate(TestRuleStoreClassName.java:38)
[junit4:junit4]   2> 		at org.apache.lucene.util.TestRuleIcuHack$1.evaluate(TestRuleIcuHack.java:51)
[junit4:junit4]   2> 		at com.carrotsearch.randomizedtesting.rules.SystemPropertiesInvariantRule$1.evaluate(SystemPropertiesInvariantRule.java:55)
[junit4:junit4]   2> 		at org.apache.lucene.util.TestRuleNoInstanceHooksOverrides$1.evaluate(TestRuleNoInstanceHooksOverrides.java:53)
[junit4:junit4]   2> 		at org.apache.lucene.util.TestRuleNoStaticHooksShadowing$1.evaluate(TestRuleNoStaticHooksShadowing.java:52)
[junit4:junit4]   2> 		at org.apache.lucene.util.TestRuleAssertionsRequired$1.evaluate(TestRuleAssertionsRequired.java:36)
[junit4:junit4]   2> 		at org.apache.lucene.util.TestRuleMarkFailure$1.evaluate(TestRuleMarkFailure.java:48)
[junit4:junit4]   2> 		at org.apache.lucene.util.TestRuleIgnoreAfterMaxFailures$1.evaluate(TestRuleIgnoreAfterMaxFailures.java:70)
[junit4:junit4]   2> 		at org.apache.lucene.util.TestRuleIgnoreTestSuites$1.evaluate(TestRuleIgnoreTestSuites.java:55)
[junit4:junit4]   2> 		at com.carrotsearch.randomizedtesting.RandomizedRunner.runSuite(RandomizedRunner.java:605)
[junit4:junit4]   2> 		at com.carrotsearch.randomizedtesting.RandomizedRunner.access$400(RandomizedRunner.java:132)
[junit4:junit4]   2> 		at com.carrotsearch.randomizedtesting.RandomizedRunner$2.run(RandomizedRunner.java:551)
[junit4:junit4]   2> 	
[junit4:junit4]   2> 389 T84 oashd.AbstractDataImportHandlerTestCase.tearDown Looking for dataimport.properties at: /mnt/ssd/jenkins/workspace/Lucene-Solr-4.x-Linux-Java6-64/checkout/solr/build/contrib/solr-dataimporthandler/test/J0/solr/collection1/conf/dataimport.properties
[junit4:junit4]   2> 390 T84 oas.SolrTestCaseJ4.tearDown ###Ending testCompositePk_DeltaImport_empty
[junit4:junit4]   2> NOTE: reproduce with: ant test  -Dtestcase=TestSqlEntityProcessorDelta2 -Dtests.method=testCompositePk_DeltaImport_empty -Dtests.seed=89D3329D540FF084 -Dtests.multiplier=3 -Dtests.slow=true -Dtests.locale=mk -Dtests.timezone=Australia/South -Dtests.file.encoding=ISO-8859-1
[junit4:junit4]   2>
[junit4:junit4] ERROR   0.02s J0 | TestSqlEntityProcessorDelta2.testCompositePk_DeltaImport_add_delete
[junit4:junit4]    > Throwable #1: org.apache.solr.common.SolrException: org.apache.lucene.store.AlreadyClosedException: this IndexWriter is closed
[junit4:junit4]    > 	at __randomizedtesting.SeedInfo.seed([89D3329D540FF084:5B721AF2DD08FB76]:0)
[junit4:junit4]    > 	at org.apache.solr.util.TestHarness.update(TestHarness.java:248)
[junit4:junit4]    > 	at org.apache.solr.util.TestHarness.checkUpdateStatus(TestHarness.java:294)
[junit4:junit4]    > 	at org.apache.solr.util.TestHarness.validateUpdate(TestHarness.java:264)
[junit4:junit4]    > 	at org.apache.solr.SolrTestCaseJ4.checkUpdateU(SolrTestCaseJ4.java:440)
[junit4:junit4]    > 	at org.apache.solr.SolrTestCaseJ4.assertU(SolrTestCaseJ4.java:419)
[junit4:junit4]    > 	at org.apache.solr.SolrTestCaseJ4.assertU(SolrTestCaseJ4.java:413)
[junit4:junit4]    > 	at org.apache.solr.SolrTestCaseJ4.clearIndex(SolrTestCaseJ4.java:785)
[junit4:junit4]    > 	at org.apache.solr.handler.dataimport.TestSqlEntityProcessorDelta2.setUp(TestSqlEntityProcessorDelta2.java:68)
[junit4:junit4]    > 	at sun.reflect.NativeMethodAccessorImpl.invoke0(Native Method)
[junit4:junit4]    > 	at sun.reflect.NativeMethodAccessorImpl.invoke(NativeMethodAccessorImpl.java:39)
[junit4:junit4]    > 	at sun.reflect.DelegatingMethodAccessorImpl.invoke(DelegatingMethodAccessorImpl.java:25)
[junit4:junit4]    > 	at java.lang.reflect.Method.invoke(Method.java:597)
[junit4:junit4]    > 	at com.carrotsearch.randomizedtesting.RandomizedRunner.invoke(RandomizedRunner.java:1995)
[junit4:junit4]    > 	at com.carrotsearch.randomizedtesting.RandomizedRunner.access$1100(RandomizedRunner.java:132)
[junit4:junit4]    > 	at com.carrotsearch.randomizedtesting.RandomizedRunner$7.evaluate(RandomizedRunner.java:875)
[junit4:junit4]    > 	at com.carrotsearch.randomizedtesting.RandomizedRunner$8.evaluate(RandomizedRunner.java:891)
[junit4:junit4]    > 	at com.carrotsearch.randomizedtesting.rules.SystemPropertiesRestoreRule$1.evaluate(SystemPropertiesRestoreRule.java:53)
[junit4:junit4]    > 	at org.apache.lucene.util.TestRuleSetupTeardownChained$1.evaluate(TestRuleSetupTeardownChained.java:50)
[junit4:junit4]    > 	at org.apache.lucene.util.TestRuleFieldCacheSanity$1.evaluate(TestRuleFieldCacheSanity.java:32)
[junit4:junit4]    > 	at org.apache.lucene.util.AbstractBeforeAfterRule$1.evaluate(AbstractBeforeAfterRule.java:45)
[junit4:junit4]    > 	at com.carrotsearch.randomizedtesting.rules.SystemPropertiesInvariantRule$1.evaluate(SystemPropertiesInvariantRule.java:55)
[junit4:junit4]    > 	at org.apache.lucene.util.TestRuleReportUncaughtExceptions$1.evaluate(TestRuleReportUncaughtExceptions.java:68)
[junit4:junit4]    > 	at org.apache.lucene.util.TestRuleThreadAndTestName$1.evaluate(TestRuleThreadAndTestName.java:48)
[junit4:junit4]    > 	at org.apache.lucene.util.TestRuleIgnoreAfterMaxFailures$1.evaluate(TestRuleIgnoreAfterMaxFailures.java:70)
[junit4:junit4]    > 	at org.apache.lucene.util.TestRuleMarkFailure$1.evaluate(TestRuleMarkFailure.java:48)
[junit4:junit4]    > 	at com.carrotsearch.randomizedtesting.RandomizedRunner.runSingleTest(RandomizedRunner.java:825)
[junit4:junit4]    > 	at com.carrotsearch.randomizedtesting.RandomizedRunner.access$700(RandomizedRunner.java:132)
[junit4:junit4]    > 	at com.carrotsearch.randomizedtesting.RandomizedRunner$3$1.run(RandomizedRunner.java:671)
[junit4:junit4]    > 	at com.carrotsearch.randomizedtesting.RandomizedRunner$3.evaluate(RandomizedRunner.java:697)
[junit4:junit4]    > 	at com.carrotsearch.randomizedtesting.RandomizedRunner$4.evaluate(RandomizedRunner.java:736)
[junit4:junit4]    > 	at com.carrotsearch.randomizedtesting.RandomizedRunner$5.evaluate(RandomizedRunner.java:747)
[junit4:junit4]    > 	at com.carrotsearch.randomizedtesting.rules.SystemPropertiesRestoreRule$1.evaluate(SystemPropertiesRestoreRule.java:53)
[junit4:junit4]    > 	at org.apache.lucene.util.AbstractBeforeAfterRule$1.evaluate(AbstractBeforeAfterRule.java:45)
[junit4:junit4]    > 	at org.apache.lucene.util.TestRuleReportUncaughtExceptions$1.evaluate(TestRuleReportUncaughtExceptions.java:68)
[junit4:junit4]    > 	at org.apache.lucene.util.TestRuleStoreClassName$1.evaluate(TestRuleStoreClassName.java:38)
[junit4:junit4]    > 	at org.apache.lucene.util.TestRuleIcuHack$1.evaluate(TestRuleIcuHack.java:51)
[junit4:junit4]    > 	at com.carrotsearch.randomizedtesting.rules.SystemPropertiesInvariantRule$1.evaluate(SystemPropertiesInvariantRule.java:55)
[junit4:junit4]    > 	at org.apache.lucene.util.TestRuleNoInstanceHooksOverrides$1.evaluate(TestRuleNoInstanceHooksOverrides.java:53)
[junit4:junit4]    > 	at org.apache.lucene.util.TestRuleNoStaticHooksShadowing$1.evaluate(TestRuleNoStaticHooksShadowing.java:52)
[junit4:junit4]    > 	at org.apache.lucene.util.TestRuleAssertionsRequired$1.evaluate(TestRuleAssertionsRequired.java:36)
[junit4:junit4]    > 	at org.apache.lucene.util.TestRuleMarkFailure$1.evaluate(TestRuleMarkFailure.java:48)
[junit4:junit4]    > 	at org.apache.lucene.util.TestRuleIgnoreAfterMaxFailures$1.evaluate(TestRuleIgnoreAfterMaxFailures.java:70)
[junit4:junit4]    > 	at org.apache.lucene.util.TestRuleIgnoreTestSuites$1.evaluate(TestRuleIgnoreTestSuites.java:55)
[junit4:junit4]    > 	at com.carrotsearch.randomizedtesting.RandomizedRunner.runSuite(RandomizedRunner.java:605)
[junit4:junit4]    > 	at com.carrotsearch.randomizedtesting.RandomizedRunner.access$400(RandomizedRunner.java:132)
[junit4:junit4]    > 	at com.carrotsearch.randomizedtesting.RandomizedRunner$2.run(RandomizedRunner.java:551)
[junit4:junit4]    > Caused by: org.apache.lucene.store.AlreadyClosedException: this IndexWriter is closed
[junit4:junit4]    > 	at org.apache.lucene.index.IndexWriter.ensureOpen(IndexWriter.java:553)
[junit4:junit4]    > 	at org.apache.lucene.index.IndexWriter.ensureOpen(IndexWriter.java:558)
[junit4:junit4]    > 	at org.apache.lucene.index.IndexWriter.deleteAll(IndexWriter.java:1883)
[junit4:junit4]    > 	at org.apache.solr.update.DirectUpdateHandler2.deleteAll(DirectUpdateHandler2.java:142)
[junit4:junit4]    > 	at org.apache.solr.update.DirectUpdateHandler2.deleteByQuery(DirectUpdateHandler2.java:361)
[junit4:junit4]    > 	at org.apache.solr.update.processor.RunUpdateProcessor.processDelete(RunUpdateProcessorFactory.java:67)
[junit4:junit4]    > 	at org.apache.solr.update.processor.UpdateRequestProcessor.processDelete(UpdateRequestProcessor.java:55)
[junit4:junit4]    > 	at org.apache.solr.update.processor.DistributedUpdateProcessor.doDeleteByQuery(DistributedUpdateProcessor.java:733)
[junit4:junit4]    > 	at org.apache.solr.update.processor.DistributedUpdateProcessor.processDelete(DistributedUpdateProcessor.java:606)
[junit4:junit4]    > 	at org.apache.solr.update.processor.UpdateRequestProcessor.processDelete(UpdateRequestProcessor.java:55)
[junit4:junit4]    > 	at org.apache.solr.handler.dataimport.AbstractDataImportHandlerTestCase$TestUpdateRequestProcessor.processDelete(AbstractDataImportHandlerTestCase.java:364)
[junit4:junit4]    > 	at org.apache.solr.handler.loader.XMLLoader.processDelete(XMLLoader.java:330)
[junit4:junit4]    > 	at org.apache.solr.handler.loader.XMLLoader.processUpdate(XMLLoader.java:261)
[junit4:junit4]    > 	at org.apache.solr.handler.loader.XMLLoader.load(XMLLoader.java:157)
[junit4:junit4]    > 	at org.apache.solr.handler.UpdateRequestHandler$1.load(UpdateRequestHandler.java:92)
[junit4:junit4]    > 	at org.apache.solr.handler.ContentStreamHandlerBase.handleRequestBody(ContentStreamHandlerBase.java:74)
[junit4:junit4]    > 	at org.apache.solr.handler.RequestHandlerBase.handleRequest(RequestHandlerBase.java:129)
[junit4:junit4]    > 	at org.apache.solr.core.SolrCore.execute(SolrCore.java:1624)
[junit4:junit4]    > 	at org.apache.solr.servlet.DirectSolrConnection.request(DirectSolrConnection.java:131)
[junit4:junit4]    > 	at org.apache.solr.util.TestHarness.update(TestHarness.java:244)
[junit4:junit4]    > 	... 45 more
[junit4:junit4]    > 
[junit4:junit4]   2> 433 T84 oas.SolrTestCaseJ4.setUp ###Starting testCompositePk_DeltaImport_add_delete
[junit4:junit4]   2> 437 T84 C11 oasu.DirectUpdateHandler2.deleteAll [collection1] REMOVING ALL DOCUMENTS FROM INDEX
[junit4:junit4]   2> 437 T84 C11 UPDATE [collection1] webapp=null path=null params={} {} 0 1
[junit4:junit4]   2> 438 T84 C11 oasc.SolrException.log SEVERE org.apache.lucene.store.AlreadyClosedException: this IndexWriter is closed
[junit4:junit4]   2> 		at org.apache.lucene.index.IndexWriter.ensureOpen(IndexWriter.java:553)
[junit4:junit4]   2> 		at org.apache.lucene.index.IndexWriter.ensureOpen(IndexWriter.java:558)
[junit4:junit4]   2> 		at org.apache.lucene.index.IndexWriter.deleteAll(IndexWriter.java:1883)
[junit4:junit4]   2> 		at org.apache.solr.update.DirectUpdateHandler2.deleteAll(DirectUpdateHandler2.java:142)
[junit4:junit4]   2> 		at org.apache.solr.update.DirectUpdateHandler2.deleteByQuery(DirectUpdateHandler2.java:361)
[junit4:junit4]   2> 		at org.apache.solr.update.processor.RunUpdateProcessor.processDelete(RunUpdateProcessorFactory.java:67)
[junit4:junit4]   2> 		at org.apache.solr.update.processor.UpdateRequestProcessor.processDelete(UpdateRequestProcessor.java:55)
[junit4:junit4]   2> 		at org.apache.solr.update.processor.DistributedUpdateProcessor.doDeleteByQuery(DistributedUpdateProcessor.java:733)
[junit4:junit4]   2> 		at org.apache.solr.update.processor.DistributedUpdateProcessor.processDelete(DistributedUpdateProcessor.java:606)
[junit4:junit4]   2> 		at org.apache.solr.update.processor.UpdateRequestProcessor.processDelete(UpdateRequestProcessor.java:55)
[junit4:junit4]   2> 		at org.apache.solr.handler.dataimport.AbstractDataImportHandlerTestCase$TestUpdateRequestProcessor.processDelete(AbstractDataImportHandlerTestCase.java:364)
[junit4:junit4]   2> 		at org.apache.solr.handler.loader.XMLLoader.processDelete(XMLLoader.java:330)
[junit4:junit4]   2> 		at org.apache.solr.handler.loader.XMLLoader.processUpdate(XMLLoader.java:261)
[junit4:junit4]   2> 		at org.apache.solr.handler.loader.XMLLoader.load(XMLLoader.java:157)
[junit4:junit4]   2> 		at org.apache.solr.handler.UpdateRequestHandler$1.load(UpdateRequestHandler.java:92)
[junit4:junit4]   2> 		at org.apache.solr.handler.ContentStreamHandlerBase.handleRequestBody(ContentStreamHandlerBase.java:74)
[junit4:junit4]   2> 		at org.apache.solr.handler.RequestHandlerBase.handleRequest(RequestHandlerBase.java:129)
[junit4:junit4]   2> 		at org.apache.solr.core.SolrCore.execute(SolrCore.java:1624)
[junit4:junit4]   2> 		at org.apache.solr.servlet.DirectSolrConnection.request(DirectSolrConnection.java:131)
[junit4:junit4]   2> 		at org.apache.solr.util.TestHarness.update(TestHarness.java:244)
[junit4:junit4]   2> 		at org.apache.solr.util.TestHarness.checkUpdateStatus(TestHarness.java:294)
[junit4:junit4]   2> 		at org.apache.solr.util.TestHarness.validateUpdate(TestHarness.java:264)
[junit4:junit4]   2> 		at org.apache.solr.SolrTestCaseJ4.checkUpdateU(SolrTestCaseJ4.java:440)
[junit4:junit4]   2> 		at org.apache.solr.SolrTestCaseJ4.assertU(SolrTestCaseJ4.java:419)
[junit4:junit4]   2> 		at org.apache.solr.SolrTestCaseJ4.assertU(SolrTestCaseJ4.java:413)
[junit4:junit4]   2> 		at org.apache.solr.SolrTestCaseJ4.clearIndex(SolrTestCaseJ4.java:785)
[junit4:junit4]   2> 		at org.apache.solr.handler.dataimport.TestSqlEntityProcessorDelta2.setUp(TestSqlEntityProcessorDelta2.java:68)
[junit4:junit4]   2> 		at sun.reflect.NativeMethodAccessorImpl.invoke0(Native Method)
[junit4:junit4]   2> 		at sun.reflect.NativeMethodAccessorImpl.invoke(NativeMethodAccessorImpl.java:39)
[junit4:junit4]   2> 		at sun.reflect.DelegatingMethodAccessorImpl.invoke(DelegatingMethodAccessorImpl.java:25)
[junit4:junit4]   2> 		at java.lang.reflect.Method.invoke(Method.java:597)
[junit4:junit4]   2> 		at com.carrotsearch.randomizedtesting.RandomizedRunner.invoke(RandomizedRunner.java:1995)
[junit4:junit4]   2> 		at com.carrotsearch.randomizedtesting.RandomizedRunner.access$1100(RandomizedRunner.java:132)
[junit4:junit4]   2> 		at com.carrotsearch.randomizedtesting.RandomizedRunner$7.evaluate(RandomizedRunner.java:875)
[junit4:junit4]   2> 		at com.carrotsearch.randomizedtesting.RandomizedRunner$8.evaluate(RandomizedRunner.java:891)
[junit4:junit4]   2> 		at com.carrotsearch.randomizedtesting.rules.SystemPropertiesRestoreRule$1.evaluate(SystemPropertiesRestoreRule.java:53)
[junit4:junit4]   2> 		at org.apache.lucene.util.TestRuleSetupTeardownChained$1.evaluate(TestRuleSetupTeardownChained.java:50)
[junit4:junit4]   2> 		at org.apache.lucene.util.TestRuleFieldCacheSanity$1.evaluate(TestRuleFieldCacheSanity.java:32)
[junit4:junit4]   2> 		at org.apache.lucene.util.AbstractBeforeAfterRule$1.evaluate(AbstractBeforeAfterRule.java:45)
[junit4:junit4]   2> 		at com.carrotsearch.randomizedtesting.rules.SystemPropertiesInvariantRule$1.evaluate(SystemPropertiesInvariantRule.java:55)
[junit4:junit4]   2> 		at org.apache.lucene.util.TestRuleReportUncaughtExceptions$1.evaluate(TestRuleReportUncaughtExceptions.java:68)
[junit4:junit4]   2> 		at org.apache.lucene.util.TestRuleThreadAndTestName$1.evaluate(TestRuleThreadAndTestName.java:48)
[junit4:junit4]   2> 		at org.apache.lucene.util.TestRuleIgnoreAfterMaxFailures$1.evaluate(TestRuleIgnoreAfterMaxFailures.java:70)
[junit4:junit4]   2> 		at org.apache.lucene.util.TestRuleMarkFailure$1.evaluate(TestRuleMarkFailure.java:48)
[junit4:junit4]   2> 		at com.carrotsearch.randomizedtesting.RandomizedRunner.runSingleTest(RandomizedRunner.java:825)
[junit4:junit4]   2> 		at com.carrotsearch.randomizedtesting.RandomizedRunner.access$700(RandomizedRunner.java:132)
[junit4:junit4]   2> 		at com.carrotsearch.randomizedtesting.RandomizedRunner$3$1.run(RandomizedRunner.java:671)
[junit4:junit4]   2> 		at com.carrotsearch.randomizedtesting.RandomizedRunner$3.evaluate(RandomizedRunner.java:697)
[junit4:junit4]   2> 		at com.carrotsearch.randomizedtesting.RandomizedRunner$4.evaluate(RandomizedRunner.java:736)
[junit4:junit4]   2> 		at com.carrotsearch.randomizedtesting.RandomizedRunner$5.evaluate(RandomizedRunner.java:747)
[junit4:junit4]   2> 		at com.carrotsearch.randomizedtesting.rules.SystemPropertiesRestoreRule$1.evaluate(SystemPropertiesRestoreRule.java:53)
[junit4:junit4]   2> 		at org.apache.lucene.util.AbstractBeforeAfterRule$1.evaluate(AbstractBeforeAfterRule.java:45)
[junit4:junit4]   2> 		at org.apache.lucene.util.TestRuleReportUncaughtExceptions$1.evaluate(TestRuleReportUncaughtExceptions.java:68)
[junit4:junit4]   2> 		at org.apache.lucene.util.TestRuleStoreClassName$1.evaluate(TestRuleStoreClassName.java:38)
[junit4:junit4]   2> 		at org.apache.lucene.util.TestRuleIcuHack$1.evaluate(TestRuleIcuHack.java:51)
[junit4:junit4]   2> 		at com.carrotsearch.randomizedtesting.rules.SystemPropertiesInvariantRule$1.evaluate(SystemPropertiesInvariantRule.java:55)
[junit4:junit4]   2> 		at org.apache.lucene.util.TestRuleNoInstanceHooksOverrides$1.evaluate(TestRuleNoInstanceHooksOverrides.java:53)
[junit4:junit4]   2> 		at org.apache.lucene.util.TestRuleNoStaticHooksShadowing$1.evaluate(TestRuleNoStaticHooksShadowing.java:52)
[junit4:junit4]   2> 		at org.apache.lucene.util.TestRuleAssertionsRequired$1.evaluate(TestRuleAssertionsRequired.java:36)
[junit4:junit4]   2> 		at org.apache.lucene.util.TestRuleMarkFailure$1.evaluate(TestRuleMarkFailure.java:48)
[junit4:junit4]   2> 		at org.apache.lucene.util.TestRuleIgnoreAfterMaxFailures$1.evaluate(TestRuleIgnoreAfterMaxFailures.java:70)
[junit4:junit4]   2> 		at org.apache.lucene.util.TestRuleIgnoreTestSuites$1.evaluate(TestRuleIgnoreTestSuites.java:55)
[junit4:junit4]   2> 		at com.carrotsearch.randomizedtesting.RandomizedRunner.runSuite(RandomizedRunner.java:605)
[junit4:junit4]   2> 		at com.carrotsearch.randomizedtesting.RandomizedRunner.access$400(RandomizedRunner.java:132)
[junit4:junit4]   2> 		at com.carrotsearch.randomizedtesting.RandomizedRunner$2.run(RandomizedRunner.java:551)
[junit4:junit4]   2> 	
[junit4:junit4]   2> 439 T84 oashd.AbstractDataImportHandlerTestCase.tearDown Looking for dataimport.properties at: /mnt/ssd/jenkins/workspace/Lucene-Solr-4.x-Linux-Java6-64/checkout/solr/build/contrib/solr-dataimporthandler/test/J0/solr/collection1/conf/dataimport.properties
[junit4:junit4]   2> 440 T84 oas.SolrTestCaseJ4.tearDown ###Ending testCompositePk_DeltaImport_add_delete
[junit4:junit4]   2> NOTE: reproduce with: ant test  -Dtestcase=TestSqlEntityProcessorDelta2 -Dtests.method=testCompositePk_DeltaImport_add_delete -Dtests.seed=89D3329D540FF084 -Dtests.multiplier=3 -Dtests.slow=true -Dtests.locale=mk -Dtests.timezone=Australia/South -Dtests.file.encoding=ISO-8859-1
[junit4:junit4]   2>
[junit4:junit4] ERROR   0.04s J0 | TestSqlEntityProcessorDelta2.testCompositePk_DeltaImport_delete
[junit4:junit4]    > Throwable #1: org.apache.solr.common.SolrException: org.apache.lucene.store.AlreadyClosedException: this IndexWriter is closed
[junit4:junit4]    > 	at __randomizedtesting.SeedInfo.seed([89D3329D540FF084:A8EEC4833172D8E8]:0)
[junit4:junit4]    > 	at org.apache.solr.util.TestHarness.update(TestHarness.java:248)
[junit4:junit4]    > 	at org.apache.solr.util.TestHarness.checkUpdateStatus(TestHarness.java:294)
[junit4:junit4]    > 	at org.apache.solr.util.TestHarness.validateUpdate(TestHarness.java:264)
[junit4:junit4]    > 	at org.apache.solr.SolrTestCaseJ4.checkUpdateU(SolrTestCaseJ4.java:440)
[junit4:junit4]    > 	at org.apache.solr.SolrTestCaseJ4.assertU(SolrTestCaseJ4.java:419)
[junit4:junit4]    > 	at org.apache.solr.SolrTestCaseJ4.assertU(SolrTestCaseJ4.java:413)
[junit4:junit4]    > 	at org.apache.solr.SolrTestCaseJ4.clearIndex(SolrTestCaseJ4.java:785)
[junit4:junit4]    > 	at org.apache.solr.handler.dataimport.TestSqlEntityProcessorDelta2.setUp(TestSqlEntityProcessorDelta2.java:68)
[junit4:junit4]    > 	at sun.reflect.NativeMethodAccessorImpl.invoke0(Native Method)
[junit4:junit4]    > 	at sun.reflect.NativeMethodAccessorImpl.invoke(NativeMethodAccessorImpl.java:39)
[junit4:junit4]    > 	at sun.reflect.DelegatingMethodAccessorImpl.invoke(DelegatingMethodAccessorImpl.java:25)
[junit4:junit4]    > 	at java.lang.reflect.Method.invoke(Method.java:597)
[junit4:junit4]    > 	at com.carrotsearch.randomizedtesting.RandomizedRunner.invoke(RandomizedRunner.java:1995)
[junit4:junit4]    > 	at com.carrotsearch.randomizedtesting.RandomizedRunner.access$1100(RandomizedRunner.java:132)
[junit4:junit4]    > 	at com.carrotsearch.randomizedtesting.RandomizedRunner$7.evaluate(RandomizedRunner.java:875)
[junit4:junit4]    > 	at com.carrotsearch.randomizedtesting.RandomizedRunner$8.evaluate(RandomizedRunner.java:891)
[junit4:junit4]    > 	at com.carrotsearch.randomizedtesting.rules.SystemPropertiesRestoreRule$1.evaluate(SystemPropertiesRestoreRule.java:53)
[junit4:junit4]    > 	at org.apache.lucene.util.TestRuleSetupTeardownChained$1.evaluate(TestRuleSetupTeardownChained.java:50)
[junit4:junit4]    > 	at org.apache.lucene.util.TestRuleFieldCacheSanity$1.evaluate(TestRuleFieldCacheSanity.java:32)
[junit4:junit4]    > 	at org.apache.lucene.util.AbstractBeforeAfterRule$1.evaluate(AbstractBeforeAfterRule.java:45)
[junit4:junit4]    > 	at com.carrotsearch.randomizedtesting.rules.SystemPropertiesInvariantRule$1.evaluate(SystemPropertiesInvariantRule.java:55)
[junit4:junit4]    > 	at org.apache.lucene.util.TestRuleReportUncaughtExceptions$1.evaluate(TestRuleReportUncaughtExceptions.java:68)
[junit4:junit4]    > 	at org.apache.lucene.util.TestRuleThreadAndTestName$1.evaluate(TestRuleThreadAndTestName.java:48)
[junit4:junit4]    > 	at org.apache.lucene.util.TestRuleIgnoreAfterMaxFailures$1.evaluate(TestRuleIgnoreAfterMaxFailures.java:70)
[junit4:junit4]    > 	at org.apache.lucene.util.TestRuleMarkFailure$1.evaluate(TestRuleMarkFailure.java:48)
[junit4:junit4]    > 	at com.carrotsearch.randomizedtesting.RandomizedRunner.runSingleTest(RandomizedRunner.java:825)
[junit4:junit4]    > 	at com.carrotsearch.randomizedtesting.RandomizedRunner.access$700(RandomizedRunner.java:132)
[junit4:junit4]    > 	at com.carrotsearch.randomizedtesting.RandomizedRunner$3$1.run(RandomizedRunner.java:671)
[junit4:junit4]    > 	at com.carrotsearch.randomizedtesting.RandomizedRunner$3.evaluate(RandomizedRunner.java:697)
[junit4:junit4]    > 	at com.carrotsearch.randomizedtesting.RandomizedRunner$4.evaluate(RandomizedRunner.java:736)
[junit4:junit4]    > 	at com.carrotsearch.randomizedtesting.RandomizedRunner$5.evaluate(RandomizedRunner.java:747)
[junit4:junit4]    > 	at com.carrotsearch.randomizedtesting.rules.SystemPropertiesRestoreRule$1.evaluate(SystemPropertiesRestoreRule.java:53)
[junit4:junit4]    > 	at org.apache.lucene.util.AbstractBeforeAfterRule$1.evaluate(AbstractBeforeAfterRule.java:45)
[junit4:junit4]    > 	at org.apache.lucene.util.TestRuleReportUncaughtExceptions$1.evaluate(TestRuleReportUncaughtExceptions.java:68)
[junit4:junit4]    > 	at org.apache.lucene.util.TestRuleStoreClassName$1.evaluate(TestRuleStoreClassName.java:38)
[junit4:junit4]    > 	at org.apache.lucene.util.TestRuleIcuHack$1.evaluate(TestRuleIcuHack.java:51)
[junit4:junit4]    > 	at com.carrotsearch.randomizedtesting.rules.SystemPropertiesInvariantRule$1.evaluate(SystemPropertiesInvariantRule.java:55)
[junit4:junit4]    > 	at org.apache.lucene.util.TestRuleNoInstanceHooksOverrides$1.evaluate(TestRuleNoInstanceHooksOverrides.java:53)
[junit4:junit4]    > 	at org.apache.lucene.util.TestRuleNoStaticHooksShadowing$1.evaluate(TestRuleNoStaticHooksShadowing.java:52)
[junit4:junit4]    > 	at org.apache.lucene.util.TestRuleAssertionsRequired$1.evaluate(TestRuleAssertionsRequired.java:36)
[junit4:junit4]    > 	at org.apache.lucene.util.TestRuleMarkFailure$1.evaluate(TestRuleMarkFailure.java:48)
[junit4:junit4]    > 	at org.apache.lucene.util.TestRuleIgnoreAfterMaxFailures$1.evaluate(TestRuleIgnoreAfterMaxFailures.java:70)
[junit4:junit4]    > 	at org.apache.lucene.util.TestRuleIgnoreTestSuites$1.evaluate(TestRuleIgnoreTestSuites.java:55)
[junit4:junit4]    > 	at com.carrotsearch.randomizedtesting.RandomizedRunner.runSuite(RandomizedRunner.java:605)
[junit4:junit4]    > 	at com.carrotsearch.randomizedtesting.RandomizedRunner.access$400(RandomizedRunner.java:132)
[junit4:junit4]    > 	at com.carrotsearch.randomizedtesting.RandomizedRunner$2.run(RandomizedRunner.java:551)
[junit4:junit4]    > Caused by: org.apache.lucene.store.AlreadyClosedException: this IndexWriter is closed
[junit4:junit4]    > 	at org.apache.lucene.index.IndexWriter.ensureOpen(IndexWriter.java:553)
[junit4:junit4]    > 	at org.apache.lucene.index.IndexWriter.ensureOpen(IndexWriter.java:558)
[junit4:junit4]    > 	at org.apache.lucene.index.IndexWriter.deleteAll(IndexWriter.java:1883)
[junit4:junit4]    > 	at org.apache.solr.update.DirectUpdateHandler2.deleteAll(DirectUpdateHandler2.java:142)
[junit4:junit4]    > 	at org.apache.solr.update.DirectUpdateHandler2.deleteByQuery(DirectUpdateHandler2.java:361)
[junit4:junit4]    > 	at org.apache.solr.update.processor.RunUpdateProcessor.processDelete(RunUpdateProcessorFactory.java:67)
[junit4:junit4]    > 	at org.apache.solr.update.processor.UpdateRequestProcessor.processDelete(UpdateRequestProcessor.java:55)
[junit4:junit4]    > 	at org.apache.solr.update.processor.DistributedUpdateProcessor.doDeleteByQuery(DistributedUpdateProcessor.java:733)
[junit4:junit4]    > 	at org.apache.solr.update.processor.DistributedUpdateProcessor.processDelete(DistributedUpdateProcessor.java:606)
[junit4:junit4]    > 	at org.apache.solr.update.processor.UpdateRequestProcessor.processDelete(UpdateRequestProcessor.java:55)
[junit4:junit4]    > 	at org.apache.solr.handler.dataimport.AbstractDataImportHandlerTestCase$TestUpdateRequestProcessor.processDelete(AbstractDataImportHandlerTestCase.java:364)
[junit4:junit4]    > 	at org.apache.solr.handler.loader.XMLLoader.processDelete(XMLLoader.java:330)
[junit4:junit4]    > 	at org.apache.solr.handler.loader.XMLLoader.processUpdate(XMLLoader.java:261)
[junit4:junit4]    > 	at org.apache.solr.handler.loader.XMLLoader.load(XMLLoader.java:157)
[junit4:junit4]    > 	at org.apache.solr.handler.UpdateRequestHandler$1.load(UpdateRequestHandler.java:92)
[junit4:junit4]    > 	at org.apache.solr.handler.ContentStreamHandlerBase.handleRequestBody(ContentStreamHandlerBase.java:74)
[junit4:junit4]    > 	at org.apache.solr.handler.RequestHandlerBase.handleRequest(RequestHandlerBase.java:129)
[junit4:junit4]    > 	at org.apache.solr.core.SolrCore.execute(SolrCore.java:1624)
[junit4:junit4]    > 	at org.apache.solr.servlet.DirectSolrConnection.request(DirectSolrConnection.java:131)
[junit4:junit4]    > 	at org.apache.solr.util.TestHarness.update(TestHarness.java:244)
[junit4:junit4]    > 	... 45 more
[junit4:junit4]    > 
[junit4:junit4]   2> 455 T84 oas.SolrTestCaseJ4.setUp ###Starting testCompositePk_DeltaImport_delete
[junit4:junit4]   2> 460 T84 C11 oasu.DirectUpdateHandler2.deleteAll [collection1] REMOVING ALL DOCUMENTS FROM INDEX
[junit4:junit4]   2> 461 T84 C11 UPDATE [collection1] webapp=null path=null params={} {} 0 1
[junit4:junit4]   2> 463 T84 C11 oasc.SolrException.log SEVERE org.apache.lucene.store.AlreadyClosedException: this IndexWriter is closed
[junit4:junit4]   2> 		at org.apache.lucene.index.IndexWriter.ensureOpen(IndexWriter.java:553)
[junit4:junit4]   2> 		at org.apache.lucene.index.IndexWriter.ensureOpen(IndexWriter.java:558)
[junit4:junit4]   2> 		at org.apache.lucene.index.IndexWriter.deleteAll(IndexWriter.java:1883)
[junit4:junit4]   2> 		at org.apache.solr.update.DirectUpdateHandler2.deleteAll(DirectUpdateHandler2.java:142)
[junit4:junit4]   2> 		at org.apache.solr.update.DirectUpdateHandler2.deleteByQuery(DirectUpdateHandler2.java:361)
[junit4:junit4]   2> 		at org.apache.solr.update.processor.RunUpdateProcessor.processDelete(RunUpdateProcessorFactory.java:67)
[junit4:junit4]   2> 		at org.apache.solr.update.processor.UpdateRequestProcessor.processDelete(UpdateRequestProcessor.java:55)
[junit4:junit4]   2> 		at org.apache.solr.update.processor.DistributedUpdateProcessor.doDeleteByQuery(DistributedUpdateProcessor.java:733)
[junit4:junit4]   2> 		at org.apache.solr.update.processor.DistributedUpdateProcessor.processDelete(DistributedUpdateProcessor.java:606)
[junit4:junit4]   2> 		at org.apache.solr.update.processor.UpdateRequestProcessor.processDelete(UpdateRequestProcessor.java:55)
[junit4:junit4]   2> 		at org.apache.solr.handler.dataimport.AbstractDataImportHandlerTestCase$TestUpdateRequestProcessor.processDelete(AbstractDataImportHandlerTestCase.java:364)
[junit4:junit4]   2> 		at org.apache.solr.handler.loader.XMLLoader.processDelete(XMLLoader.java:330)
[junit4:junit4]   2> 		at org.apache.solr.handler.loader.XMLLoader.processUpdate(XMLLoader.java:261)
[junit4:junit4]   2> 		at org.apache.solr.handler.loader.XMLLoader.load(XMLLoader.java:157)
[junit4:junit4]   2> 		at org.apache.solr.handler.UpdateRequestHandler$1.load(UpdateRequestHandler.java:92)
[junit4:junit4]   2> 		at org.apache.solr.handler.ContentStreamHandlerBase.handleRequestBody(ContentStreamHandlerBase.java:74)
[junit4:junit4]   2> 		at org.apache.solr.handler.RequestHandlerBase.handleRequest(RequestHandlerBase.java:129)
[junit4:junit4]   2> 		at org.apache.solr.core.SolrCore.execute(SolrCore.java:1624)
[junit4:junit4]   2> 		at org.apache.solr.servlet.DirectSolrConnection.request(DirectSolrConnection.java:131)
[junit4:junit4]   2> 		at org.apache.solr.util.TestHarness.update(TestHarness.java:244)
[junit4:junit4]   2> 		at org.apache.solr.util.TestHarness.checkUpdateStatus(TestHarness.java:294)
[junit4:junit4]   2> 		at org.apache.solr.util.TestHarness.validateUpdate(TestHarness.java:264)
[junit4:junit4]   2> 		at org.apache.solr.SolrTestCaseJ4.checkUpdateU(SolrTestCaseJ4.java:440)
[junit4:junit4]   2> 		at org.apache.solr.SolrTestCaseJ4.assertU(SolrTestCaseJ4.java:419)
[junit4:junit4]   2> 		at org.apache.solr.SolrTestCaseJ4.assertU(SolrTestCaseJ4.java:413)
[junit4:junit4]   2> 		at org.apache.solr.SolrTestCaseJ4.clearIndex(SolrTestCaseJ4.java:785)
[junit4:junit4]   2> 		at org.apache.solr.handler.dataimport.TestSqlEntityProcessorDelta2.setUp(TestSqlEntityProcessorDelta2.java:68)
[junit4:junit4]   2> 		at sun.reflect.NativeMethodAccessorImpl.invoke0(Native Method)
[junit4:junit4]   2> 		at sun.reflect.NativeMethodAccessorImpl.invoke(NativeMethodAccessorImpl.java:39)
[junit4:junit4]   2> 		at sun.reflect.DelegatingMethodAccessorImpl.invoke(DelegatingMethodAccessorImpl.java:25)
[junit4:junit4]   2> 		at java.lang.reflect.Method.invoke(Method.java:597)
[junit4:junit4]   2> 		at com.carrotsearch.randomizedtesting.RandomizedRunner.invoke(RandomizedRunner.java:1995)
[junit4:junit4]   2> 		at com.carrotsearch.randomizedtesting.RandomizedRunner.access$1100(RandomizedRunner.java:132)
[junit4:junit4]   2> 		at com.carrotsearch.randomizedtesting.RandomizedRunner$7.evaluate(RandomizedRunner.java:875)
[junit4:junit4]   2> 		at com.carrotsearch.randomizedtesting.RandomizedRunner$8.evaluate(RandomizedRunner.java:891)
[junit4:junit4]   2> 		at com.carrotsearch.randomizedtesting.rules.SystemPropertiesRestoreRule$1.evaluate(SystemPropertiesRestoreRule.java:53)
[junit4:junit4]   2> 		at org.apache.lucene.util.TestRuleSetupTeardownChained$1.evaluate(TestRuleSetupTeardownChained.java:50)
[junit4:junit4]   2> 		at org.apache.lucene.util.TestRuleFieldCacheSanity$1.evaluate(TestRuleFieldCacheSanity.java:32)
[junit4:junit4]   2> 		at org.apache.lucene.util.AbstractBeforeAfterRule$1.evaluate(AbstractBeforeAfterRule.java:45)
[junit4:junit4]   2> 		at com.carrotsearch.randomizedtesting.rules.SystemPropertiesInvariantRule$1.evaluate(SystemPropertiesInvariantRule.java:55)
[junit4:junit4]   2> 		at org.apache.lucene.util.TestRuleReportUncaughtExceptions$1.evaluate(TestRuleReportUncaughtExceptions.java:68)
[junit4:junit4]   2> 		at org.apache.lucene.util.TestRuleThreadAndTestName$1.evaluate(TestRuleThreadAndTestName.java:48)
[junit4:junit4]   2> 		at org.apache.lucene.util.TestRuleIgnoreAfterMaxFailures$1.evaluate(TestRuleIgnoreAfterMaxFailures.java:70)
[junit4:junit4]   2> 		at org.apache.lucene.util.TestRuleMarkFailure$1.evaluate(TestRuleMarkFailure.java:48)
[junit4:junit4]   2> 		at com.carrotsearch.randomizedtesting.RandomizedRunner.runSingleTest(RandomizedRunner.java:825)
[junit4:junit4]   2> 		at com.carrotsearch.randomizedtesting.RandomizedRunner.access$700(RandomizedRunner.java:132)
[junit4:junit4]   2> 		at com.carrotsearch.randomizedtesting.RandomizedRunner$3$1.run(RandomizedRunner.java:671)
[junit4:junit4]   2> 		at com.carrotsearch.randomizedtesting.RandomizedRunner$3.evaluate(RandomizedRunner.java:697)
[junit4:junit4]   2> 		at com.carrotsearch.randomizedtesting.RandomizedRunner$4.evaluate(RandomizedRunner.java:736)
[junit4:junit4]   2> 		at com.carrotsearch.randomizedtesting.RandomizedRunner$5.evaluate(RandomizedRunner.java:747)
[junit4:junit4]   2> 		at com.carrotsearch.randomizedtesting.rules.SystemPropertiesRestoreRule$1.evaluate(SystemPropertiesRestoreRule.java:53)
[junit4:junit4]   2> 		at org.apache.lucene.util.AbstractBeforeAfterRule$1.evaluate(AbstractBeforeAfterRule.java:45)
[junit4:junit4]   2> 		at org.apache.lucene.util.TestRuleReportUncaughtExceptions$1.evaluate(TestRuleReportUncaughtExceptions.java:68)
[junit4:junit4]   2> 		at org.apache.lucene.util.TestRuleStoreClassName$1.evaluate(TestRuleStoreClassName.java:38)
[junit4:junit4]   2> 		at org.apache.lucene.util.TestRuleIcuHack$1.evaluate(TestRuleIcuHack.java:51)
[junit4:junit4]   2> 		at com.carrotsearch.randomizedtesting.rules.SystemPropertiesInvariantRule$1.evaluate(SystemPropertiesInvariantRule.java:55)
[junit4:junit4]   2> 		at org.apache.lucene.util.TestRuleNoInstanceHooksOverrides$1.evaluate(TestRuleNoInstanceHooksOverrides.java:53)
[junit4:junit4]   2> 		at org.apache.lucene.util.TestRuleNoStaticHooksShadowing$1.evaluate(TestRuleNoStaticHooksShadowing.java:52)
[junit4:junit4]   2> 		at org.apache.lucene.util.TestRuleAssertionsRequired$1.evaluate(TestRuleAssertionsRequired.java:36)
[junit4:junit4]   2> 		at org.apache.lucene.util.TestRuleMarkFailure$1.evaluate(TestRuleMarkFailure.java:48)
[junit4:junit4]   2> 		at org.apache.lucene.util.TestRuleIgnoreAfterMaxFailures$1.evaluate(TestRuleIgnoreAfterMaxFailures.java:70)
[junit4:junit4]   2> 		at org.apache.lucene.util.TestRuleIgnoreTestSuites$1.evaluate(TestRuleIgnoreTestSuites.java:55)
[junit4:junit4]   2> 		at com.carrotsearch.randomizedtesting.RandomizedRunner.runSuite(RandomizedRunner.java:605)
[junit4:junit4]   2> 		at com.carrotsearch.randomizedtesting.RandomizedRunner.access$400(RandomizedRunner.java:132)
[junit4:junit4]   2> 		at com.carrotsearch.randomizedtesting.RandomizedRunner$2.run(RandomizedRunner.java:551)
[junit4:junit4]   2> 	
[junit4:junit4]   2> 466 T84 oashd.AbstractDataImportHandlerTestCase.tearDown Looking for dataimport.properties at: /mnt/ssd/jenkins/workspace/Lucene-Solr-4.x-Linux-Java6-64/checkout/solr/build/contrib/solr-dataimporthandler/test/J0/solr/collection1/conf/dataimport.properties
[junit4:junit4]   2> 466 T84 oas.SolrTestCaseJ4.tearDown ###Ending testCompositePk_DeltaImport_delete
[junit4:junit4]   2> NOTE: reproduce with: ant test  -Dtestcase=TestSqlEntityProcessorDelta2 -Dtests.method=testCompositePk_DeltaImport_delete -Dtests.seed=89D3329D540FF084 -Dtests.multiplier=3 -Dtests.slow=true -Dtests.locale=mk -Dtests.timezone=Australia/South -Dtests.file.encoding=ISO-8859-1
[junit4:junit4]   2>
[junit4:junit4] ERROR   0.02s J0 | TestSqlEntityProcessorDelta2.testCompositePk_DeltaImport_replace_delete
[junit4:junit4]    > Throwable #1: org.apache.solr.common.SolrException: org.apache.lucene.store.AlreadyClosedException: this IndexWriter is closed
[junit4:junit4]    > 	at __randomizedtesting.SeedInfo.seed([89D3329D540FF084:8B9C5232BA8BE881]:0)
[junit4:junit4]    > 	at org.apache.solr.util.TestHarness.update(TestHarness.java:248)
[junit4:junit4]    > 	at org.apache.solr.util.TestHarness.checkUpdateStatus(TestHarness.java:294)
[junit4:junit4]    > 	at org.apache.solr.util.TestHarness.validateUpdate(TestHarness.java:264)
[junit4:junit4]    > 	at org.apache.solr.SolrTestCaseJ4.checkUpdateU(SolrTestCaseJ4.java:440)
[junit4:junit4]    > 	at org.apache.solr.SolrTestCaseJ4.assertU(SolrTestCaseJ4.java:419)
[junit4:junit4]    > 	at org.apache.solr.SolrTestCaseJ4.assertU(SolrTestCaseJ4.java:413)
[junit4:junit4]    > 	at org.apache.solr.SolrTestCaseJ4.clearIndex(SolrTestCaseJ4.java:785)
[junit4:junit4]    > 	at org.apache.solr.handler.dataimport.TestSqlEntityProcessorDelta2.setUp(TestSqlEntityProcessorDelta2.java:68)
[junit4:junit4]    > 	at sun.reflect.NativeMethodAccessorImpl.invoke0(Native Method)
[junit4:junit4]    > 	at sun.reflect.NativeMethodAccessorImpl.invoke(NativeMethodAccessorImpl.java:39)
[junit4:junit4]    > 	at sun.reflect.DelegatingMethodAccessorImpl.invoke(DelegatingMethodAccessorImpl.java:25)
[junit4:junit4]    > 	at java.lang.reflect.Method.invoke(Method.java:597)
[junit4:junit4]    > 	at com.carrotsearch.randomizedtesting.RandomizedRunner.invoke(RandomizedRunner.java:1995)
[junit4:junit4]    > 	at com.carrotsearch.randomizedtesting.RandomizedRunner.access$1100(RandomizedRunner.java:132)
[junit4:junit4]    > 	at com.carrotsearch.randomizedtesting.RandomizedRunner$7.evaluate(RandomizedRunner.java:875)
[junit4:junit4]    > 	at com.carrotsearch.randomizedtesting.RandomizedRunner$8.evaluate(RandomizedRunner.java:891)
[junit4:junit4]    > 	at com.carrotsearch.randomizedtesting.rules.SystemPropertiesRestoreRule$1.evaluate(SystemPropertiesRestoreRule.java:53)
[junit4:junit4]    > 	at org.apache.lucene.util.TestRuleSetupTeardownChained$1.evaluate(TestRuleSetupTeardownChained.java:50)
[junit4:junit4]    > 	at org.apache.lucene.util.TestRuleFieldCacheSanity$1.evaluate(TestRuleFieldCacheSanity.java:32)
[junit4:junit4]    > 	at org.apache.lucene.util.AbstractBeforeAfterRule$1.evaluate(AbstractBeforeAfterRule.java:45)
[junit4:junit4]    > 	at com.carrotsearch.randomizedtesting.rules.SystemPropertiesInvariantRule$1.evaluate(SystemPropertiesInvariantRule.java:55)
[junit4:junit4]    > 	at org.apache.lucene.util.TestRuleReportUncaughtExceptions$1.evaluate(TestRuleReportUncaughtExceptions.java:68)
[junit4:junit4]    > 	at org.apache.lucene.util.TestRuleThreadAndTestName$1.evaluate(TestRuleThreadAndTestName.java:48)
[junit4:junit4]    > 	at org.apache.lucene.util.TestRuleIgnoreAfterMaxFailures$1.evaluate(TestRuleIgnoreAfterMaxFailures.java:70)
[junit4:junit4]    > 	at org.apache.lucene.util.TestRuleMarkFailure$1.evaluate(TestRuleMarkFailure.java:48)
[junit4:junit4]    > 	at com.carrotsearch.randomizedtesting.RandomizedRunner.runSingleTest(RandomizedRunner.java:825)
[junit4:junit4]    > 	at com.carrotsearch.randomizedtesting.RandomizedRunner.access$700(RandomizedRunner.java:132)
[junit4:junit4]    > 	at com.carrotsearch.randomizedtesting.RandomizedRunner$3$1.run(RandomizedRunner.java:671)
[junit4:junit4]    > 	at com.carrotsearch.randomizedtesting.RandomizedRunner$3.evaluate(RandomizedRunner.java:697)
[junit4:junit4]    > 	at com.carrotsearch.randomizedtesting.RandomizedRunner$4.evaluate(RandomizedRunner.java:736)
[junit4:junit4]    > 	at com.carrotsearch.randomizedtesting.RandomizedRunner$5.evaluate(RandomizedRunner.java:747)
[junit4:junit4]    > 	at com.carrotsearch.randomizedtesting.rules.SystemPropertiesRestoreRule$1.evaluate(SystemPropertiesRestoreRule.java:53)
[junit4:junit4]    > 	at org.apache.lucene.util.AbstractBeforeAfterRule$1.evaluate(AbstractBeforeAfterRule.java:45)
[junit4:junit4]    > 	at org.apache.lucene.util.TestRuleReportUncaughtExceptions$1.evaluate(TestRuleReportUncaughtExceptions.java:68)
[junit4:junit4]    > 	at org.apache.lucene.util.TestRuleStoreClassName$1.evaluate(TestRuleStoreClassName.java:38)
[junit4:junit4]    > 	at org.apache.lucene.util.TestRuleIcuHack$1.evaluate(TestRuleIcuHack.java:51)
[junit4:junit4]    > 	at com.carrotsearch.randomizedtesting.rules.SystemPropertiesInvariantRule$1.evaluate(SystemPropertiesInvariantRule.java:55)
[junit4:junit4]    > 	at org.apache.lucene.util.TestRuleNoInstanceHooksOverrides$1.evaluate(TestRuleNoInstanceHooksOverrides.java:53)
[junit4:junit4]    > 	at org.apache.lucene.util.TestRuleNoStaticHooksShadowing$1.evaluate(TestRuleNoStaticHooksShadowing.java:52)
[junit4:junit4]    > 	at org.apache.lucene.util.TestRuleAssertionsRequired$1.evaluate(TestRuleAssertionsRequired.java:36)
[junit4:junit4]    > 	at org.apache.lucene.util.TestRuleMarkFailure$1.evaluate(TestRuleMarkFailure.java:48)
[junit4:junit4]    > 	at org.apache.lucene.util.TestRuleIgnoreAfterMaxFailures$1.evaluate(TestRuleIgnoreAfterMaxFailures.java:70)
[junit4:junit4]    > 	at org.apache.lucene.util.TestRuleIgnoreTestSuites$1.evaluate(TestRuleIgnoreTestSuites.java:55)
[junit4:junit4]    > 	at com.carrotsearch.randomizedtesting.RandomizedRunner.runSuite(RandomizedRunner.java:605)
[junit4:junit4]    > 	at com.carrotsearch.randomizedtesting.RandomizedRunner.access$400(RandomizedRunner.java:132)
[junit4:junit4]    > 	at com.carrotsearch.randomizedtesting.RandomizedRunner$2.run(RandomizedRunner.java:551)
[junit4:junit4]    > Caused by: org.apache.lucene.store.AlreadyClosedException: this IndexWriter is closed
[junit4:junit4]    > 	at org.apache.lucene.index.IndexWriter.ensureOpen(IndexWriter.java:553)
[junit4:junit4]    > 	at org.apache.lucene.index.IndexWriter.ensureOpen(IndexWriter.java:558)
[junit4:junit4]    > 	at org.apache.lucene.index.IndexWriter.deleteAll(IndexWriter.java:1883)
[junit4:junit4]    > 	at org.apache.solr.update.DirectUpdateHandler2.deleteAll(DirectUpdateHandler2.java:142)
[junit4:junit4]    > 	at org.apache.solr.update.DirectUpdateHandler2.deleteByQuery(DirectUpdateHandler2.java:361)
[junit4:junit4]    > 	at org.apache.solr.update.processor.RunUpdateProcessor.processDelete(RunUpdateProcessorFactory.java:67)
[junit4:junit4]    > 	at org.apache.solr.update.processor.UpdateRequestProcessor.processDelete(UpdateRequestProcessor.java:55)
[junit4:junit4]    > 	at org.apache.solr.update.processor.DistributedUpdateProcessor.doDeleteByQuery(DistributedUpdateProcessor.java:733)
[junit4:junit4]    > 	at org.apache.solr.update.processor.DistributedUpdateProcessor.processDelete(DistributedUpdateProcessor.java:606)
[junit4:junit4]    > 	at org.apache.solr.update.processor.UpdateRequestProcessor.processDelete(UpdateRequestProcessor.java:55)
[junit4:junit4]    > 	at org.apache.solr.handler.dataimport.AbstractDataImportHandlerTestCase$TestUpdateRequestProcessor.processDelete(AbstractDataImportHandlerTestCase.java:364)
[junit4:junit4]    > 	at org.apache.solr.handler.loader.XMLLoader.processDelete(XMLLoader.java:330)
[junit4:junit4]    > 	at org.apache.solr.handler.loader.XMLLoader.processUpdate(XMLLoader.java:261)
[junit4:junit4]    > 	at org.apache.solr.handler.loader.XMLLoader.load(XMLLoader.java:157)
[junit4:junit4]    > 	at org.apache.solr.handler.UpdateRequestHandler$1.load(UpdateRequestHandler.java:92)
[junit4:junit4]    > 	at org.apache.solr.handler.ContentStreamHandlerBase.handleRequestBody(ContentStreamHandlerBase.java:74)
[junit4:junit4]    > 	at org.apache.solr.handler.RequestHandlerBase.handleRequest(RequestHandlerBase.java:129)
[junit4:junit4]    > 	at org.apache.solr.core.SolrCore.execute(SolrCore.java:1624)
[junit4:junit4]    > 	at org.apache.solr.servlet.DirectSolrConnection.request(DirectSolrConnection.java:131)
[junit4:junit4]    > 	at org.apache.solr.util.TestHarness.update(TestHarness.java:244)
[junit4:junit4]    > 	... 45 more
[junit4:junit4]    > 
[junit4:junit4]   2> 493 T84 oas.SolrTestCaseJ4.setUp ###Starting testCompositePk_DeltaImport_replace_delete
[junit4:junit4]   2> 496 T84 C11 oasu.DirectUpdateHandler2.deleteAll [collection1] REMOVING ALL DOCUMENTS FROM INDEX
[junit4:junit4]   2> 497 T84 C11 UPDATE [collection1] webapp=null path=null params={} {} 0 1
[junit4:junit4]   2> 497 T84 C11 oasc.SolrException.log SEVERE org.apache.lucene.store.AlreadyClosedException: this IndexWriter is closed
[junit4:junit4]   2> 		at org.apache.lucene.index.IndexWriter.ensureOpen(IndexWriter.java:553)
[junit4:junit4]   2> 		at org.apache.lucene.index.IndexWriter.ensureOpen(IndexWriter.java:558)
[junit4:junit4]   2> 		at org.apache.lucene.index.IndexWriter.deleteAll(IndexWriter.java:1883)
[junit4:junit4]   2> 		at org.apache.solr.update.DirectUpdateHandler2.deleteAll(DirectUpdateHandler2.java:142)
[junit4:junit4]   2> 		at org.apache.solr.update.DirectUpdateHandler2.deleteByQuery(DirectUpdateHandler2.java:361)
[junit4:junit4]   2> 		at org.apache.solr.update.processor.RunUpdateProcessor.processDelete(RunUpdateProcessorFactory.java:67)
[junit4:junit4]   2> 		at org.apache.solr.update.processor.UpdateRequestProcessor.processDelete(UpdateRequestProcessor.java:55)
[junit4:junit4]   2> 		at org.apache.solr.update.processor.DistributedUpdateProcessor.doDeleteByQuery(DistributedUpdateProcessor.java:733)
[junit4:junit4]   2> 		at org.apache.solr.update.processor.DistributedUpdateProcessor.processDelete(DistributedUpdateProcessor.java:606)
[junit4:junit4]   2> 		at org.apache.solr.update.processor.UpdateRequestProcessor.processDelete(UpdateRequestProcessor.java:55)
[junit4:junit4]   2> 		at org.apache.solr.handler.dataimport.AbstractDataImportHandlerTestCase$TestUpdateRequestProcessor.processDelete(AbstractDataImportHandlerTestCase.java:364)
[junit4:junit4]   2> 		at org.apache.solr.handler.loader.XMLLoader.processDelete(XMLLoader.java:330)
[junit4:junit4]   2> 		at org.apache.solr.handler.loader.XMLLoader.processUpdate(XMLLoader.java:261)
[junit4:junit4]   2> 		at org.apache.solr.handler.loader.XMLLoader.load(XMLLoader.java:157)
[junit4:junit4]   2> 		at org.apache.solr.handler.UpdateRequestHandler$1.load(UpdateRequestHandler.java:92)
[junit4:junit4]   2> 		at org.apache.solr.handler.ContentStreamHandlerBase.handleRequestBody(ContentStreamHandlerBase.java:74)
[junit4:junit4]   2> 		at org.apache.solr.handler.RequestHandlerBase.handleRequest(RequestHandlerBase.java:129)
[junit4:junit4]   2> 		at org.apache.solr.core.SolrCore.execute(SolrCore.java:1624)
[junit4:junit4]   2> 		at org.apache.solr.servlet.DirectSolrConnection.request(DirectSolrConnection.java:131)
[junit4:junit4]   2> 		at org.apache.solr.util.TestHarness.update(TestHarness.java:244)
[junit4:junit4]   2> 		at org.apache.solr.util.TestHarness.checkUpdateStatus(TestHarness.java:294)
[junit4:junit4]   2> 		at org.apache.solr.util.TestHarness.validateUpdate(TestHarness.java:264)
[junit4:junit4]   2> 		at org.apache.solr.SolrTestCaseJ4.checkUpdateU(SolrTestCaseJ4.java:440)
[junit4:junit4]   2> 		at org.apache.solr.SolrTestCaseJ4.assertU(SolrTestCaseJ4.java:419)
[junit4:junit4]   2> 		at org.apache.solr.SolrTestCaseJ4.assertU(SolrTestCaseJ4.java:413)
[junit4:junit4]   2> 		at org.apache.solr.SolrTestCaseJ4.clearIndex(SolrTestCaseJ4.java:785)
[junit4:junit4]   2> 		at org.apache.solr.handler.dataimport.TestSqlEntityProcessorDelta2.setUp(TestSqlEntityProcessorDelta2.java:68)
[junit4:junit4]   2> 		at sun.reflect.NativeMethodAccessorImpl.invoke0(Native Method)
[junit4:junit4]   2> 		at sun.reflect.NativeMethodAccessorImpl.invoke(NativeMethodAccessorImpl.java:39)
[junit4:junit4]   2> 		at sun.reflect.DelegatingMethodAccessorImpl.invoke(DelegatingMethodAccessorImpl.java:25)
[junit4:junit4]   2> 		at java.lang.reflect.Method.invoke(Method.java:597)
[junit4:junit4]   2> 		at com.carrotsearch.randomizedtesting.RandomizedRunner.invoke(RandomizedRunner.java:1995)
[junit4:junit4]   2> 		at com.carrotsearch.randomizedtesting.RandomizedRunner.access$1100(RandomizedRunner.java:132)
[junit4:junit4]   2> 		at com.carrotsearch.randomizedtesting.RandomizedRunner$7.evaluate(RandomizedRunner.java:875)
[junit4:junit4]   2> 		at com.carrotsearch.randomizedtesting.RandomizedRunner$8.evaluate(RandomizedRunner.java:891)
[junit4:junit4]   2> 		at com.carrotsearch.randomizedtesting.rules.SystemPropertiesRestoreRule$1.evaluate(SystemPropertiesRestoreRule.java:53)
[junit4:junit4]   2> 		at org.apache.lucene.util.TestRuleSetupTeardownChained$1.evaluate(TestRuleSetupTeardownChained.java:50)
[junit4:junit4]   2> 		at org.apache.lucene.util.TestRuleFieldCacheSanity$1.evaluate(TestRuleFieldCacheSanity.java:32)
[junit4:junit4]   2> 		at org.apache.lucene.util.AbstractBeforeAfterRule$1.evaluate(AbstractBeforeAfterRule.java:45)
[junit4:junit4]   2> 		at com.carrotsearch.randomizedtesting.rules.SystemPropertiesInvariantRule$1.evaluate(SystemPropertiesInvariantRule.java:55)
[junit4:junit4]   2> 		at org.apache.lucene.util.TestRuleReportUncaughtExceptions$1.evaluate(TestRuleReportUncaughtExceptions.java:68)
[junit4:junit4]   2> 		at org.apache.lucene.util.TestRuleThreadAndTestName$1.evaluate(TestRuleThreadAndTestName.java:48)
[junit4:junit4]   2> 		at org.apache.lucene.util.TestRuleIgnoreAfterMaxFailures$1.evaluate(TestRuleIgnoreAfterMaxFailures.java:70)
[junit4:junit4]   2> 		at org.apache.lucene.util.TestRuleMarkFailure$1.evaluate(TestRuleMarkFailure.java:48)
[junit4:junit4]   2> 		at com.carrotsearch.randomizedtesting.RandomizedRunner.runSingleTest(RandomizedRunner.java:825)
[junit4:junit4]   2> 		at com.carrotsearch.randomizedtesting.RandomizedRunner.access$700(RandomizedRunner.java:132)
[junit4:junit4]   2> 		at com.carrotsearch.randomizedtesting.RandomizedRunner$3$1.run(RandomizedRunner.java:671)
[junit4:junit4]   2> 		at com.carrotsearch.randomizedtesting.RandomizedRunner$3.evaluate(RandomizedRunner.java:697)
[junit4:junit4]   2> 		at com.carrotsearch.randomizedtesting.RandomizedRunner$4.evaluate(RandomizedRunner.java:736)
[junit4:junit4]   2> 		at com.carrotsearch.randomizedtesting.RandomizedRunner$5.evaluate(RandomizedRunner.java:747)
[junit4:junit4]   2> 		at com.carrotsearch.randomizedtesting.rules.SystemPropertiesRestoreRule$1.evaluate(SystemPropertiesRestoreRule.java:53)
[junit4:junit4]   2> 		at org.apache.lucene.util.AbstractBeforeAfterRule$1.evaluate(AbstractBeforeAfterRule.java:45)
[junit4:junit4]   2> 		at org.apache.lucene.util.TestRuleReportUncaughtExceptions$1.evaluate(TestRuleReportUncaughtExceptions.java:68)
[junit4:junit4]   2> 		at org.apache.lucene.util.TestRuleStoreClassName$1.evaluate(TestRuleStoreClassName.java:38)
[junit4:junit4]   2> 		at org.apache.lucene.util.TestRuleIcuHack$1.evaluate(TestRuleIcuHack.java:51)
[junit4:junit4]   2> 		at com.carrotsearch.randomizedtesting.rules.SystemPropertiesInvariantRule$1.evaluate(SystemPropertiesInvariantRule.java:55)
[junit4:junit4]   2> 		at org.apache.lucene.util.TestRuleNoInstanceHooksOverrides$1.evaluate(TestRuleNoInstanceHooksOverrides.java:53)
[junit4:junit4]   2> 		at org.apache.lucene.util.TestRuleNoStaticHooksShadowing$1.evaluate(TestRuleNoStaticHooksShadowing.java:52)
[junit4:junit4]   2> 		at org.apache.lucene.util.TestRuleAssertionsRequired$1.evaluate(TestRuleAssertionsRequired.java:36)
[junit4:junit4]   2> 		at org.apache.lucene.util.TestRuleMarkFailure$1.evaluate(TestRuleMarkFailure.java:48)
[junit4:junit4]   2> 		at org.apache.lucene.util.TestRuleIgnoreAfterMaxFailures$1.evaluate(TestRuleIgnoreAfterMaxFailures.java:70)
[junit4:junit4]   2> 		at org.apache.lucene.util.TestRuleIgnoreTestSuites$1.evaluate(TestRuleIgnoreTestSuites.java:55)
[junit4:junit4]   2> 		at com.carrotsearch.randomizedtesting.RandomizedRunner.runSuite(RandomizedRunner.java:605)
[junit4:junit4]   2> 		at com.carrotsearch.randomizedtesting.RandomizedRunner.access$400(RandomizedRunner.java:132)
[junit4:junit4]   2> 		at com.carrotsearch.randomizedtesting.RandomizedRunner$2.run(RandomizedRunner.java:551)
[junit4:junit4]   2> 	
[junit4:junit4]   2> 499 T84 oashd.AbstractDataImportHandlerTestCase.tearDown Looking for dataimport.properties at: /mnt/ssd/jenkins/workspace/Lucene-Solr-4.x-Linux-Java6-64/checkout/solr/build/contrib/solr-dataimporthandler/test/J0/solr/collection1/conf/dataimport.properties
[junit4:junit4]   2> 499 T84 oas.SolrTestCaseJ4.tearDown ###Ending testCompositePk_DeltaImport_replace_delete
[junit4:junit4]   2> NOTE: reproduce with: ant test  -Dtestcase=TestSqlEntityProcessorDelta2 -Dtests.method=testCompositePk_DeltaImport_replace_delete -Dtests.seed=89D3329D540FF084 -Dtests.multiplier=3 -Dtests.slow=true -Dtests.locale=mk -Dtests.timezone=Australia/South -Dtests.file.encoding=ISO-8859-1
[junit4:junit4]   2>
[junit4:junit4] ERROR   0.05s J0 | TestSqlEntityProcessorDelta2.testCompositePk_FullImport
[junit4:junit4]    > Throwable #1: org.apache.solr.common.SolrException: org.apache.lucene.store.AlreadyClosedException: this IndexWriter is closed
[junit4:junit4]    > 	at __randomizedtesting.SeedInfo.seed([89D3329D540FF084:D7BA7CAA8E57A052]:0)
[junit4:junit4]    > 	at org.apache.solr.util.TestHarness.update(TestHarness.java:248)
[junit4:junit4]    > 	at org.apache.solr.util.TestHarness.checkUpdateStatus(TestHarness.java:294)
[junit4:junit4]    > 	at org.apache.solr.util.TestHarness.validateUpdate(TestHarness.java:264)
[junit4:junit4]    > 	at org.apache.solr.SolrTestCaseJ4.checkUpdateU(SolrTestCaseJ4.java:440)
[junit4:junit4]    > 	at org.apache.solr.SolrTestCaseJ4.assertU(SolrTestCaseJ4.java:419)
[junit4:junit4]    > 	at org.apache.solr.SolrTestCaseJ4.assertU(SolrTestCaseJ4.java:413)
[junit4:junit4]    > 	at org.apache.solr.SolrTestCaseJ4.clearIndex(SolrTestCaseJ4.java:785)
[junit4:junit4]    > 	at org.apache.solr.handler.dataimport.TestSqlEntityProcessorDelta2.setUp(TestSqlEntityProcessorDelta2.java:68)
[junit4:junit4]    > 	at sun.reflect.NativeMethodAccessorImpl.invoke0(Native Method)
[junit4:junit4]    > 	at sun.reflect.NativeMethodAccessorImpl.invoke(NativeMethodAccessorImpl.java:39)
[junit4:junit4]    > 	at sun.reflect.DelegatingMethodAccessorImpl.invoke(DelegatingMethodAccessorImpl.java:25)
[junit4:junit4]    > 	at java.lang.reflect.Method.invoke(Method.java:597)
[junit4:junit4]    > 	at com.carrotsearch.randomizedtesting.RandomizedRunner.invoke(RandomizedRunner.java:1995)
[junit4:junit4]    > 	at com.carrotsearch.randomizedtesting.RandomizedRunner.access$1100(RandomizedRunner.java:132)
[junit4:junit4]    > 	at com.carrotsearch.randomizedtesting.RandomizedRunner$7.evaluate(RandomizedRunner.java:875)
[junit4:junit4]    > 	at com.carrotsearch.randomizedtesting.RandomizedRunner$8.evaluate(RandomizedRunner.java:891)
[junit4:junit4]    > 	at com.carrotsearch.randomizedtesting.rules.SystemPropertiesRestoreRule$1.evaluate(SystemPropertiesRestoreRule.java:53)
[junit4:junit4]    > 	at org.apache.lucene.util.TestRuleSetupTeardownChained$1.evaluate(TestRuleSetupTeardownChained.java:50)
[junit4:junit4]    > 	at org.apache.lucene.util.TestRuleFieldCacheSanity$1.evaluate(TestRuleFieldCacheSanity.java:32)
[junit4:junit4]    > 	at org.apache.lucene.util.AbstractBeforeAfterRule$1.evaluate(AbstractBeforeAfterRule.java:45)
[junit4:junit4]    > 	at com.carrotsearch.randomizedtesting.rules.SystemPropertiesInvariantRule$1.evaluate(SystemPropertiesInvariantRule.java:55)
[junit4:junit4]    > 	at org.apache.lucene.util.TestRuleReportUncaughtExceptions$1.evaluate(TestRuleReportUncaughtExceptions.java:68)
[junit4:junit4]    > 	at org.apache.lucene.util.TestRuleThreadAndTestName$1.evaluate(TestRuleThreadAndTestName.java:48)
[junit4:junit4]    > 	at org.apache.lucene.util.TestRuleIgnoreAfterMaxFailures$1.evaluate(TestRuleIgnoreAfterMaxFailures.java:70)
[junit4:junit4]    > 	at org.apache.lucene.util.TestRuleMarkFailure$1.evaluate(TestRuleMarkFailure.java:48)
[junit4:junit4]    > 	at com.carrotsearch.randomizedtesting.RandomizedRunner.runSingleTest(RandomizedRunner.java:825)
[junit4:junit4]    > 	at com.carrotsearch.randomizedtesting.RandomizedRunner.access$700(RandomizedRunner.java:132)
[junit4:junit4]    > 	at com.carrotsearch.randomizedtesting.RandomizedRunner$3$1.run(RandomizedRunner.java:671)
[junit4:junit4]    > 	at com.carrotsearch.randomizedtesting.RandomizedRunner$3.evaluate(RandomizedRunner.java:697)
[junit4:junit4]    > 	at com.carrotsearch.randomizedtesting.RandomizedRunner$4.evaluate(RandomizedRunner.java:736)
[junit4:junit4]    > 	at com.carrotsearch.randomizedtesting.RandomizedRunner$5.evaluate(RandomizedRunner.java:747)
[junit4:junit4]    > 	at com.carrotsearch.randomizedtesting.rules.SystemPropertiesRestoreRule$1.evaluate(SystemPropertiesRestoreRule.java:53)
[junit4:junit4]    > 	at org.apache.lucene.util.AbstractBeforeAfterRule$1.evaluate(AbstractBeforeAfterRule.java:45)
[junit4:junit4]    > 	at org.apache.lucene.util.TestRuleReportUncaughtExceptions$1.evaluate(TestRuleReportUncaughtExceptions.java:68)
[junit4:junit4]    > 	at org.apache.lucene.util.TestRuleStoreClassName$1.evaluate(TestRuleStoreClassName.java:38)
[junit4:junit4]    > 	at org.apache.lucene.util.TestRuleIcuHack$1.evaluate(TestRuleIcuHack.java:51)
[junit4:junit4]    > 	at com.carrotsearch.randomizedtesting.rules.SystemPropertiesInvariantRule$1.evaluate(SystemPropertiesInvariantRule.java:55)
[junit4:junit4]    > 	at org.apache.lucene.util.TestRuleNoInstanceHooksOverrides$1.evaluate(TestRuleNoInstanceHooksOverrides.java:53)
[junit4:junit4]    > 	at org.apache.lucene.util.TestRuleNoStaticHooksShadowing$1.evaluate(TestRuleNoStaticHooksShadowing.java:52)
[junit4:junit4]    > 	at org.apache.lucene.util.TestRuleAssertionsRequired$1.evaluate(TestRuleAssertionsRequired.java:36)
[junit4:junit4]    > 	at org.apache.lucene.util.TestRuleMarkFailure$1.evaluate(TestRuleMarkFailure.java:48)
[junit4:junit4]    > 	at org.apache.lucene.util.TestRuleIgnoreAfterMaxFailures$1.evaluate(TestRuleIgnoreAfterMaxFailures.java:70)
[junit4:junit4]    > 	at org.apache.lucene.util.TestRuleIgnoreTestSuites$1.evaluate(TestRuleIgnoreTestSuites.java:55)
[junit4:junit4]    > 	at com.carrotsearch.randomizedtesting.RandomizedRunner.runSuite(RandomizedRunner.java:605)
[junit4:junit4]    > 	at com.carrotsearch.randomizedtesting.RandomizedRunner.access$400(RandomizedRunner.java:132)
[junit4:junit4]    > 	at com.carrotsearch.randomizedtesting.RandomizedRunner$2.run(RandomizedRunner.java:551)
[junit4:junit4]    > Caused by: org.apache.lucene.store.AlreadyClosedException: this IndexWriter is closed
[junit4:junit4]    > 	at org.apache.lucene.index.IndexWriter.ensureOpen(IndexWriter.java:553)
[junit4:junit4]    > 	at org.apache.lucene.index.IndexWriter.ensureOpen(IndexWriter.java:558)
[junit4:junit4]    > 	at org.apache.lucene.index.IndexWriter.deleteAll(IndexWriter.java:1883)
[junit4:junit4]    > 	at org.apache.solr.update.DirectUpdateHandler2.deleteAll(DirectUpdateHandler2.java:142)
[junit4:junit4]    > 	at org.apache.solr.update.DirectUpdateHandler2.deleteByQuery(DirectUpdateHandler2.java:361)
[junit4:junit4]    > 	at org.apache.solr.update.processor.RunUpdateProcessor.processDelete(RunUpdateProcessorFactory.java:67)
[junit4:junit4]    > 	at org.apache.solr.update.processor.UpdateRequestProcessor.processDelete(UpdateRequestProcessor.java:55)
[junit4:junit4]    > 	at org.apache.solr.update.processor.DistributedUpdateProcessor.doDeleteByQuery(DistributedUpdateProcessor.java:733)
[junit4:junit4]    > 	at org.apache.solr.update.processor.DistributedUpdateProcessor.processDelete(DistributedUpdateProcessor.java:606)
[junit4:junit4]    > 	at org.apache.solr.update.processor.UpdateRequestProcessor.processDelete(UpdateRequestProcessor.java:55)
[junit4:junit4]    > 	at org.apache.solr.handler.dataimport.AbstractDataImportHandlerTestCase$TestUpdateRequestProcessor.processDelete(AbstractDataImportHandlerTestCase.java:364)
[junit4:junit4]    > 	at org.apache.solr.handler.loader.XMLLoader.processDelete(XMLLoader.java:330)
[junit4:junit4]    > 	at org.apache.solr.handler.loader.XMLLoader.processUpdate(XMLLoader.java:261)
[junit4:junit4]    > 	at org.apache.solr.handler.loader.XMLLoader.load(XMLLoader.java:157)
[junit4:junit4]    > 	at org.apache.solr.handler.UpdateRequestHandler$1.load(UpdateRequestHandler.java:92)
[junit4:junit4]    > 	at org.apache.solr.handler.ContentStreamHandlerBase.handleRequestBody(ContentStreamHandlerBase.java:74)
[junit4:junit4]    > 	at org.apache.solr.handler.RequestHandlerBase.handleRequest(RequestHandlerBase.java:129)
[junit4:junit4]    > 	at org.apache.solr.core.SolrCore.execute(SolrCore.java:1624)
[junit4:junit4]    > 	at org.apache.solr.servlet.DirectSolrConnection.request(DirectSolrConnection.java:131)
[junit4:junit4]    > 	at org.apache.solr.util.TestHarness.update(TestHarness.java:244)
[junit4:junit4]    > 	... 45 more
[junit4:junit4]    > 
[junit4:junit4]   2> 511 T84 oas.SolrTestCaseJ4.setUp ###Starting testCompositePk_FullImport
[junit4:junit4]   2> 515 T84 C11 oasu.DirectUpdateHandler2.deleteAll [collection1] REMOVING ALL DOCUMENTS FROM INDEX
[junit4:junit4]   2> 516 T84 C11 UPDATE [collection1] webapp=null path=null params={} {} 0 1
[junit4:junit4]   2> 516 T84 C11 oasc.SolrException.log SEVERE org.apache.lucene.store.AlreadyClosedException: this IndexWriter is closed
[junit4:junit4]   2> 		at org.apache.lucene.index.IndexWriter.ensureOpen(IndexWriter.java:553)
[junit4:junit4]   2> 		at org.apache.lucene.index.IndexWriter.ensureOpen(IndexWriter.java:558)
[junit4:junit4]   2> 		at org.apache.lucene.index.IndexWriter.deleteAll(IndexWriter.java:1883)
[junit4:junit4]   2> 		at org.apache.solr.update.DirectUpdateHandler2.deleteAll(DirectUpdateHandler2.java:142)
[junit4:junit4]   2> 		at org.apache.solr.update.DirectUpdateHandler2.deleteByQuery(DirectUpdateHandler2.java:361)
[junit4:junit4]   2> 		at org.apache.solr.update.processor.RunUpdateProcessor.processDelete(RunUpdateProcessorFactory.java:67)
[junit4:junit4]   2> 		at org.apache.solr.update.processor.UpdateRequestProcessor.processDelete(UpdateRequestProcessor.java:55)
[junit4:junit4]   2> 		at org.apache.solr.update.processor.DistributedUpdateProcessor.doDeleteByQuery(DistributedUpdateProcessor.java:733)
[junit4:junit4]   2> 		at org.apache.solr.update.processor.DistributedUpdateProcessor.processDelete(DistributedUpdateProcessor.java:606)
[junit4:junit4]   2> 		at org.apache.solr.update.processor.UpdateRequestProcessor.processDelete(UpdateRequestProcessor.java:55)
[junit4:junit4]   2> 		at org.apache.solr.handler.dataimport.AbstractDataImportHandlerTestCase$TestUpdateRequestProcessor.processDelete(AbstractDataImportHandlerTestCase.java:364)
[junit4:junit4]   2> 		at org.apache.solr.handler.loader.XMLLoader.processDelete(XMLLoader.java:330)
[junit4:junit4]   2> 		at org.apache.solr.handler.loader.XMLLoader.processUpdate(XMLLoader.java:261)
[junit4:junit4]   2> 		at org.apache.solr.handler.loader.XMLLoader.load(XMLLoader.java:157)
[junit4:junit4]   2> 		at org.apache.solr.handler.UpdateRequestHandler$1.load(UpdateRequestHandler.java:92)
[junit4:junit4]   2> 		at org.apache.solr.handler.ContentStreamHandlerBase.handleRequestBody(ContentStreamHandlerBase.java:74)
[junit4:junit4]   2> 		at org.apache.solr.handler.RequestHandlerBase.handleRequest(RequestHandlerBase.java:129)
[junit4:junit4]   2> 		at org.apache.solr.core.SolrCore.execute(SolrCore.java:1624)
[junit4:junit4]   2> 		at org.apache.solr.servlet.DirectSolrConnection.request(DirectSolrConnection.java:131)
[junit4:junit4]   2> 		at org.apache.solr.util.TestHarness.update(TestHarness.java:244)
[junit4:junit4]   2> 		at org.apache.solr.util.TestHarness.checkUpdateStatus(TestHarness.java:294)
[junit4:junit4]   2> 		at org.apache.solr.util.TestHarness.validateUpdate(TestHarness.java:264)
[junit4:junit4]   2> 		at org.apache.solr.SolrTestCaseJ4.checkUpdateU(SolrTestCaseJ4.java:440)
[junit4:junit4]   2> 		at org.apache.solr.SolrTestCaseJ4.assertU(SolrTestCaseJ4.java:419)
[junit4:junit4]   2> 		at org.apache.solr.SolrTestCaseJ4.assertU(SolrTestCaseJ4.java:413)
[junit4:junit4]   2> 		at org.apache.solr.SolrTestCaseJ4.clearIndex(SolrTestCaseJ4.java:785)
[junit4:junit4]   2> 		at org.apache.solr.handler.dataimport.TestSqlEntityProcessorDelta2.setUp(TestSqlEntityProcessorDelta2.java:68)
[junit4:junit4]   2> 		at sun.reflect.NativeMethodAccessorImpl.invoke0(Native Method)
[junit4:junit4]   2> 		at sun.reflect.NativeMethodAccessorImpl.invoke(NativeMethodAccessorImpl.java:39)
[junit4:junit4]   2> 		at sun.reflect.DelegatingMethodAccessorImpl.invoke(DelegatingMethodAccessorImpl.java:25)
[junit4:junit4]   2> 		at java.lang.reflect.Method.invoke(Method.java:597)
[junit4:junit4]   2> 		at com.carrotsearch.randomizedtesting.RandomizedRunner.invoke(RandomizedRunner.java:1995)
[junit4:junit4]   2> 		at com.carrotsearch.randomizedtesting.RandomizedRunner.access$1100(RandomizedRunner.java:132)
[junit4:junit4]   2> 		at com.carrotsearch.randomizedtesting.RandomizedRunner$7.evaluate(RandomizedRunner.java:875)
[junit4:junit4]   2> 		at com.carrotsearch.randomizedtesting.RandomizedRunner$8.evaluate(RandomizedRunner.java:891)
[junit4:junit4]   2> 		at com.carrotsearch.randomizedtesting.rules.SystemPropertiesRestoreRule$1.evaluate(SystemPropertiesRestoreRule.java:53)
[junit4:junit4]   2> 		at org.apache.lucene.util.TestRuleSetupTeardownChained$1.evaluate(TestRuleSetupTeardownChained.java:50)
[junit4:junit4]   2> 		at org.apache.lucene.util.TestRuleFieldCacheSanity$1.evaluate(TestRuleFieldCacheSanity.java:32)
[junit4:junit4]   2> 		at org.apache.lucene.util.AbstractBeforeAfterRule$1.evaluate(AbstractBeforeAfterRule.java:45)
[junit4:junit4]   2> 		at com.carrotsearch.randomizedtesting.rules.SystemPropertiesInvariantRule$1.evaluate(SystemPropertiesInvariantRule.java:55)
[junit4:junit4]   2> 		at org.apache.lucene.util.TestRuleReportUncaughtExceptions$1.evaluate(TestRuleReportUncaughtExceptions.java:68)
[junit4:junit4]   2> 		at org.apache.lucene.util.TestRuleThreadAndTestName$1.evaluate(TestRuleThreadAndTestName.java:48)
[junit4:junit4]   2> 		at org.apache.lucene.util.TestRuleIgnoreAfterMaxFailures$1.evaluate(TestRuleIgnoreAfterMaxFailures.java:70)
[junit4:junit4]   2> 		at org.apache.lucene.util.TestRuleMarkFailure$1.evaluate(TestRuleMarkFailure.java:48)
[junit4:junit4]   2> 		at com.carrotsearch.randomizedtesting.RandomizedRunner.runSingleTest(RandomizedRunner.java:825)
[junit4:junit4]   2> 		at com.carrotsearch.randomizedtesting.RandomizedRunner.access$700(RandomizedRunner.java:132)
[junit4:junit4]   2> 		at com.carrotsearch.randomizedtesting.RandomizedRunner$3$1.run(RandomizedRunner.java:671)
[junit4:junit4]   2> 		at com.carrotsearch.randomizedtesting.RandomizedRunner$3.evaluate(RandomizedRunner.java:697)
[junit4:junit4]   2> 		at com.carrotsearch.randomizedtesting.RandomizedRunner$4.evaluate(RandomizedRunner.java:736)
[junit4:junit4]   2> 		at com.carrotsearch.randomizedtesting.RandomizedRunner$5.evaluate(RandomizedRunner.java:747)
[junit4:junit4]   2> 		at com.carrotsearch.randomizedtesting.rules.SystemPropertiesRestoreRule$1.evaluate(SystemPropertiesRestoreRule.java:53)
[junit4:junit4]   2> 		at org.apache.lucene.util.AbstractBeforeAfterRule$1.evaluate(AbstractBeforeAfterRule.java:45)
[junit4:junit4]   2> 		at org.apache.lucene.util.TestRuleReportUncaughtExceptions$1.evaluate(TestRuleReportUncaughtExceptions.java:68)
[junit4:junit4]   2> 		at org.apache.lucene.util.TestRuleStoreClassName$1.evaluate(TestRuleStoreClassName.java:38)
[junit4:junit4]   2> 		at org.apache.lucene.util.TestRuleIcuHack$1.evaluate(TestRuleIcuHack.java:51)
[junit4:junit4]   2> 		at com.carrotsearch.randomizedtesting.rules.SystemPropertiesInvariantRule$1.evaluate(SystemPropertiesInvariantRule.java:55)
[junit4:junit4]   2> 		at org.apache.lucene.util.TestRuleNoInstanceHooksOverrides$1.evaluate(TestRuleNoInstanceHooksOverrides.java:53)
[junit4:junit4]   2> 		at org.apache.lucene.util.TestRuleNoStaticHooksShadowing$1.evaluate(TestRuleNoStaticHooksShadowing.java:52)
[junit4:junit4]   2> 		at org.apache.lucene.util.TestRuleAssertionsRequired$1.evaluate(TestRuleAssertionsRequired.java:36)
[junit4:junit4]   2> 		at org.apache.lucene.util.TestRuleMarkFailure$1.evaluate(TestRuleMarkFailure.java:48)
[junit4:junit4]   2> 		at org.apache.lucene.util.TestRuleIgnoreAfterMaxFailures$1.evaluate(TestRuleIgnoreAfterMaxFailures.java:70)
[junit4:junit4]   2> 		at org.apache.lucene.util.TestRuleIgnoreTestSuites$1.evaluate(TestRuleIgnoreTestSuites.java:55)
[junit4:junit4]   2> 		at com.carrotsearch.randomizedtesting.RandomizedRunner.runSuite(RandomizedRunner.java:605)
[junit4:junit4]   2> 		at com.carrotsearch.randomizedtesting.RandomizedRunner.access$400(RandomizedRunner.java:132)
[junit4:junit4]   2> 		at com.carrotsearch.randomizedtesting.RandomizedRunner$2.run(RandomizedRunner.java:551)
[junit4:junit4]   2> 	
[junit4:junit4]   2> 518 T84 oashd.AbstractDataImportHandlerTestCase.tearDown Looking for dataimport.properties at: /mnt/ssd/jenkins/workspace/Lucene-Solr-4.x-Linux-Java6-64/checkout/solr/build/contrib/solr-dataimporthandler/test/J0/solr/collection1/conf/dataimport.properties
[junit4:junit4]   2> 518 T84 oas.SolrTestCaseJ4.tearDown ###Ending testCompositePk_FullImport
[junit4:junit4]   2> NOTE: reproduce with: ant test  -Dtestcase=TestSqlEntityProcessorDelta2 -Dtests.method=testCompositePk_FullImport -Dtests.seed=89D3329D540FF084 -Dtests.multiplier=3 -Dtests.slow=true -Dtests.locale=mk -Dtests.timezone=Australia/South -Dtests.file.encoding=ISO-8859-1
[junit4:junit4]   2>
[junit4:junit4] ERROR   0.05s J0 | TestSqlEntityProcessorDelta2.testCompositePk_DeltaImport_replace_nodelete
[junit4:junit4]    > Throwable #1: org.apache.solr.common.SolrException: org.apache.lucene.store.AlreadyClosedException: this IndexWriter is closed
[junit4:junit4]    > 	at __randomizedtesting.SeedInfo.seed([89D3329D540FF084:4A9034C6F61B06E]:0)
[junit4:junit4]    > 	at org.apache.solr.util.TestHarness.update(TestHarness.java:248)
[junit4:junit4]    > 	at org.apache.solr.util.TestHarness.checkUpdateStatus(TestHarness.java:294)
[junit4:junit4]    > 	at org.apache.solr.util.TestHarness.validateUpdate(TestHarness.java:264)
[junit4:junit4]    > 	at org.apache.solr.SolrTestCaseJ4.checkUpdateU(SolrTestCaseJ4.java:440)
[junit4:junit4]    > 	at org.apache.solr.SolrTestCaseJ4.assertU(SolrTestCaseJ4.java:419)
[junit4:junit4]    > 	at org.apache.solr.SolrTestCaseJ4.assertU(SolrTestCaseJ4.java:413)
[junit4:junit4]    > 	at org.apache.solr.SolrTestCaseJ4.clearIndex(SolrTestCaseJ4.java:785)
[junit4:junit4]    > 	at org.apache.solr.handler.dataimport.TestSqlEntityProcessorDelta2.setUp(TestSqlEntityProcessorDelta2.java:68)
[junit4:junit4]    > 	at sun.reflect.NativeMethodAccessorImpl.invoke0(Native Method)
[junit4:junit4]    > 	at sun.reflect.NativeMethodAccessorImpl.invoke(NativeMethodAccessorImpl.java:39)
[junit4:junit4]    > 	at sun.reflect.DelegatingMethodAccessorImpl.invoke(DelegatingMethodAccessorImpl.java:25)
[junit4:junit4]    > 	at java.lang.reflect.Method.invoke(Method.java:597)
[junit4:junit4]    > 	at com.carrotsearch.randomizedtesting.RandomizedRunner.invoke(RandomizedRunner.java:1995)
[junit4:junit4]    > 	at com.carrotsearch.randomizedtesting.RandomizedRunner.access$1100(RandomizedRunner.java:132)
[junit4:junit4]    > 	at com.carrotsearch.randomizedtesting.RandomizedRunner$7.evaluate(RandomizedRunner.java:875)
[junit4:junit4]    > 	at com.carrotsearch.randomizedtesting.RandomizedRunner$8.evaluate(RandomizedRunner.java:891)
[junit4:junit4]    > 	at com.carrotsearch.randomizedtesting.rules.SystemPropertiesRestoreRule$1.evaluate(SystemPropertiesRestoreRule.java:53)
[junit4:junit4]    > 	at org.apache.lucene.util.TestRuleSetupTeardownChained$1.evaluate(TestRuleSetupTeardownChained.java:50)
[junit4:junit4]    > 	at org.apache.lucene.util.TestRuleFieldCacheSanity$1.evaluate(TestRuleFieldCacheSanity.java:32)
[junit4:junit4]    > 	at org.apache.lucene.util.AbstractBeforeAfterRule$1.evaluate(AbstractBeforeAfterRule.java:45)
[junit4:junit4]    > 	at com.carrotsearch.randomizedtesting.rules.SystemPropertiesInvariantRule$1.evaluate(SystemPropertiesInvariantRule.java:55)
[junit4:junit4]    > 	at org.apache.lucene.util.TestRuleReportUncaughtExceptions$1.evaluate(TestRuleReportUncaughtExceptions.java:68)
[junit4:junit4]    > 	at org.apache.lucene.util.TestRuleThreadAndTestName$1.evaluate(TestRuleThreadAndTestName.java:48)
[junit4:junit4]    > 	at org.apache.lucene.util.TestRuleIgnoreAfterMaxFailures$1.evaluate(TestRuleIgnoreAfterMaxFailures.java:70)
[junit4:junit4]    > 	at org.apache.lucene.util.TestRuleMarkFailure$1.evaluate(TestRuleMarkFailure.java:48)
[junit4:junit4]    > 	at com.carrotsearch.randomizedtesting.RandomizedRunner.runSingleTest(RandomizedRunner.java:825)
[junit4:junit4]    > 	at com.carrotsearch.randomizedtesting.RandomizedRunner.access$700(RandomizedRunner.java:132)
[junit4:junit4]    > 	at com.carrotsearch.randomizedtesting.RandomizedRunner$3$1.run(RandomizedRunner.java:671)
[junit4:junit4]    > 	at com.carrotsearch.randomizedtesting.RandomizedRunner$3.evaluate(RandomizedRunner.java:697)
[junit4:junit4]    > 	at com.carrotsearch.randomizedtesting.RandomizedRunner$4.evaluate(RandomizedRunner.java:736)
[junit4:junit4]    > 	at com.carrotsearch.randomizedtesting.RandomizedRunner$5.evaluate(RandomizedRunner.java:747)
[junit4:junit4]    > 	at com.carrotsearch.randomizedtesting.rules.SystemPropertiesRestoreRule$1.evaluate(SystemPropertiesRestoreRule.java:53)
[junit4:junit4]    > 	at org.apache.lucene.util.AbstractBeforeAfterRule$1.evaluate(AbstractBeforeAfterRule.java:45)
[junit4:junit4]    > 	at org.apache.lucene.util.TestRuleReportUncaughtExceptions$1.evaluate(TestRuleReportUncaughtExceptions.java:68)
[junit4:junit4]    > 	at org.apache.lucene.util.TestRuleStoreClassName$1.evaluate(TestRuleStoreClassName.java:38)
[junit4:junit4]    > 	at org.apache.lucene.util.TestRuleIcuHack$1.evaluate(TestRuleIcuHack.java:51)
[junit4:junit4]    > 	at com.carrotsearch.randomizedtesting.rules.SystemPropertiesInvariantRule$1.evaluate(SystemPropertiesInvariantRule.java:55)
[junit4:junit4]    > 	at org.apache.lucene.util.TestRuleNoInstanceHooksOverrides$1.evaluate(TestRuleNoInstanceHooksOverrides.java:53)
[junit4:junit4]    > 	at org.apache.lucene.util.TestRuleNoStaticHooksShadowing$1.evaluate(TestRuleNoStaticHooksShadowing.java:52)
[junit4:junit4]    > 	at org.apache.lucene.util.TestRuleAssertionsRequired$1.evaluate(TestRuleAssertionsRequired.java:36)
[junit4:junit4]    > 	at org.apache.lucene.util.TestRuleMarkFailure$1.evaluate(TestRuleMarkFailure.java:48)
[junit4:junit4]    > 	at org.apache.lucene.util.TestRuleIgnoreAfterMaxFailures$1.evaluate(TestRuleIgnoreAfterMaxFailures.java:70)
[junit4:junit4]    > 	at org.apache.lucene.util.TestRuleIgnoreTestSuites$1.evaluate(TestRuleIgnoreTestSuites.java:55)
[junit4:junit4]    > 	at com.carrotsearch.randomizedtesting.RandomizedRunner.runSuite(RandomizedRunner.java:605)
[junit4:junit4]    > 	at com.carrotsearch.randomizedtesting.RandomizedRunner.access$400(RandomizedRunner.java:132)
[junit4:junit4]    > 	at com.carrotsearch.randomizedtesting.RandomizedRunner$2.run(RandomizedRunner.java:551)
[junit4:junit4]    > Caused by: org.apache.lucene.store.AlreadyClosedException: this IndexWriter is closed
[junit4:junit4]    > 	at org.apache.lucene.index.IndexWriter.ensureOpen(IndexWriter.java:553)
[junit4:junit4]    > 	at org.apache.lucene.index.IndexWriter.ensureOpen(IndexWriter.java:558)
[junit4:junit4]    > 	at org.apache.lucene.index.IndexWriter.deleteAll(IndexWriter.java:1883)
[junit4:junit4]    > 	at org.apache.solr.update.DirectUpdateHandler2.deleteAll(DirectUpdateHandler2.java:142)
[junit4:junit4]    > 	at org.apache.solr.update.DirectUpdateHandler2.deleteByQuery(DirectUpdateHandler2.java:361)
[junit4:junit4]    > 	at org.apache.solr.update.processor.RunUpdateProcessor.processDelete(RunUpdateProcessorFactory.java:67)
[junit4:junit4]    > 	at org.apache.solr.update.processor.UpdateRequestProcessor.processDelete(UpdateRequestProcessor.java:55)
[junit4:junit4]    > 	at org.apache.solr.update.processor.DistributedUpdateProcessor.doDeleteByQuery(DistributedUpdateProcessor.java:733)
[junit4:junit4]    > 	at org.apache.solr.update.processor.DistributedUpdateProcessor.processDelete(DistributedUpdateProcessor.java:606)
[junit4:junit4]    > 	at org.apache.solr.update.processor.UpdateRequestProcessor.processDelete(UpdateRequestProcessor.java:55)
[junit4:junit4]    > 	at org.apache.solr.handler.dataimport.AbstractDataImportHandlerTestCase$TestUpdateRequestProcessor.processDelete(AbstractDataImportHandlerTestCase.java:364)
[junit4:junit4]    > 	at org.apache.solr.handler.loader.XMLLoader.processDelete(XMLLoader.java:330)
[junit4:junit4]    > 	at org.apache.solr.handler.loader.XMLLoader.processUpdate(XMLLoader.java:261)
[junit4:junit4]    > 	at org.apache.solr.handler.loader.XMLLoader.load(XMLLoader.java:157)
[junit4:junit4]    > 	at org.apache.solr.handler.UpdateRequestHandler$1.load(UpdateRequestHandler.java:92)
[junit4:junit4]    > 	at org.apache.solr.handler.ContentStreamHandlerBase.handleRequestBody(ContentStreamHandlerBase.java:74)
[junit4:junit4]    > 	at org.apache.solr.handler.RequestHandlerBase.handleRequest(RequestHandlerBase.java:129)
[junit4:junit4]    > 	at org.apache.solr.core.SolrCore.execute(SolrCore.java:1624)
[junit4:junit4]    > 	at org.apache.solr.servlet.DirectSolrConnection.request(DirectSolrConnection.java:131)
[junit4:junit4]    > 	at org.apache.solr.util.TestHarness.update(TestHarness.java:244)
[junit4:junit4]    > 	... 45 more
[junit4:junit4]    > 
[junit4:junit4]   2> 583 T84 oas.SolrTestCaseJ4.setUp ###Starting testCompositePk_DeltaImport_replace_nodelete
[junit4:junit4]   2> 588 T84 C11 oasu.DirectUpdateHandler2.deleteAll [collection1] REMOVING ALL DOCUMENTS FROM INDEX
[junit4:junit4]   2> 588 T84 C11 UPDATE [collection1] webapp=null path=null params={} {} 0 1
[junit4:junit4]   2> 589 T84 C11 oasc.SolrException.log SEVERE org.apache.lucene.store.AlreadyClosedException: this IndexWriter is closed
[junit4:junit4]   2> 		at org.apache.lucene.index.IndexWriter.ensureOpen(IndexWriter.java:553)
[junit4:junit4]   2> 		at org.apache.lucene.index.IndexWriter.ensureOpen(IndexWriter.java:558)
[junit4:junit4]   2> 		at org.apache.lucene.index.IndexWriter.deleteAll(IndexWriter.java:1883)
[junit4:junit4]   2> 		at org.apache.solr.update.DirectUpdateHandler2.deleteAll(DirectUpdateHandler2.java:142)
[junit4:junit4]   2> 		at org.apache.solr.update.DirectUpdateHandler2.deleteByQuery(DirectUpdateHandler2.java:361)
[junit4:junit4]   2> 		at org.apache.solr.update.processor.RunUpdateProcessor.processDelete(RunUpdateProcessorFactory.java:67)
[junit4:junit4]   2> 		at org.apache.solr.update.processor.UpdateRequestProcessor.processDelete(UpdateRequestProcessor.java:55)
[junit4:junit4]   2> 		at org.apache.solr.update.processor.DistributedUpdateProcessor.doDeleteByQuery(DistributedUpdateProcessor.java:733)
[junit4:junit4]   2> 		at org.apache.solr.update.processor.DistributedUpdateProcessor.processDelete(DistributedUpdateProcessor.java:606)
[junit4:junit4]   2> 		at org.apache.solr.update.processor.UpdateRequestProcessor.processDelete(UpdateRequestProcessor.java:55)
[junit4:junit4]   2> 		at org.apache.solr.handler.dataimport.AbstractDataImportHandlerTestCase$TestUpdateRequestProcessor.processDelete(AbstractDataImportHandlerTestCase.java:364)
[junit4:junit4]   2> 		at org.apache.solr.handler.loader.XMLLoader.processDelete(XMLLoader.java:330)
[junit4:junit4]   2> 		at org.apache.solr.handler.loader.XMLLoader.processUpdate(XMLLoader.java:261)
[junit4:junit4]   2> 		at org.apache.solr.handler.loader.XMLLoader.load(XMLLoader.java:157)
[junit4:junit4]   2> 		at org.apache.solr.handler.UpdateRequestHandler$1.load(UpdateRequestHandler.java:92)
[junit4:junit4]   2> 		at org.apache.solr.handler.ContentStreamHandlerBase.handleRequestBody(ContentStreamHandlerBase.java:74)
[junit4:junit4]   2> 		at org.apache.solr.handler.RequestHandlerBase.handleRequest(RequestHandlerBase.java:129)
[junit4:junit4]   2> 		at org.apache.solr.core.SolrCore.execute(SolrCore.java:1624)
[junit4:junit4]   2> 		at org.apache.solr.servlet.DirectSolrConnection.request(DirectSolrConnection.java:131)
[junit4:junit4]   2> 		at org.apache.solr.util.TestHarness.update(TestHarness.java:244)
[junit4:junit4]   2> 		at org.apache.solr.util.TestHarness.checkUpdateStatus(TestHarness.java:294)
[junit4:junit4]   2> 		at org.apache.solr.util.TestHarness.validateUpdate(TestHarness.java:264)
[junit4:junit4]   2> 		at org.apache.solr.SolrTestCaseJ4.checkUpdateU(SolrTestCaseJ4.java:440)
[junit4:junit4]   2> 		at org.apache.solr.SolrTestCaseJ4.assertU(SolrTestCaseJ4.java:419)
[junit4:junit4]   2> 		at org.apache.solr.SolrTestCaseJ4.assertU(SolrTestCaseJ4.java:413)
[junit4:junit4]   2> 		at org.apache.solr.SolrTestCaseJ4.clearIndex(SolrTestCaseJ4.java:785)
[junit4:junit4]   2> 		at org.apache.solr.handler.dataimport.TestSqlEntityProcessorDelta2.setUp(TestSqlEntityProcessorDelta2.java:68)
[junit4:junit4]   2> 		at sun.reflect.NativeMethodAccessorImpl.invoke0(Native Method)
[junit4:junit4]   2> 		at sun.reflect.NativeMethodAccessorImpl.invoke(NativeMethodAccessorImpl.java:39)
[junit4:junit4]   2> 		at sun.reflect.DelegatingMethodAccessorImpl.invoke(DelegatingMethodAccessorImpl.java:25)
[junit4:junit4]   2> 		at java.lang.reflect.Method.invoke(Method.java:597)
[junit4:junit4]   2> 		at com.carrotsearch.randomizedtesting.RandomizedRunner.invoke(RandomizedRunner.java:1995)
[junit4:junit4]   2> 		at com.carrotsearch.randomizedtesting.RandomizedRunner.access$1100(RandomizedRunner.java:132)
[junit4:junit4]   2> 		at com.carrotsearch.randomizedtesting.RandomizedRunner$7.evaluate(RandomizedRunner.java:875)
[junit4:junit4]   2> 		at com.carrotsearch.randomizedtesting.RandomizedRunner$8.evaluate(RandomizedRunner.java:891)
[junit4:junit4]   2> 		at com.carrotsearch.randomizedtesting.rules.SystemPropertiesRestoreRule$1.evaluate(SystemPropertiesRestoreRule.java:53)
[junit4:junit4]   2> 		at org.apache.lucene.util.TestRuleSetupTeardownChained$1.evaluate(TestRuleSetupTeardownChained.java:50)
[junit4:junit4]   2> 		at org.apache.lucene.util.TestRuleFieldCacheSanity$1.evaluate(TestRuleFieldCacheSanity.java:32)
[junit4:junit4]   2> 		at org.apache.lucene.util.AbstractBeforeAfterRule$1.evaluate(AbstractBeforeAfterRule.java:45)
[junit4:junit4]   2> 		at com.carrotsearch.randomizedtesting.rules.SystemPropertiesInvariantRule$1.evaluate(SystemPropertiesInvariantRule.java:55)
[junit4:junit4]   2> 		at org.apache.lucene.util.TestRuleReportUncaughtExceptions$1.evaluate(TestRuleReportUncaughtExceptions.java:68)
[junit4:junit4]   2> 		at org.apache.lucene.util.TestRuleThreadAndTestName$1.evaluate(TestRuleThreadAndTestName.java:48)
[junit4:junit4]   2> 		at org.apache.lucene.util.TestRuleIgnoreAfterMaxFailures$1.evaluate(TestRuleIgnoreAfterMaxFailures.java:70)
[junit4:junit4]   2> 		at org.apache.lucene.util.TestRuleMarkFailure$1.evaluate(TestRuleMarkFailure.java:48)
[junit4:junit4]   2> 		at com.carrotsearch.randomizedtesting.RandomizedRunner.runSingleTest(RandomizedRunner.java:825)
[junit4:junit4]   2> 		at com.carrotsearch.randomizedtesting.RandomizedRunner.access$700(RandomizedRunner.java:132)
[junit4:junit4]   2> 		at com.carrotsearch.randomizedtesting.RandomizedRunner$3$1.run(RandomizedRunner.java:671)
[junit4:junit4]   2> 		at com.carrotsearch.randomizedtesting.RandomizedRunner$3.evaluate(RandomizedRunner.java:697)
[junit4:junit4]   2> 		at com.carrotsearch.randomizedtesting.RandomizedRunner$4.evaluate(RandomizedRunner.java:736)
[junit4:junit4]   2> 		at com.carrotsearch.randomizedtesting.RandomizedRunner$5.evaluate(RandomizedRunner.java:747)
[junit4:junit4]   2> 		at com.carrotsearch.randomizedtesting.rules.SystemPropertiesRestoreRule$1.evaluate(SystemPropertiesRestoreRule.java:53)
[junit4:junit4]   2> 		at org.apache.lucene.util.AbstractBeforeAfterRule$1.evaluate(AbstractBeforeAfterRule.java:45)
[junit4:junit4]   2> 		at org.apache.lucene.util.TestRuleReportUncaughtExceptions$1.evaluate(TestRuleReportUncaughtExceptions.java:68)
[junit4:junit4]   2> 		at org.apache.lucene.util.TestRuleStoreClassName$1.evaluate(TestRuleStoreClassName.java:38)
[junit4:junit4]   2> 		at org.apache.lucene.util.TestRuleIcuHack$1.evaluate(TestRuleIcuHack.java:51)
[junit4:junit4]   2> 		at com.carrotsearch.randomizedtesting.rules.SystemPropertiesInvariantRule$1.evaluate(SystemPropertiesInvariantRule.java:55)
[junit4:junit4]   2> 		at org.apache.lucene.util.TestRuleNoInstanceHooksOverrides$1.evaluate(TestRuleNoInstanceHooksOverrides.java:53)
[junit4:junit4]   2> 		at org.apache.lucene.util.TestRuleNoStaticHooksShadowing$1.evaluate(TestRuleNoStaticHooksShadowing.java:52)
[junit4:junit4]   2> 		at org.apache.lucene.util.TestRuleAssertionsRequired$1.evaluate(TestRuleAssertionsRequired.java:36)
[junit4:junit4]   2> 		at org.apache.lucene.util.TestRuleMarkFailure$1.evaluate(TestRuleMarkFailure.java:48)
[junit4:junit4]   2> 		at org.apache.lucene.util.TestRuleIgnoreAfterMaxFailures$1.evaluate(TestRuleIgnoreAfterMaxFailures.java:70)
[junit4:junit4]   2> 		at org.apache.lucene.util.TestRuleIgnoreTestSuites$1.evaluate(TestRuleIgnoreTestSuites.java:55)
[junit4:junit4]   2> 		at com.carrotsearch.randomizedtesting.RandomizedRunner.runSuite(RandomizedRunner.java:605)
[junit4:junit4]   2> 		at com.carrotsearch.randomizedtesting.RandomizedRunner.access$400(RandomizedRunner.java:132)
[junit4:junit4]   2> 		at com.carrotsearch.randomizedtesting.RandomizedRunner$2.run(RandomizedRunner.java:551)
[junit4:junit4]   2> 	
[junit4:junit4]   2> 591 T84 oashd.AbstractDataImportHandlerTestCase.tearDown Looking for dataimport.properties at: /mnt/ssd/jenkins/workspace/Lucene-Solr-4.x-Linux-Java6-64/checkout/solr/build/contrib/solr-dataimporthandler/test/J0/solr/collection1/conf/dataimport.properties
[junit4:junit4]   2> 592 T84 oas.SolrTestCaseJ4.tearDown ###Ending testCompositePk_DeltaImport_replace_nodelete
[junit4:junit4]   2> NOTE: reproduce with: ant test  -Dtestcase=TestSqlEntityProcessorDelta2 -Dtests.method=testCompositePk_DeltaImport_replace_nodelete -Dtests.seed=89D3329D540FF084 -Dtests.multiplier=3 -Dtests.slow=true -Dtests.locale=mk -Dtests.timezone=Australia/South -Dtests.file.encoding=ISO-8859-1
[junit4:junit4]   2>
[junit4:junit4] ERROR   0.02s J0 | TestSqlEntityProcessorDelta2.testCompositePk_DeltaImport_add
[junit4:junit4]    > Throwable #1: org.apache.solr.common.SolrException: org.apache.lucene.store.AlreadyClosedException: this IndexWriter is closed
[junit4:junit4]    > 	at __randomizedtesting.SeedInfo.seed([89D3329D540FF084:5B35E7C7EE2523CF]:0)
[junit4:junit4]    > 	at org.apache.solr.util.TestHarness.update(TestHarness.java:248)
[junit4:junit4]    > 	at org.apache.solr.util.TestHarness.checkUpdateStatus(TestHarness.java:294)
[junit4:junit4]    > 	at org.apache.solr.util.TestHarness.validateUpdate(TestHarness.java:264)
[junit4:junit4]    > 	at org.apache.solr.SolrTestCaseJ4.checkUpdateU(SolrTestCaseJ4.java:440)
[junit4:junit4]    > 	at org.apache.solr.SolrTestCaseJ4.assertU(SolrTestCaseJ4.java:419)
[junit4:junit4]    > 	at org.apache.solr.SolrTestCaseJ4.assertU(SolrTestCaseJ4.java:413)
[junit4:junit4]    > 	at org.apache.solr.SolrTestCaseJ4.clearIndex(SolrTestCaseJ4.java:785)
[junit4:junit4]    > 	at org.apache.solr.handler.dataimport.TestSqlEntityProcessorDelta2.setUp(TestSqlEntityProcessorDelta2.java:68)
[junit4:junit4]    > 	at sun.reflect.NativeMethodAccessorImpl.invoke0(Native Method)
[junit4:junit4]    > 	at sun.reflect.NativeMethodAccessorImpl.invoke(NativeMethodAccessorImpl.java:39)
[junit4:junit4]    > 	at sun.reflect.DelegatingMethodAccessorImpl.invoke(DelegatingMethodAccessorImpl.java:25)
[junit4:junit4]    > 	at java.lang.reflect.Method.invoke(Method.java:597)
[junit4:junit4]    > 	at com.carrotsearch.randomizedtesting.RandomizedRunner.invoke(RandomizedRunner.java:1995)
[junit4:junit4]    > 	at com.carrotsearch.randomizedtesting.RandomizedRunner.access$1100(RandomizedRunner.java:132)
[junit4:junit4]    > 	at com.carrotsearch.randomizedtesting.RandomizedRunner$7.evaluate(RandomizedRunner.java:875)
[junit4:junit4]    > 	at com.carrotsearch.randomizedtesting.RandomizedRunner$8.evaluate(RandomizedRunner.java:891)
[junit4:junit4]    > 	at com.carrotsearch.randomizedtesting.rules.SystemPropertiesRestoreRule$1.evaluate(SystemPropertiesRestoreRule.java:53)
[junit4:junit4]    > 	at org.apache.lucene.util.TestRuleSetupTeardownChained$1.evaluate(TestRuleSetupTeardownChained.java:50)
[junit4:junit4]    > 	at org.apache.lucene.util.TestRuleFieldCacheSanity$1.evaluate(TestRuleFieldCacheSanity.java:32)
[junit4:junit4]    > 	at org.apache.lucene.util.AbstractBeforeAfterRule$1.evaluate(AbstractBeforeAfterRule.java:45)
[junit4:junit4]    > 	at com.carrotsearch.randomizedtesting.rules.SystemPropertiesInvariantRule$1.evaluate(SystemPropertiesInvariantRule.java:55)
[junit4:junit4]    > 	at org.apache.lucene.util.TestRuleReportUncaughtExceptions$1.evaluate(TestRuleReportUncaughtExceptions.java:68)
[junit4:junit4]    > 	at org.apache.lucene.util.TestRuleThreadAndTestName$1.evaluate(TestRuleThreadAndTestName.java:48)
[junit4:junit4]    > 	at org.apache.lucene.util.TestRuleIgnoreAfterMaxFailures$1.evaluate(TestRuleIgnoreAfterMaxFailures.java:70)
[junit4:junit4]    > 	at org.apache.lucene.util.TestRuleMarkFailure$1.evaluate(TestRuleMarkFailure.java:48)
[junit4:junit4]    > 	at com.carrotsearch.randomizedtesting.RandomizedRunner.runSingleTest(RandomizedRunner.java:825)
[junit4:junit4]    > 	at com.carrotsearch.randomizedtesting.RandomizedRunner.access$700(RandomizedRunner.java:132)
[junit4:junit4]    > 	at com.carrotsearch.randomizedtesting.RandomizedRunner$3$1.run(RandomizedRunner.java:671)
[junit4:junit4]    > 	at com.carrotsearch.randomizedtesting.RandomizedRunner$3.evaluate(RandomizedRunner.java:697)
[junit4:junit4]    > 	at com.carrotsearch.randomizedtesting.RandomizedRunner$4.evaluate(RandomizedRunner.java:736)
[junit4:junit4]    > 	at com.carrotsearch.randomizedtesting.RandomizedRunner$5.evaluate(RandomizedRunner.java:747)
[junit4:junit4]    > 	at com.carrotsearch.randomizedtesting.rules.SystemPropertiesRestoreRule$1.evaluate(SystemPropertiesRestoreRule.java:53)
[junit4:junit4]    > 	at org.apache.lucene.util.AbstractBeforeAfterRule$1.evaluate(AbstractBeforeAfterRule.java:45)
[junit4:junit4]    > 	at org.apache.lucene.util.TestRuleReportUncaughtExceptions$1.evaluate(TestRuleReportUncaughtExceptions.java:68)
[junit4:junit4]    > 	at org.apache.lucene.util.TestRuleStoreClassName$1.evaluate(TestRuleStoreClassName.java:38)
[junit4:junit4]    > 	at org.apache.lucene.util.TestRuleIcuHack$1.evaluate(TestRuleIcuHack.java:51)
[junit4:junit4]    > 	at com.carrotsearch.randomizedtesting.rules.SystemPropertiesInvariantRule$1.evaluate(SystemPropertiesInvariantRule.java:55)
[junit4:junit4]    > 	at org.apache.lucene.util.TestRuleNoInstanceHooksOverrides$1.evaluate(TestRuleNoInstanceHooksOverrides.java:53)
[junit4:junit4]    > 	at org.apache.lucene.util.TestRuleNoStaticHooksShadowing$1.evaluate(TestRuleNoStaticHooksShadowing.java:52)
[junit4:junit4]    > 	at org.apache.lucene.util.TestRuleAssertionsRequired$1.evaluate(TestRuleAssertionsRequired.java:36)
[junit4:junit4]    > 	at org.apache.lucene.util.TestRuleMarkFailure$1.evaluate(TestRuleMarkFailure.java:48)
[junit4:junit4]    > 	at org.apache.lucene.util.TestRuleIgnoreAfterMaxFailures$1.evaluate(TestRuleIgnoreAfterMaxFailures.java:70)
[junit4:junit4]    > 	at org.apache.lucene.util.TestRuleIgnoreTestSuites$1.evaluate(TestRuleIgnoreTestSuites.java:55)
[junit4:junit4]    > 	at com.carrotsearch.randomizedtesting.RandomizedRunner.runSuite(RandomizedRunner.java:605)
[junit4:junit4]    > 	at com.carrotsearch.randomizedtesting.RandomizedRunner.access$400(RandomizedRunner.java:132)
[junit4:junit4]    > 	at com.carrotsearch.randomizedtesting.RandomizedRunner$2.run(RandomizedRunner.java:551)
[junit4:junit4]    > Caused by: org.apache.lucene.store.AlreadyClosedException: this IndexWriter is closed
[junit4:junit4]    > 	at org.apache.lucene.index.IndexWriter.ensureOpen(IndexWriter.java:553)
[junit4:junit4]    > 	at org.apache.lucene.index.IndexWriter.ensureOpen(IndexWriter.java:558)
[junit4:junit4]    > 	at org.apache.lucene.index.IndexWriter.deleteAll(IndexWriter.java:1883)
[junit4:junit4]    > 	at org.apache.solr.update.DirectUpdateHandler2.deleteAll(DirectUpdateHandler2.java:142)
[junit4:junit4]    > 	at org.apache.solr.update.DirectUpdateHandler2.deleteByQuery(DirectUpdateHandler2.java:361)
[junit4:junit4]    > 	at org.apache.solr.update.processor.RunUpdateProcessor.processDelete(RunUpdateProcessorFactory.java:67)
[junit4:junit4]    > 	at org.apache.solr.update.processor.UpdateRequestProcessor.processDelete(UpdateRequestProcessor.java:55)
[junit4:junit4]    > 	at org.apache.solr.update.processor.DistributedUpdateProcessor.doDeleteByQuery(DistributedUpdateProcessor.java:733)
[junit4:junit4]    > 	at org.apache.solr.update.processor.DistributedUpdateProcessor.processDelete(DistributedUpdateProcessor.java:606)
[junit4:junit4]    > 	at org.apache.solr.update.processor.UpdateRequestProcessor.processDelete(UpdateRequestProcessor.java:55)
[junit4:junit4]    > 	at org.apache.solr.handler.dataimport.AbstractDataImportHandlerTestCase$TestUpdateRequestProcessor.processDelete(AbstractDataImportHandlerTestCase.java:364)
[junit4:junit4]    > 	at org.apache.solr.handler.loader.XMLLoader.processDelete(XMLLoader.java:330)
[junit4:junit4]    > 	at org.apache.solr.handler.loader.XMLLoader.processUpdate(XMLLoader.java:261)
[junit4:junit4]    > 	at org.apache.solr.handler.loader.XMLLoader.load(XMLLoader.java:157)
[junit4:junit4]    > 	at org.apache.solr.handler.UpdateRequestHandler$1.load(UpdateRequestHandler.java:92)
[junit4:junit4]    > 	at org.apache.solr.handler.ContentStreamHandlerBase.handleRequestBody(ContentStreamHandlerBase.java:74)
[junit4:junit4]    > 	at org.apache.solr.handler.RequestHandlerBase.handleRequest(RequestHandlerBase.java:129)
[junit4:junit4]    > 	at org.apache.solr.core.SolrCore.execute(SolrCore.java:1624)
[junit4:junit4]    > 	at org.apache.solr.servlet.DirectSolrConnection.request(DirectSolrConnection.java:131)
[junit4:junit4]    > 	at org.apache.solr.util.TestHarness.update(TestHarness.java:244)
[junit4:junit4]    > 	... 45 more
[junit4:junit4]    > 
[junit4:junit4]   2> 613 T84 oas.SolrTestCaseJ4.setUp ###Starting testCompositePk_DeltaImport_add
[junit4:junit4]   2> 616 T84 C11 oasu.DirectUpdateHandler2.deleteAll [collection1] REMOVING ALL DOCUMENTS FROM INDEX
[junit4:junit4]   2> 616 T84 C11 UPDATE [collection1] webapp=null path=null params={} {} 0 0
[junit4:junit4]   2> 617 T84 C11 oasc.SolrException.log SEVERE org.apache.lucene.store.AlreadyClosedException: this IndexWriter is closed
[junit4:junit4]   2> 		at org.apache.lucene.index.IndexWriter.ensureOpen(IndexWriter.java:553)
[junit4:junit4]   2> 		at org.apache.lucene.index.IndexWriter.ensureOpen(IndexWriter.java:558)
[junit4:junit4]   2> 		at org.apache.lucene.index.IndexWriter.deleteAll(IndexWriter.java:1883)
[junit4:junit4]   2> 		at org.apache.solr.update.DirectUpdateHandler2.deleteAll(DirectUpdateHandler2.java:142)
[junit4:junit4]   2> 		at org.apache.solr.update.DirectUpdateHandler2.deleteByQuery(DirectUpdateHandler2.java:361)
[junit4:junit4]   2> 		at org.apache.solr.update.processor.RunUpdateProcessor.processDelete(RunUpdateProcessorFactory.java:67)
[junit4:junit4]   2> 		at org.apache.solr.update.processor.UpdateRequestProcessor.processDelete(UpdateRequestProcessor.java:55)
[junit4:junit4]   2> 		at org.apache.solr.update.processor.DistributedUpdateProcessor.doDeleteByQuery(DistributedUpdateProcessor.java:733)
[junit4:junit4]   2> 		at org.apache.solr.update.processor.DistributedUpdateProcessor.processDelete(DistributedUpdateProcessor.java:606)
[junit4:junit4]   2> 		at org.apache.solr.update.processor.UpdateRequestProcessor.processDelete(UpdateRequestProcessor.java:55)
[junit4:junit4]   2> 		at org.apache.solr.handler.dataimport.AbstractDataImportHandlerTestCase$TestUpdateRequestProcessor.processDelete(AbstractDataImportHandlerTestCase.java:364)
[junit4:junit4]   2> 		at org.apache.solr.handler.loader.XMLLoader.processDelete(XMLLoader.java:330)
[junit4:junit4]   2> 		at org.apache.solr.handler.loader.XMLLoader.processUpdate(XMLLoader.java:261)
[junit4:junit4]   2> 		at org.apache.solr.handler.loader.XMLLoader.load(XMLLoader.java:157)
[junit4:junit4]   2> 		at org.apache.solr.handler.UpdateRequestHandler$1.load(UpdateRequestHandler.java:92)
[junit4:junit4]   2> 		at org.apache.solr.handler.ContentStreamHandlerBase.handleRequestBody(ContentStreamHandlerBase.java:74)
[junit4:junit4]   2> 		at org.apache.solr.handler.RequestHandlerBase.handleRequest(RequestHandlerBase.java:129)
[junit4:junit4]   2> 		at org.apache.solr.core.SolrCore.execute(SolrCore.java:1624)
[junit4:junit4]   2> 		at org.apache.solr.servlet.DirectSolrConnection.request(DirectSolrConnection.java:131)
[junit4:junit4]   2> 		at org.apache.solr.util.TestHarness.update(TestHarness.java:244)
[junit4:junit4]   2> 		at org.apache.solr.util.TestHarness.checkUpdateStatus(TestHarness.java:294)
[junit4:junit4]   2> 		at org.apache.solr.util.TestHarness.validateUpdate(TestHarness.java:264)
[junit4:junit4]   2> 		at org.apache.solr.SolrTestCaseJ4.checkUpdateU(SolrTestCaseJ4.java:440)
[junit4:junit4]   2> 		at org.apache.solr.SolrTestCaseJ4.assertU(SolrTestCaseJ4.java:419)
[junit4:junit4]   2> 		at org.apache.solr.SolrTestCaseJ4.assertU(SolrTestCaseJ4.java:413)
[junit4:junit4]   2> 		at org.apache.solr.SolrTestCaseJ4.clearIndex(SolrTestCaseJ4.java:785)
[junit4:junit4]   2> 		at org.apache.solr.handler.dataimport.TestSqlEntityProcessorDelta2.setUp(TestSqlEntityProcessorDelta2.java:68)
[junit4:junit4]   2> 		at sun.reflect.NativeMethodAccessorImpl.invoke0(Native Method)
[junit4:junit4]   2> 		at sun.reflect.NativeMethodAccessorImpl.invoke(NativeMethodAccessorImpl.java:39)
[junit4:junit4]   2> 		at sun.reflect.DelegatingMethodAccessorImpl.invoke(DelegatingMethodAccessorImpl.java:25)
[junit4:junit4]   2> 		at java.lang.reflect.Method.invoke(Method.java:597)
[junit4:junit4]   2> 		at com.carrotsearch.randomizedtesting.RandomizedRunner.invoke(RandomizedRunner.java:1995)
[junit4:junit4]   2> 		at com.carrotsearch.randomizedtesting.RandomizedRunner.access$1100(RandomizedRunner.java:132)
[junit4:junit4]   2> 		at com.carrotsearch.randomizedtesting.RandomizedRunner$7.evaluate(RandomizedRunner.java:875)
[junit4:junit4]   2> 		at com.carrotsearch.randomizedtesting.RandomizedRunner$8.evaluate(RandomizedRunner.java:891)
[junit4:junit4]   2> 		at com.carrotsearch.randomizedtesting.rules.SystemPropertiesRestoreRule$1.evaluate(SystemPropertiesRestoreRule.java:53)
[junit4:junit4]   2> 		at org.apache.lucene.util.TestRuleSetupTeardownChained$1.evaluate(TestRuleSetupTeardownChained.java:50)
[junit4:junit4]   2> 		at org.apache.lucene.util.TestRuleFieldCacheSanity$1.evaluate(TestRuleFieldCacheSanity.java:32)
[junit4:junit4]   2> 		at org.apache.lucene.util.AbstractBeforeAfterRule$1.evaluate(AbstractBeforeAfterRule.java:45)
[junit4:junit4]   2> 		at com.carrotsearch.randomizedtesting.rules.SystemPropertiesInvariantRule$1.evaluate(SystemPropertiesInvariantRule.java:55)
[junit4:junit4]   2> 		at org.apache.lucene.util.TestRuleReportUncaughtExceptions$1.evaluate(TestRuleReportUncaughtExceptions.java:68)
[junit4:junit4]   2> 		at org.apache.lucene.util.TestRuleThreadAndTestName$1.evaluate(TestRuleThreadAndTestName.java:48)
[junit4:junit4]   2> 		at org.apache.lucene.util.TestRuleIgnoreAfterMaxFailures$1.evaluate(TestRuleIgnoreAfterMaxFailures.java:70)
[junit4:junit4]   2> 		at org.apache.lucene.util.TestRuleMarkFailure$1.evaluate(TestRuleMarkFailure.java:48)
[junit4:junit4]   2> 		at com.carrotsearch.randomizedtesting.RandomizedRunner.runSingleTest(RandomizedRunner.java:825)
[junit4:junit4]   2> 		at com.carrotsearch.randomizedtesting.RandomizedRunner.access$700(RandomizedRunner.java:132)
[junit4:junit4]   2> 		at com.carrotsearch.randomizedtesting.RandomizedRunner$3$1.run(RandomizedRunner.java:671)
[junit4:junit4]   2> 		at com.carrotsearch.randomizedtesting.RandomizedRunner$3.evaluate(RandomizedRunner.java:697)
[junit4:junit4]   2> 		at com.carrotsearch.randomizedtesting.RandomizedRunner$4.evaluate(RandomizedRunner.java:736)
[junit4:junit4]   2> 		at com.carrotsearch.randomizedtesting.RandomizedRunner$5.evaluate(RandomizedRunner.java:747)
[junit4:junit4]   2> 		at com.carrotsearch.randomizedtesting.rules.SystemPropertiesRestoreRule$1.evaluate(SystemPropertiesRestoreRule.java:53)
[junit4:junit4]   2> 		at org.apache.lucene.util.AbstractBeforeAfterRule$1.evaluate(AbstractBeforeAfterRule.java:45)
[junit4:junit4]   2> 		at org.apache.lucene.util.TestRuleReportUncaughtExceptions$1.evaluate(TestRuleReportUncaughtExceptions.java:68)
[junit4:junit4]   2> 		at org.apache.lucene.util.TestRuleStoreClassName$1.evaluate(TestRuleStoreClassName.java:38)
[junit4:junit4]   2> 		at org.apache.lucene.util.TestRuleIcuHack$1.evaluate(TestRuleIcuHack.java:51)
[junit4:junit4]   2> 		at com.carrotsearch.randomizedtesting.rules.SystemPropertiesInvariantRule$1.evaluate(SystemPropertiesInvariantRule.java:55)
[junit4:junit4]   2> 		at org.apache.lucene.util.TestRuleNoInstanceHooksOverrides$1.evaluate(TestRuleNoInstanceHooksOverrides.java:53)
[junit4:junit4]   2> 		at org.apache.lucene.util.TestRuleNoStaticHooksShadowing$1.evaluate(TestRuleNoStaticHooksShadowing.java:52)
[junit4:junit4]   2> 		at org.apache.lucene.util.TestRuleAssertionsRequired$1.evaluate(TestRuleAssertionsRequired.java:36)
[junit4:junit4]   2> 		at org.apache.lucene.util.TestRuleMarkFailure$1.evaluate(TestRuleMarkFailure.java:48)
[junit4:junit4]   2> 		at org.apache.lucene.util.TestRuleIgnoreAfterMaxFailures$1.evaluate(TestRuleIgnoreAfterMaxFailures.java:70)
[junit4:junit4]   2> 		at org.apache.lucene.util.TestRuleIgnoreTestSuites$1.evaluate(TestRuleIgnoreTestSuites.java:55)
[junit4:junit4]   2> 		at com.carrotsearch.randomizedtesting.RandomizedRunner.runSuite(RandomizedRunner.java:605)
[junit4:junit4]   2> 		at com.carrotsearch.randomizedtesting.RandomizedRunner.access$400(RandomizedRunner.java:132)
[junit4:junit4]   2> 		at com.carrotsearch.randomizedtesting.RandomizedRunner$2.run(RandomizedRunner.java:551)
[junit4:junit4]   2> 	
[junit4:junit4]   2> 618 T84 oashd.AbstractDataImportHandlerTestCase.tearDown Looking for dataimport.properties at: /mnt/ssd/jenkins/workspace/Lucene-Solr-4.x-Linux-Java6-64/checkout/solr/build/contrib/solr-dataimporthandler/test/J0/solr/collection1/conf/dataimport.properties
[junit4:junit4]   2> 619 T84 oas.SolrTestCaseJ4.tearDown ###Ending testCompositePk_DeltaImport_add
[junit4:junit4]   2> NOTE: reproduce with: ant test  -Dtestcase=TestSqlEntityProcessorDelta2 -Dtests.method=testCompositePk_DeltaImport_add -Dtests.seed=89D3329D540FF084 -Dtests.multiplier=3 -Dtests.slow=true -Dtests.locale=mk -Dtests.timezone=Australia/South -Dtests.file.encoding=ISO-8859-1
[junit4:junit4]   2>
[junit4:junit4]    > (@AfterClass output)
[junit4:junit4]   2> 630 T84 oas.SolrTestCaseJ4.deleteCore ###deleteCore
[junit4:junit4]   2> 630 T84 oasc.CoreContainer.shutdown Shutting down CoreContainer instance=1156690526
[junit4:junit4]   2> 630 T84 oasc.SolrCore.close [collection1]  CLOSING SolrCore org.apache.solr.core.SolrCore@171fcdde
[junit4:junit4]   2> 631 T84 oasc.SolrCore.closeSearcher [collection1] Closing main searcher on request.
[junit4:junit4]   2> 640 T84 oasu.DirectUpdateHandler2.close closing DirectUpdateHandler2{commits=2,autocommits=0,soft autocommits=0,optimizes=0,rollbacks=1,expungeDeletes=0,docsPending=0,adds=0,deletesById=0,deletesByQuery=7,errors=8,cumulative_adds=1,cumulative_deletesById=0,cumulative_deletesByQuery=9,cumulative_errors=7}
[junit4:junit4]   2> 640 T84 oasu.DefaultSolrCoreState.decref SEVERE Error during shutdown of writer. java.lang.IllegalArgumentException: Unknown directory: MockDirWrapper(org.apache.lucene.store.RAMDirectory@3403f5a0 lockFactory=org.apache.lucene.store.NativeFSLockFactory@2025b64d) {MockDirWrapper(org.apache.lucene.store.RAMDirectory@3d4c7deb lockFactory=org.apache.lucene.store.NativeFSLockFactory@40bf015)=org.apache.solr.core.CachingDirectoryFactory$CacheValue@a431693}
[junit4:junit4]   2> 	at org.apache.solr.core.CachingDirectoryFactory.close(CachingDirectoryFactory.java:119)
[junit4:junit4]   2> 	at org.apache.solr.core.CachingDirectoryFactory.release(CachingDirectoryFactory.java:233)
[junit4:junit4]   2> 	at org.apache.solr.update.SolrIndexWriter.close(SolrIndexWriter.java:132)
[junit4:junit4]   2> 	at org.apache.solr.update.DirectUpdateHandler2.closeWriter(DirectUpdateHandler2.java:733)
[junit4:junit4]   2> 	at org.apache.solr.update.DefaultSolrCoreState.decref(DefaultSolrCoreState.java:123)
[junit4:junit4]   2> 	at org.apache.solr.update.DirectUpdateHandler2.close(DirectUpdateHandler2.java:662)
[junit4:junit4]   2> 	at org.apache.solr.core.SolrCore.close(SolrCore.java:843)
[junit4:junit4]   2> 	at org.apache.solr.core.CoreContainer.shutdown(CoreContainer.java:590)
[junit4:junit4]   2> 	at org.apache.solr.util.TestHarness.close(TestHarness.java:431)
[junit4:junit4]   2> 	at org.apache.solr.SolrTestCaseJ4.deleteCore(SolrTestCaseJ4.java:386)
[junit4:junit4]   2> 	at org.apache.solr.SolrTestCaseJ4.afterClass(SolrTestCaseJ4.java:80)
[junit4:junit4]   2> 	at sun.reflect.NativeMethodAccessorImpl.invoke0(Native Method)
[junit4:junit4]   2> 	at sun.reflect.NativeMethodAccessorImpl.invoke(NativeMethodAccessorImpl.java:39)
[junit4:junit4]   2> 	at sun.reflect.DelegatingMethodAccessorImpl.invoke(DelegatingMethodAccessorImpl.java:25)
[junit4:junit4]   2> 	at java.lang.reflect.Method.invoke(Method.java:597)
[junit4:junit4]   2> 	at com.carrotsearch.randomizedtesting.RandomizedRunner.invoke(RandomizedRunner.java:1995)
[junit4:junit4]   2> 	at com.carrotsearch.randomizedtesting.RandomizedRunner.access$1100(RandomizedRunner.java:132)
[junit4:junit4]   2> 	at com.carrotsearch.randomizedtesting.RandomizedRunner$5.evaluate(RandomizedRunner.java:754)
[junit4:junit4]   2> 	at com.carrotsearch.randomizedtesting.rules.SystemPropertiesRestoreRule$1.evaluate(SystemPropertiesRestoreRule.java:53)
[junit4:junit4]   2> 	at org.apache.lucene.util.AbstractBeforeAfterRule$1.evaluate(AbstractBeforeAfterRule.java:45)
[junit4:junit4]   2> 	at org.apache.lucene.util.TestRuleReportUncaughtExceptions$1.evaluate(TestRuleReportUncaughtExceptions.java:68)
[junit4:junit4]   2> 	at org.apache.lucene.util.TestRuleStoreClassName$1.evaluate(TestRuleStoreClassName.java:38)
[junit4:junit4]   2> 	at org.apache.lucene.util.TestRuleIcuHack$1.evaluate(TestRuleIcuHack.java:51)
[junit4:junit4]   2> 	at com.carrotsearch.randomizedtesting.rules.SystemPropertiesInvariantRule$1.evaluate(SystemPropertiesInvariantRule.java:55)
[junit4:junit4]   2> 	at org.apache.lucene.util.TestRuleNoInstanceHooksOverrides$1.evaluate(TestRuleNoInstanceHooksOverrides.java:53)
[junit4:junit4]   2> 	at org.apache.lucene.util.TestRuleNoStaticHooksShadowing$1.evaluate(TestRuleNoStaticHooksShadowing.java:52)
[junit4:junit4]   2> 	at org.apache.lucene.util.TestRuleAssertionsRequired$1.evaluate(TestRuleAssertionsRequired.java:36)
[junit4:junit4]   2> 	at org.apache.lucene.util.TestRuleMarkFailure$1.evaluate(TestRuleMarkFailure.java:48)
[junit4:junit4]   2> 	at org.apache.lucene.util.TestRuleIgnoreAfterMaxFailures$1.evaluate(TestRuleIgnoreAfterMaxFailures.java:70)
[junit4:junit4]   2> 	at org.apache.lucene.util.TestRuleIgnoreTestSuites$1.evaluate(TestRuleIgnoreTestSuites.java:55)
[junit4:junit4]   2> 	at com.carrotsearch.randomizedtesting.RandomizedRunner.runSuite(RandomizedRunner.java:605)
[junit4:junit4]   2> 	at com.carrotsearch.randomizedtesting.RandomizedRunner.access$400(RandomizedRunner.java:132)
[junit4:junit4]   2> 	at com.carrotsearch.randomizedtesting.RandomizedRunner$2.run(RandomizedRunner.java:551)
[junit4:junit4]   2> 
[junit4:junit4]   2> NOTE: test params are: codec=Asserting, sim=RandomSimilarityProvider(queryNorm=true,coord=false): {}, locale=mk, timezone=Australia/South
[junit4:junit4]   2> NOTE: Linux 3.2.0-26-generic amd64/Sun Microsystems Inc. 1.6.0_33 (64-bit)/cpus=8,threads=1,free=101581560,total=186187776
[junit4:junit4]   2> NOTE: All tests run in this JVM: [TestLineEntityProcessor, TestSqlEntityProcessor, TestFileListEntityProcessor, TestVariableResolver, TestSolrEntityProcessorEndToEnd, TestPlainTextEntityProcessor, TestRegexTransformer, TestSqlEntityProcessorDelta2]
[junit4:junit4]   2> 
[junit4:junit4] Completed on J0 in 0.68s, 8 tests, 7 errors <<< FAILURES!

[...truncated 57 lines...]
BUILD FAILED
/mnt/ssd/jenkins/workspace/Lucene-Solr-4.x-Linux-Java6-64/checkout/build.xml:29: The following error occurred while executing this line:
/mnt/ssd/jenkins/workspace/Lucene-Solr-4.x-Linux-Java6-64/checkout/solr/build.xml:163: The following error occurred while executing this line:
/mnt/ssd/jenkins/workspace/Lucene-Solr-4.x-Linux-Java6-64/checkout/solr/common-build.xml:350: The following error occurred while executing this line:
/mnt/ssd/jenkins/workspace/Lucene-Solr-4.x-Linux-Java6-64/checkout/lucene/module-build.xml:62: The following error occurred while executing this line:
/mnt/ssd/jenkins/workspace/Lucene-Solr-4.x-Linux-Java6-64/checkout/lucene/common-build.xml:1094: The following error occurred while executing this line:
/mnt/ssd/jenkins/workspace/Lucene-Solr-4.x-Linux-Java6-64/checkout/lucene/common-build.xml:789: There were test failures: 36 suites, 167 tests, 7 errors, 5 ignored

Total time: 33 minutes 10 seconds
Build step 'Execute shell' marked build as failure
Archiving artifacts
Recording test results
Email was triggered for: Failure
Sending email for trigger: Failure




Mime
View raw message