lucene-dev mailing list archives

Site index · List index
Message view « Date » · « Thread »
Top « Date » · « Thread »
From Apache Jenkins Server <jenk...@builds.apache.org>
Subject [JENKINS] Solr-4.x - Build # 38 - Failure
Date Sun, 15 Jul 2012 12:18:14 GMT
Build: https://builds.apache.org/job/Solr-4.x/38/

1 tests failed.
REGRESSION:  org.apache.solr.update.SoftAutoCommitTest.testSoftAndHardCommitMaxTimeDelete

Error Message:
searcher529 wasn't soon enough after soft529: 1342354477973 !< 1342354477737 + 100 (fudge)

Stack Trace:
java.lang.AssertionError: searcher529 wasn't soon enough after soft529: 1342354477973 !<
1342354477737 + 100 (fudge)
	at __randomizedtesting.SeedInfo.seed([4D67D411107EA734:8A2B6C8C0BD66A84]:0)
	at org.junit.Assert.fail(Assert.java:93)
	at org.junit.Assert.assertTrue(Assert.java:43)
	at org.apache.solr.update.SoftAutoCommitTest.testSoftAndHardCommitMaxTimeDelete(SoftAutoCommitTest.java:256)
	at sun.reflect.NativeMethodAccessorImpl.invoke0(Native Method)
	at sun.reflect.NativeMethodAccessorImpl.invoke(NativeMethodAccessorImpl.java:57)
	at sun.reflect.DelegatingMethodAccessorImpl.invoke(DelegatingMethodAccessorImpl.java:43)
	at java.lang.reflect.Method.invoke(Method.java:616)
	at com.carrotsearch.randomizedtesting.RandomizedRunner.invoke(RandomizedRunner.java:1995)
	at com.carrotsearch.randomizedtesting.RandomizedRunner.access$1100(RandomizedRunner.java:132)
	at com.carrotsearch.randomizedtesting.RandomizedRunner$6.evaluate(RandomizedRunner.java:818)
	at com.carrotsearch.randomizedtesting.RandomizedRunner$7.evaluate(RandomizedRunner.java:877)
	at com.carrotsearch.randomizedtesting.RandomizedRunner$8.evaluate(RandomizedRunner.java:891)
	at com.carrotsearch.randomizedtesting.rules.SystemPropertiesRestoreRule$1.evaluate(SystemPropertiesRestoreRule.java:53)
	at org.apache.lucene.util.TestRuleSetupTeardownChained$1.evaluate(TestRuleSetupTeardownChained.java:50)
	at org.apache.lucene.util.TestRuleFieldCacheSanity$1.evaluate(TestRuleFieldCacheSanity.java:32)
	at org.apache.lucene.util.AbstractBeforeAfterRule$1.evaluate(AbstractBeforeAfterRule.java:45)
	at com.carrotsearch.randomizedtesting.rules.SystemPropertiesInvariantRule$1.evaluate(SystemPropertiesInvariantRule.java:55)
	at org.apache.lucene.util.TestRuleReportUncaughtExceptions$1.evaluate(TestRuleReportUncaughtExceptions.java:68)
	at org.apache.lucene.util.TestRuleThreadAndTestName$1.evaluate(TestRuleThreadAndTestName.java:48)
	at org.apache.lucene.util.TestRuleIgnoreAfterMaxFailures$1.evaluate(TestRuleIgnoreAfterMaxFailures.java:70)
	at org.apache.lucene.util.TestRuleMarkFailure$1.evaluate(TestRuleMarkFailure.java:48)
	at com.carrotsearch.randomizedtesting.RandomizedRunner.runSingleTest(RandomizedRunner.java:825)
	at com.carrotsearch.randomizedtesting.RandomizedRunner.access$700(RandomizedRunner.java:132)
	at com.carrotsearch.randomizedtesting.RandomizedRunner$3$1.run(RandomizedRunner.java:671)
	at com.carrotsearch.randomizedtesting.RandomizedRunner$3.evaluate(RandomizedRunner.java:697)
	at com.carrotsearch.randomizedtesting.RandomizedRunner$4.evaluate(RandomizedRunner.java:736)
	at com.carrotsearch.randomizedtesting.RandomizedRunner$5.evaluate(RandomizedRunner.java:747)
	at com.carrotsearch.randomizedtesting.rules.SystemPropertiesRestoreRule$1.evaluate(SystemPropertiesRestoreRule.java:53)
	at org.apache.lucene.util.AbstractBeforeAfterRule$1.evaluate(AbstractBeforeAfterRule.java:45)
	at org.apache.lucene.util.TestRuleReportUncaughtExceptions$1.evaluate(TestRuleReportUncaughtExceptions.java:68)
	at org.apache.lucene.util.TestRuleStoreClassName$1.evaluate(TestRuleStoreClassName.java:38)
	at org.apache.lucene.util.TestRuleIcuHack$1.evaluate(TestRuleIcuHack.java:51)
	at com.carrotsearch.randomizedtesting.rules.SystemPropertiesInvariantRule$1.evaluate(SystemPropertiesInvariantRule.java:55)
	at org.apache.lucene.util.TestRuleNoInstanceHooksOverrides$1.evaluate(TestRuleNoInstanceHooksOverrides.java:53)
	at org.apache.lucene.util.TestRuleNoStaticHooksShadowing$1.evaluate(TestRuleNoStaticHooksShadowing.java:52)
	at org.apache.lucene.util.TestRuleAssertionsRequired$1.evaluate(TestRuleAssertionsRequired.java:36)
	at org.apache.lucene.util.TestRuleMarkFailure$1.evaluate(TestRuleMarkFailure.java:48)
	at org.apache.lucene.util.TestRuleIgnoreAfterMaxFailures$1.evaluate(TestRuleIgnoreAfterMaxFailures.java:70)
	at org.apache.lucene.util.TestRuleIgnoreTestSuites$1.evaluate(TestRuleIgnoreTestSuites.java:55)
	at com.carrotsearch.randomizedtesting.RandomizedRunner.runSuite(RandomizedRunner.java:605)
	at com.carrotsearch.randomizedtesting.RandomizedRunner.access$400(RandomizedRunner.java:132)
	at com.carrotsearch.randomizedtesting.RandomizedRunner$2.run(RandomizedRunner.java:551)




Build Log:
[...truncated 8673 lines...]
[junit4:junit4]    > 	at org.apache.lucene.util.TestRuleStoreClassName$1.evaluate(TestRuleStoreClassName.java:38)
[junit4:junit4]    > 	at org.apache.lucene.util.TestRuleIcuHack$1.evaluate(TestRuleIcuHack.java:51)
[junit4:junit4]    > 	at com.carrotsearch.randomizedtesting.rules.SystemPropertiesInvariantRule$1.evaluate(SystemPropertiesInvariantRule.java:55)
[junit4:junit4]    > 	at org.apache.lucene.util.TestRuleNoInstanceHooksOverrides$1.evaluate(TestRuleNoInstanceHooksOverrides.java:53)
[junit4:junit4]    > 	at org.apache.lucene.util.TestRuleNoStaticHooksShadowing$1.evaluate(TestRuleNoStaticHooksShadowing.java:52)
[junit4:junit4]    > 	at org.apache.lucene.util.TestRuleAssertionsRequired$1.evaluate(TestRuleAssertionsRequired.java:36)
[junit4:junit4]    > 	at org.apache.lucene.util.TestRuleMarkFailure$1.evaluate(TestRuleMarkFailure.java:48)
[junit4:junit4]    > 	at org.apache.lucene.util.TestRuleIgnoreAfterMaxFailures$1.evaluate(TestRuleIgnoreAfterMaxFailures.java:70)
[junit4:junit4]    > 	at org.apache.lucene.util.TestRuleIgnoreTestSuites$1.evaluate(TestRuleIgnoreTestSuites.java:55)
[junit4:junit4]    > 	at com.carrotsearch.randomizedtesting.RandomizedRunner.runSuite(RandomizedRunner.java:605)
[junit4:junit4]    > 	at com.carrotsearch.randomizedtesting.RandomizedRunner.access$400(RandomizedRunner.java:132)
[junit4:junit4]    > 	at com.carrotsearch.randomizedtesting.RandomizedRunner$2.run(RandomizedRunner.java:551)
[junit4:junit4]    > 
[junit4:junit4]   2> 69328 T1885 oasu.AbstractSolrTestCase.setUp ####SETUP_START testSoftAndHardCommitMaxTimeDelete
[junit4:junit4]   2> 69329 T1885 oasc.SolrResourceLoader.<init> new SolrResourceLoader
for directory: '/usr/home/hudson/hudson-slave/workspace/Solr-4.x/checkout/solr/build/solr-core/test-files/solr/collection1/'
[junit4:junit4]   2> 69329 T1885 oasc.SolrResourceLoader.replaceClassLoader Adding 'file:/usr/home/hudson/hudson-slave/workspace/Solr-4.x/checkout/solr/build/solr-core/test-files/solr/collection1/lib/classes/'
to classloader
[junit4:junit4]   2> 69330 T1885 oasc.SolrResourceLoader.replaceClassLoader Adding 'file:/usr/home/hudson/hudson-slave/workspace/Solr-4.x/checkout/solr/build/solr-core/test-files/solr/collection1/lib/README'
to classloader
[junit4:junit4]   2> 69346 T1885 oasc.SolrConfig.<init> Using Lucene MatchVersion:
LUCENE_40
[junit4:junit4]   2> 69386 T1885 oasc.SolrConfig.<init> Loaded SolrConfig: solrconfig.xml
[junit4:junit4]   2> 69387 T1885 oass.IndexSchema.readSchema Reading Solr Schema
[junit4:junit4]   2> 69390 T1885 oass.IndexSchema.readSchema Schema name=test
[junit4:junit4]   2> 69659 T1885 oass.OpenExchangeRatesOrgProvider.init Initialized with
rates=open-exchange-rates.json, refreshInterval=1440.
[junit4:junit4]   2> 69664 T1885 oass.IndexSchema.readSchema default search field in schema
is text
[junit4:junit4]   2> 69667 T1885 oass.IndexSchema.readSchema unique key field: id
[junit4:junit4]   2> 69673 T1885 oass.FileExchangeRateProvider.reload Reloading exchange
rates from file currency.xml
[junit4:junit4]   2> 69676 T1885 oass.FileExchangeRateProvider.reload Reloading exchange
rates from file currency.xml
[junit4:junit4]   2> 69677 T1885 oass.OpenExchangeRatesOrgProvider.reload Reloading exchange
rates from open-exchange-rates.json
[junit4:junit4]   2> 69678 T1885 oass.OpenExchangeRatesOrgProvider.reload Reloading exchange
rates from open-exchange-rates.json
[junit4:junit4]   2> 69678 T1885 oasc.SolrResourceLoader.locateSolrHome JNDI not configured
for solr (NoInitialContextEx)
[junit4:junit4]   2> 69678 T1885 oasc.SolrResourceLoader.locateSolrHome using system property
solr.solr.home: /usr/home/hudson/hudson-slave/workspace/Solr-4.x/checkout/solr/build/solr-core/test-files/solr
[junit4:junit4]   2> 69679 T1885 oasc.SolrResourceLoader.<init> new SolrResourceLoader
for directory: '/usr/home/hudson/hudson-slave/workspace/Solr-4.x/checkout/solr/build/solr-core/test-files/solr/'
[junit4:junit4]   2> 69679 T1885 oasc.CoreContainer.<init> New CoreContainer 1561620669
[junit4:junit4]   2> 69679 T1885 oasc.SolrCore.<init> [collection1] Opening new SolrCore
at /usr/home/hudson/hudson-slave/workspace/Solr-4.x/checkout/solr/build/solr-core/test-files/solr/collection1/,
dataDir=/usr/home/hudson/hudson-slave/workspace/Solr-4.x/checkout/solr/build/solr-core/test/J0/./org.apache.solr.update.SoftAutoCommitTest-1342354476794/
[junit4:junit4]   2> 69679 T1885 oasc.JmxMonitoredMap.<init> JMX monitoring is enabled.
Adding Solr mbeans to JMX Server: com.sun.jmx.mbeanserver.JmxMBeanServer@64e265d0
[junit4:junit4]   2> 69680 T1885 oasc.SolrCore.getNewIndexDir WARNING New index directory
detected: old=null new=/usr/home/hudson/hudson-slave/workspace/Solr-4.x/checkout/solr/build/solr-core/test/J0/./org.apache.solr.update.SoftAutoCommitTest-1342354476794/index/
[junit4:junit4]   2> 69680 T1885 oasc.SolrCore.initIndex WARNING [collection1] Solr index
directory '/usr/home/hudson/hudson-slave/workspace/Solr-4.x/checkout/solr/build/solr-core/test/J0/./org.apache.solr.update.SoftAutoCommitTest-1342354476794/index'
doesn't exist. Creating new index...
[junit4:junit4]   2> 69681 T1885 oasc.SolrDeletionPolicy.onCommit SolrDeletionPolicy.onCommit:
commits:num=1
[junit4:junit4]   2> 		commit{dir=MockDirWrapper(org.apache.lucene.store.RAMDirectory@5c054b0d
lockFactory=org.apache.lucene.store.SingleInstanceLockFactory@6cf545d7),segFN=segments_1,generation=1,filenames=[segments_1]
[junit4:junit4]   2> 69682 T1885 oasc.SolrDeletionPolicy.updateCommits newest commit =
1
[junit4:junit4]   2> 69682 T1885 oasc.SolrCore.initWriters created xml: solr.XMLResponseWriter
[junit4:junit4]   2> 69683 T1885 oasup.UpdateRequestProcessorChain.init inserting DistributedUpdateProcessorFactory
into updateRequestProcessorChain "dedupe"
[junit4:junit4]   2> 69683 T1885 oasup.UpdateRequestProcessorChain.init inserting DistributedUpdateProcessorFactory
into updateRequestProcessorChain "dedupe-allfields"
[junit4:junit4]   2> 69683 T1885 oasup.UpdateRequestProcessorChain.init inserting DistributedUpdateProcessorFactory
into updateRequestProcessorChain "stored_sig"
[junit4:junit4]   2> 69684 T1885 oasup.UpdateRequestProcessorChain.init inserting DistributedUpdateProcessorFactory
into updateRequestProcessorChain "uniq-fields"
[junit4:junit4]   2> 69684 T1885 oasup.UpdateRequestProcessorChain.init inserting DistributedUpdateProcessorFactory
into updateRequestProcessorChain "distrib-dup-test-chain-implicit"
[junit4:junit4]   2> 69684 T1885 oasc.RequestHandlers.initHandlersFromConfig adding lazy
requestHandler: solr.ReplicationHandler
[junit4:junit4]   2> 69684 T1885 oasc.RequestHandlers.initHandlersFromConfig created /replication:
solr.ReplicationHandler
[junit4:junit4]   2> 69685 T1885 oasc.RequestHandlers.initHandlersFromConfig created standard:
solr.StandardRequestHandler
[junit4:junit4]   2> 69685 T1885 oasc.RequestHandlers.initHandlersFromConfig created /get:
solr.RealTimeGetHandler
[junit4:junit4]   2> 69685 T1885 oasc.RequestHandlers.initHandlersFromConfig created dismax:
solr.SearchHandler
[junit4:junit4]   2> 69686 T1885 oasc.RequestHandlers.initHandlersFromConfig created mock:
org.apache.solr.core.MockQuerySenderListenerReqHandler
[junit4:junit4]   2> 69686 T1885 oasc.RequestHandlers.initHandlersFromConfig created /admin/:
org.apache.solr.handler.admin.AdminHandlers
[junit4:junit4]   2> 69686 T1885 oasc.RequestHandlers.initHandlersFromConfig created defaults:
solr.StandardRequestHandler
[junit4:junit4]   2> 69686 T1885 oasc.RequestHandlers.initHandlersFromConfig adding lazy
requestHandler: solr.StandardRequestHandler
[junit4:junit4]   2> 69687 T1885 oasc.RequestHandlers.initHandlersFromConfig created lazy:
solr.StandardRequestHandler
[junit4:junit4]   2> 69687 T1885 oasc.RequestHandlers.initHandlersFromConfig created /update:
solr.UpdateRequestHandler
[junit4:junit4]   2> 69687 T1885 oasc.RequestHandlers.initHandlersFromConfig created /terms:
org.apache.solr.handler.component.SearchHandler
[junit4:junit4]   2> 69687 T1885 oasc.RequestHandlers.initHandlersFromConfig created spellCheckCompRH:
org.apache.solr.handler.component.SearchHandler
[junit4:junit4]   2> 69688 T1885 oasc.RequestHandlers.initHandlersFromConfig created spellCheckCompRH_Direct:
org.apache.solr.handler.component.SearchHandler
[junit4:junit4]   2> 69688 T1885 oasc.RequestHandlers.initHandlersFromConfig created spellCheckWithWordbreak:
org.apache.solr.handler.component.SearchHandler
[junit4:junit4]   2> 69688 T1885 oasc.RequestHandlers.initHandlersFromConfig created spellCheckWithWordbreak_Direct:
org.apache.solr.handler.component.SearchHandler
[junit4:junit4]   2> 69688 T1885 oasc.RequestHandlers.initHandlersFromConfig created spellCheckCompRH1:
org.apache.solr.handler.component.SearchHandler
[junit4:junit4]   2> 69689 T1885 oasc.RequestHandlers.initHandlersFromConfig created tvrh:
org.apache.solr.handler.component.SearchHandler
[junit4:junit4]   2> 69689 T1885 oasc.RequestHandlers.initHandlersFromConfig created /mlt:
solr.MoreLikeThisHandler
[junit4:junit4]   2> 69689 T1885 oasc.RequestHandlers.initHandlersFromConfig created /debug/dump:
solr.DumpRequestHandler
[junit4:junit4]   2> 69690 T1885 oashl.XMLLoader.init xsltCacheLifetimeSeconds=60
[junit4:junit4]   2> 69691 T1885 oasc.SolrCore.initDeprecatedSupport WARNING solrconfig.xml
uses deprecated <admin/gettableFiles>, Please update your config to use the ShowFileRequestHandler.
[junit4:junit4]   2> 69692 T1885 oasc.SolrCore.initDeprecatedSupport WARNING adding ShowFileRequestHandler
with hidden files: [THROW.ERROR.ON.ADD.UPDATEPROCESSOR.JS, SOLRCONFIG-HIGHLIGHT.XML, SCHEMA-REQUIRED-FIELDS.XML,
BAD-SCHEMA-DUP-DYNAMICFIELD.XML, SCHEMA-REPLICATION2.XML, TRIVIAL.UPDATEPROCESSOR1.JS, SCHEMA-MINIMAL.XML,
SOLRCONFIG-CACHING.XML, SOLRCONFIG-REPEATER.XML, BAD-SCHEMA-NONTEXT-ANALYZER.XML, SOLRCONFIG-MERGEPOLICY.XML,
CURRENCY.XML, SOLRCONFIG-TLOG.XML, SOLRCONFIG-MASTER.XML, SCHEMA11.XML, SOLRCONFIG-BASIC.XML,
DA_COMPOUNDDICTIONARY.TXT, MISSLEADING.EXTENSION.UPDATEPROCESSOR.JS.TXT, SCHEMA-COPYFIELD-TEST.XML,
SOLRCONFIG-SLAVE.XML, ELEVATE.XML, SOLRCONFIG-PROPINJECT-INDEXDEFAULT.XML, TRIVIAL.UPDATEPROCESSOR0.JS,
BAD-SOLRCONFIG-BOGUS-SCRIPTENGINE-NAME.XML, SCHEMA-IB.XML, SCHEMA-CHARFILTERS.XML, SOLRCONFIG-QUERYSENDER.XML,
SCHEMA-REPLICATION1.XML, DA_UTF8.XML, CONDITIONAL.UPDATEPROCESSOR.JS, MISSING.FUNCTIONS.UPDATEPROCESSOR.JS,
HYPHENATION.DTD, SOLRCONFIG-ENABLEPLUGIN.XML, STEMDICT.TXT, SCHEMA-PHRASESUGGEST.XML, HUNSPELL-TEST.AFF,
STOPTYPES-1.TXT, STOPWORDSWRONGENCODING.TXT, SCHEMA-NUMERIC.XML, SOLRCONFIG-TRANSFORMERS.XML,
SOLRCONFIG-PROPINJECT.XML, BAD-SCHEMA-NOT-INDEXED-BUT-TF.XML, SOLRCONFIG-SIMPLELOCK.XML, WDFTYPES.TXT,
SCHEMA-REVERSED.XML, STOPTYPES-2.TXT, SOLRCONFIG-SPELLCHECKCOMPONENT.XML, SOLRCONFIG-PHRASESUGGEST.XML,
SCHEMA-DFR.XML, BAD-SCHEMA-NOT-INDEXED-BUT-POS.XML, KEEP-1.TXT, OPEN-EXCHANGE-RATES.JSON,
STOPWITHBOM.TXT, SCHEMA-BINARYFIELD.XML, SOLRCONFIG-SPELLCHECKER.XML, SOLRCONFIG-UPDATE-PROCESSOR-CHAINS.XML,
BAD-SCHEMA-OMIT-TF-BUT-NOT-POS.XML, BAD-SCHEMA-DUP-FIELDTYPE.XML, SOLRCONFIG-MASTER1.XML,
SYNONYMS.TXT, SCHEMA.XML, SCHEMA_CODEC.XML, SOLRCONFIG-SOLR-749.XML, SOLRCONFIG-MASTER1-KEEPONEBACKUP.XML,
SOLRCONFIG-FUNCTIONQUERY.XML, STOP-2.TXT, SCHEMA-LMDIRICHLET.XML, SOLRCONFIG-TERMINDEX.XML,
SOLRCONFIG-ELEVATE.XML, STOPWORDS.TXT, SCHEMA-FOLDING.XML, SCHEMA-STOP-KEEP.XML, BAD-SCHEMA-NOT-INDEXED-BUT-NORMS.XML,
SOLRCONFIG-SOLCOREPROPERTIES.XML, STOP-1.TXT, SOLRCONFIG-MASTER2.XML, SCHEMA-SPELLCHECKER.XML,
SOLRCONFIG-LAZYWRITER.XML, SCHEMA-LUCENEMATCHVERSION.XML, BAD-MP-SOLRCONFIG.XML, FRENCHARTICLES.TXT,
SCHEMA15.XML, SOLRCONFIG-REQHANDLER.INCL, SCHEMASURROUND.XML, SCHEMA-COLLATEFILTER.XML, SOLRCONFIG-MASTER3.XML,
HUNSPELL-TEST.DIC, SOLRCONFIG-XINCLUDE.XML, BAD-SCHEMA-CODEC-GLOBAL-VS-FT-MISMATCH.XML, SOLRCONFIG-SLAVE1.XML,
SOLRCONFIG-DELPOLICY1.XML, SCHEMA-SIM.XML, SCHEMA-COLLATE.XML, STOP-SNOWBALL.TXT, BAD-SCHEMA-SIM-GLOBAL-VS-FT-MISMATCH.XML,
PROTWORDS.TXT, SCHEMA-TRIE.XML, SOLRCONFIG_CODEC.XML, BAD-SOLRCONFIG-INVALID-SCRIPTFILE.XML,
SCHEMA-TFIDF.XML, SOLRCONFIG-SCRIPT-UPDATEPROCESSOR.XML, SCHEMA-LMJELINEKMERCER.XML, PHRASESUGGEST.TXT,
BAD-SOLRCONFIG-MISSING-SCRIPTFILE.XML, SOLRCONFIG-BASIC-LUCENEVERSION31.XML, BAD-SCHEMA-UNIQUEKEY-USES-DEFAULT.XML,
OLD_SYNONYMS.TXT, SOLRCONFIG-DELPOLICY2.XML, XSLT, SOLRCONFIG-NATIVELOCK.XML, BAD-SCHEMA-DUP-FIELD.XML,
SOLRCONFIG-NOCACHE.XML, SCHEMA-BM25.XML, ADDFIELDS.UPDATEPROCESSOR.JS, SOLRCONFIG-ALTDIRECTORY.XML,
SOLRCONFIG-QUERYSENDER-NOQUERY.XML, COMPOUNDDICTIONARY.TXT, SOLRCONFIG_PERF.XML, SCHEMA-NOT-REQUIRED-UNIQUE-KEY.XML,
KEEP-2.TXT, BAD-SCHEMA-UNIQUEKEY-IS-COPYFIELD-DEST.XML, SCHEMA12.XML, MAPPING-ISOLATIN1ACCENT.TXT,
BAD_SOLRCONFIG.XML, BAD-SCHEMA-EXTERNAL-FILEFIELD.XML]
[junit4:junit4]   2> 69694 T1885 oass.SolrIndexSearcher.<init> Opening Searcher@4600a09b
main
[junit4:junit4]   2> 69694 T1885 oass.SolrIndexSearcher.getIndexDir WARNING WARNING: Directory
impl does not support setting indexDir: org.apache.lucene.store.MockDirectoryWrapper
[junit4:junit4]   2> 69694 T1885 oasu.CommitTracker.<init> Hard AutoCommit: disabled
[junit4:junit4]   2> 69694 T1885 oasu.CommitTracker.<init> Soft AutoCommit: disabled
[junit4:junit4]   2> 69695 T1885 oashc.SpellCheckComponent.inform Initializing spell checkers
[junit4:junit4]   2> 69698 T1885 oass.DirectSolrSpellChecker.init init: {name=direct,classname=DirectSolrSpellChecker,field=lowerfilt,minQueryLength=3}
[junit4:junit4]   2> 69743 T1885 oashc.HttpShardHandlerFactory.getParameter Setting socketTimeout
to: 0
[junit4:junit4]   2> 69743 T1885 oashc.HttpShardHandlerFactory.getParameter Setting urlScheme
to: http://
[junit4:junit4]   2> 69743 T1885 oashc.HttpShardHandlerFactory.getParameter Setting connTimeout
to: 0
[junit4:junit4]   2> 69744 T1885 oashc.HttpShardHandlerFactory.getParameter Setting maxConnectionsPerHost
to: 20
[junit4:junit4]   2> 69744 T1885 oashc.HttpShardHandlerFactory.getParameter Setting corePoolSize
to: 0
[junit4:junit4]   2> 69744 T1885 oashc.HttpShardHandlerFactory.getParameter Setting maximumPoolSize
to: 2147483647
[junit4:junit4]   2> 69744 T1885 oashc.HttpShardHandlerFactory.getParameter Setting maxThreadIdleTime
to: 5
[junit4:junit4]   2> 69744 T1885 oashc.HttpShardHandlerFactory.getParameter Setting sizeOfQueue
to: -1
[junit4:junit4]   2> 69745 T1885 oashc.HttpShardHandlerFactory.getParameter Setting fairnessPolicy
to: false
[junit4:junit4]   2> 69745 T1885 oascsi.HttpClientUtil.createClient Creating new http client,
config:maxConnectionsPerHost=20&maxConnections=10000&socketTimeout=0&connTimeout=0&retry=false
[junit4:junit4]   2> 69751 T1892 oasc.SolrCore.registerSearcher [collection1] Registered
new searcher Searcher@4600a09b main{StandardDirectoryReader(segments_1:1)}
[junit4:junit4]   2> 69752 T1885 oasc.CoreContainer.register registering core: collection1
[junit4:junit4]   2> 69753 T1885 oasu.AbstractSolrTestCase.setUp ####SETUP_END testSoftAndHardCommitMaxTimeDelete
[junit4:junit4]   2> ASYNC  NEW_CORE C98 name=collection1 org.apache.solr.core.SolrCore@68f5b808
[junit4:junit4]   2> 69756 T1885 C98 oasc.SolrDeletionPolicy.onInit SolrDeletionPolicy.onInit:
commits:num=1
[junit4:junit4]   2> 		commit{dir=MockDirWrapper(org.apache.lucene.store.RAMDirectory@5c054b0d
lockFactory=org.apache.lucene.store.SingleInstanceLockFactory@6cf545d7),segFN=segments_1,generation=1,filenames=[segments_1]
[junit4:junit4]   2> 69756 T1885 C98 oasc.SolrDeletionPolicy.updateCommits newest commit
= 1
[junit4:junit4]   2> 69757 T1885 C98 UPDATE [collection1] webapp=null path=null params={}
{add=[529]} 0 2
[junit4:junit4]   2> 69761 T1885 C98 oasu.DirectUpdateHandler2.commit start commit{flags=0,version=0,optimize=false,openSearcher=true,waitSearcher=true,expungeDeletes=false,softCommit=false}
[junit4:junit4]   2> 69763 T1885 C98 oasc.SolrDeletionPolicy.onCommit SolrDeletionPolicy.onCommit:
commits:num=2
[junit4:junit4]   2> 		commit{dir=MockDirWrapper(org.apache.lucene.store.RAMDirectory@5c054b0d
lockFactory=org.apache.lucene.store.SingleInstanceLockFactory@6cf545d7),segFN=segments_1,generation=1,filenames=[segments_1]
[junit4:junit4]   2> 		commit{dir=MockDirWrapper(org.apache.lucene.store.RAMDirectory@5c054b0d
lockFactory=org.apache.lucene.store.SingleInstanceLockFactory@6cf545d7),segFN=segments_2,generation=2,filenames=[_0_MockVariableIntBlock_0.doc,
_0_MockVariableIntBlock_0.skp, _0_NestedPulsing_0.tip, _0_NestedPulsing_0.tim, _0_MockVariableIntBlock_0.pyl,
_0_MockVariableIntBlock_0.tib, _0_SimpleText_0.pst, _0_MockVariableIntBlock_0.pos, _0.si,
_0_MockVariableIntBlock_0.tii, _0.fnm, _0_NestedPulsing_0.frq, _0_nrm.cfs, _0_MockRandom_0.skp,
_0_NestedPulsing_0.prx, _0_MockRandom_0.frq, _0_MockRandom_0.sd, _0_MockRandom_0.tip, _0_MockRandom_0.doc,
_0_MockRandom_0.pos, _0_MockVariableIntBlock_0.frq, _0_nrm.cfe, segments_2, _0.fdx, _0_MockRandom_0.pyl,
_0_MockRandom_0.tim, _0.fdt]
[junit4:junit4]   2> 69764 T1885 C98 oasc.SolrDeletionPolicy.updateCommits newest commit
= 2
[junit4:junit4]   2> 69765 T1885 C98 oass.SolrIndexSearcher.<init> Opening Searcher@30f7cf40
main
[junit4:junit4]   2> 69765 T1885 C98 oass.SolrIndexSearcher.getIndexDir WARNING WARNING:
Directory impl does not support setting indexDir: org.apache.lucene.store.MockDirectoryWrapper
[junit4:junit4]   2> 69766 T1885 C98 oasu.DirectUpdateHandler2.commit end_commit_flush
[junit4:junit4]   2> 69766 T1892 oasc.SolrCore.registerSearcher [collection1] Registered
new searcher Searcher@30f7cf40 main{StandardDirectoryReader(segments_2:3 _0(4.0):C1)}
[junit4:junit4]   2> 69767 T1885 C98 UPDATE [collection1] webapp=null path=null params={}
{commit=} 0 6
[junit4:junit4]   2> 69770 T1885 C98 UPDATE [collection1] webapp=null path=null params={}
{delete=[529]} 0 0
[junit4:junit4]   2> 70272 T1894 oasu.DirectUpdateHandler2.commit start commit{flags=0,version=0,optimize=false,openSearcher=true,waitSearcher=true,expungeDeletes=false,softCommit=true}
[junit4:junit4]   2> 70508 T1894 oass.SolrIndexSearcher.<init> Opening Searcher@5a30f467
main
[junit4:junit4]   2> 70508 T1894 oass.SolrIndexSearcher.getIndexDir WARNING WARNING: Directory
impl does not support setting indexDir: org.apache.lucene.store.MockDirectoryWrapper
[junit4:junit4]   2> 70508 T1894 oasu.DirectUpdateHandler2.commit end_commit_flush
[junit4:junit4]   2> 70509 T1892 oasc.SolrCore.registerSearcher [collection1] Registered
new searcher Searcher@5a30f467 main{StandardDirectoryReader(segments_2:5:nrt)}
[junit4:junit4]   2> 70511 T1885 C98 UPDATE [collection1] webapp=null path=null params={}
{add=[550]} 0 0
[junit4:junit4]   2> 70972 T1893 oasu.DirectUpdateHandler2.commit start commit{flags=0,version=0,optimize=false,openSearcher=true,waitSearcher=true,expungeDeletes=false,softCommit=false}
[junit4:junit4]   2> 70987 T1893 oasc.SolrDeletionPolicy.onCommit SolrDeletionPolicy.onCommit:
commits:num=2
[junit4:junit4]   2> 		commit{dir=MockDirWrapper(org.apache.lucene.store.RAMDirectory@5c054b0d
lockFactory=org.apache.lucene.store.SingleInstanceLockFactory@6cf545d7),segFN=segments_2,generation=2,filenames=[_0_MockVariableIntBlock_0.doc,
_0_MockVariableIntBlock_0.skp, _0_NestedPulsing_0.tip, _0_NestedPulsing_0.tim, _0_MockVariableIntBlock_0.pyl,
_0_MockVariableIntBlock_0.tib, _0_SimpleText_0.pst, _0_MockVariableIntBlock_0.pos, _0.si,
_0_MockVariableIntBlock_0.tii, _0.fnm, _0_NestedPulsing_0.frq, _0_nrm.cfs, _0_MockRandom_0.skp,
_0_NestedPulsing_0.prx, _0_MockRandom_0.frq, _0_MockRandom_0.sd, _0_MockRandom_0.tip, _0_MockRandom_0.doc,
_0_MockRandom_0.pos, _0_MockVariableIntBlock_0.frq, _0_nrm.cfe, segments_2, _0.fdx, _0_MockRandom_0.pyl,
_0_MockRandom_0.tim, _0.fdt]
[junit4:junit4]   2> 		commit{dir=MockDirWrapper(org.apache.lucene.store.RAMDirectory@5c054b0d
lockFactory=org.apache.lucene.store.SingleInstanceLockFactory@6cf545d7),segFN=segments_3,generation=3,filenames=[_1_MockVariableIntBlock_0.skp,
_1_NestedPulsing_0.tip, _1_NestedPulsing_0.prx, _1_MockVariableIntBlock_0.pyl, _1.fnm, _1_MockRandom_0.pos,
_1_MockVariableIntBlock_0.doc, _1_NestedPulsing_0.tim, _1_nrm.cfs, _1_MockRandom_0.tiv, _1_MockVariableIntBlock_0.tii,
_1_MockVariableIntBlock_0.pos, _1_MockRandom_0.sd, _1_MockRandom_0.skp, _1_MockVariableIntBlock_0.tib,
_1_nrm.cfe, _1.fdx, _1_MockVariableIntBlock_0.frq, _1_MockRandom_0.pyl, _1_NestedPulsing_0.frq,
_1_MockRandom_0.tib, _1.fdt, _1.si, _1_MockRandom_0.doc, _1_MockRandom_0.frq, segments_3,
_1_SimpleText_0.pst]
[junit4:junit4]   2> 70988 T1893 oasc.SolrDeletionPolicy.updateCommits newest commit =
3
[junit4:junit4]   2> 70988 T1885 oasu.AbstractSolrTestCase.tearDown ####TEARDOWN_START
testSoftAndHardCommitMaxTimeDelete
[junit4:junit4]   2> 70989 T1885 oasc.CoreContainer.shutdown Shutting down CoreContainer
instance=1561620669
[junit4:junit4]   2> 70989 T1885 oasc.SolrCore.close [collection1]  CLOSING SolrCore org.apache.solr.core.SolrCore@68f5b808
[junit4:junit4]   2> 70992 T1893 oass.SolrIndexSearcher.<init> Opening Searcher@414b40f4
main
[junit4:junit4]   2> 70992 T1893 oass.SolrIndexSearcher.getIndexDir WARNING WARNING: Directory
impl does not support setting indexDir: org.apache.lucene.store.MockDirectoryWrapper
[junit4:junit4]   2> 70992 T1885 oasc.SolrCore.closeSearcher [collection1] Closing main
searcher on request.
[junit4:junit4]   2> 70992 T1885 oasu.DirectUpdateHandler2.close closing DirectUpdateHandler2{commits=3,autocommit
maxTime=1200ms,autocommits=1,soft autocommit maxTime=500ms,soft autocommits=1,optimizes=0,rollbacks=0,expungeDeletes=0,docsPending=0,adds=1,deletesById=0,deletesByQuery=0,errors=0,cumulative_adds=2,cumulative_deletesById=1,cumulative_deletesByQuery=0,cumulative_errors=0}
[junit4:junit4]   2> 70993 T1893 oasc.SolrException.log SEVERE auto commit error...:org.apache.solr.common.SolrException:
java.util.concurrent.RejectedExecutionException
[junit4:junit4]   2> 		at org.apache.solr.core.SolrCore.getSearcher(SolrCore.java:1464)
[junit4:junit4]   2> 		at org.apache.solr.core.SolrCore.getSearcher(SolrCore.java:1136)
[junit4:junit4]   2> 		at org.apache.solr.update.DirectUpdateHandler2.commit(DirectUpdateHandler2.java:517)
[junit4:junit4]   2> 		at org.apache.solr.update.CommitTracker.run(CommitTracker.java:212)
[junit4:junit4]   2> 		at java.util.concurrent.Executors$RunnableAdapter.call(Executors.java:471)
[junit4:junit4]   2> 		at java.util.concurrent.FutureTask$Sync.innerRun(FutureTask.java:334)
[junit4:junit4]   2> 		at java.util.concurrent.FutureTask.run(FutureTask.java:166)
[junit4:junit4]   2> 		at java.util.concurrent.ScheduledThreadPoolExecutor$ScheduledFutureTask.access$101(ScheduledThreadPoolExecutor.java:165)
[junit4:junit4]   2> 		at java.util.concurrent.ScheduledThreadPoolExecutor$ScheduledFutureTask.run(ScheduledThreadPoolExecutor.java:266)
[junit4:junit4]   2> 		at java.util.concurrent.ThreadPoolExecutor.runWorker(ThreadPoolExecutor.java:1110)
[junit4:junit4]   2> 		at java.util.concurrent.ThreadPoolExecutor$Worker.run(ThreadPoolExecutor.java:603)
[junit4:junit4]   2> 		at java.lang.Thread.run(Thread.java:679)
[junit4:junit4]   2> 	Caused by: java.util.concurrent.RejectedExecutionException
[junit4:junit4]   2> 		at java.util.concurrent.ThreadPoolExecutor$AbortPolicy.rejectedExecution(ThreadPoolExecutor.java:1956)
[junit4:junit4]   2> 		at java.util.concurrent.ThreadPoolExecutor.reject(ThreadPoolExecutor.java:816)
[junit4:junit4]   2> 		at java.util.concurrent.ThreadPoolExecutor.execute(ThreadPoolExecutor.java:1337)
[junit4:junit4]   2> 		at java.util.concurrent.AbstractExecutorService.submit(AbstractExecutorService.java:120)
[junit4:junit4]   2> 		at java.util.concurrent.Executors$DelegatedExecutorService.submit(Executors.java:642)
[junit4:junit4]   2> 		at org.apache.solr.core.SolrCore.getSearcher(SolrCore.java:1380)
[junit4:junit4]   2> 		... 11 more
[junit4:junit4]   2> 	
[junit4:junit4]   2> NOTE: reproduce with: ant test  -Dtestcase=SoftAutoCommitTest -Dtests.method=testSoftAndHardCommitMaxTimeDelete
-Dtests.seed=4D67D411107EA734 -Dtests.nightly=true -Dtests.slow=true -Dtests.locale=bg -Dtests.timezone=America/Cayenne
-Dtests.file.encoding=UTF-8
[junit4:junit4]   2>
[junit4:junit4]    > (@AfterClass output)
[junit4:junit4]   2> NOTE: test params are: codec=Lucene40: {timestamp=PostingsFormat(name=NestedPulsing),
range_facet_l=PostingsFormat(name=NestedPulsing), id=PostingsFormat(name=SimpleText), range_facet_sl=MockVariableIntBlock(baseBlockSize=92),
text=MockVariableIntBlock(baseBlockSize=92), range_facet_si=PostingsFormat(name=MockRandom),
subject=PostingsFormat(name=MockRandom), multiDefault=PostingsFormat(name=MockRandom), intDefault=PostingsFormat(name=NestedPulsing)},
sim=DefaultSimilarity, locale=bg, timezone=America/Cayenne
[junit4:junit4]   2> NOTE: FreeBSD 9.0-RELEASE amd64/Sun Microsystems Inc. 1.6.0_32 (64-bit)/cpus=16,threads=1,free=160437224,total=403177472
[junit4:junit4]   2> NOTE: All tests run in this JVM: [ConvertedLegacyTest, RequestHandlersTest,
SuggesterTSTTest, DoubleMetaphoneFilterFactoryTest, TestWordDelimiterFilterFactory, TestBrazilianStemFilterFactory,
TestJoin, SuggesterWFSTTest, TestSynonymMap, TestSearchPerf, TestFrenchMinimalStemFilterFactory,
PrimitiveFieldTypeTest, TestStemmerOverrideFilterFactory, ZkNodePropsTest, PreAnalyzedFieldTest,
ScriptEngineTest, JSONWriterTest, MinimalSchemaTest, TestUpdate, TestCapitalizationFilterFactory,
FullSolrCloudDistribCmdsTest, TestDictionaryCompoundWordTokenFilterFactory, TestPhraseSuggestions,
TestBadConfig, CurrencyFieldTest, TestSurroundQueryParser, XmlUpdateRequestHandlerTest, TestArabicFilters,
TestMappingCharFilterFactory, TestExtendedDismaxParser, TestFoldingMultitermQuery, SpatialFilterTest,
TestSolrQueryParser, EchoParamsTest, DisMaxRequestHandlerTest, IndexBasedSpellCheckerTest,
AnalysisAfterCoreReloadTest, SnowballPorterFilterFactoryTest, PluginInfoTest, LegacyHTMLStripCharFilterTest,
SolrRequestParserTest, TestDelimitedPayloadTokenFilterFactory, DOMUtilTest, SimpleFacetsTest,
RequiredFieldsTest, TestDistributedGrouping, TestHTMLStripCharFilterFactory, TestItalianLightStemFilterFactory,
PingRequestHandlerTest, TestStandardFactories, TestMergePolicyConfig, DateFieldTest, TestIndexingPerformance,
TestKStemFilterFactory, DateMathParserTest, TestRTGBase, TestPerFieldSimilarity, TestFinnishLightStemFilterFactory,
QueryElevationComponentTest, TestJmxIntegration, RecoveryZkTest, TestCodecSupport, TestStressReorder,
TermsComponentTest, TestRemoveDuplicatesTokenFilterFactory, DistributedSpellCheckComponentTest,
TestReversedWildcardFilterFactory, TestCJKWidthFilterFactory, LukeRequestHandlerTest, TestIrishLowerCaseFilterFactory,
LeaderElectionIntegrationTest, TestSynonymFilterFactory, TestPHPSerializedResponseWriter,
TestFunctionQuery, SpellCheckComponentTest, TestReplicationHandler, TestRealTimeGet, TestRandomFaceting,
SoftAutoCommitTest]
[junit4:junit4]   2> 
[junit4:junit4] Completed on J0 in 7.63s, 3 tests, 1 failure <<< FAILURES!
[...truncated 462 lines...]

[...truncated 9286 lines...]

[...truncated 9286 lines...]

[...truncated 9286 lines...]

[...truncated 9286 lines...]

[...truncated 9267 lines...]
BUILD FAILED
/usr/home/hudson/hudson-slave/workspace/Solr-4.x/checkout/solr/build.xml:144: The following
error occurred while executing this line:
/usr/home/hudson/hudson-slave/workspace/Solr-4.x/checkout/lucene/module-build.xml:62: The
following error occurred while executing this line:
/usr/home/hudson/hudson-slave/workspace/Solr-4.x/checkout/lucene/common-build.xml:1093: The
following error occurred while executing this line:
/usr/home/hudson/hudson-slave/workspace/Solr-4.x/checkout/lucene/common-build.xml:788: There
were test failures: 302 suites, 1081 tests, 1 failure, 5 ignored

Total time: 11 minutes 42 seconds
Build step 'Execute shell' marked build as failure
[TASKS] Scanning folder '/home/hudson/hudson-slave/workspace/Solr-4.x' for files matching
the pattern '**/*.java' - excludes: 
[TASKS] Found 3892 files to scan for tasks
[TASKS] Found 1355 open tasks.
[TASKS] Computing warning deltas based on reference build #37
Archiving artifacts
Publishing Clover coverage report...
No Clover report will be published due to a Build Failure
Recording test results
Publishing Javadoc
Email was triggered for: Failure
Sending email for trigger: Failure



Mime
View raw message