lucene-dev mailing list archives

Site index · List index
Message view « Date » · « Thread »
Top « Date » · « Thread »
From Apache Jenkins Server <jenk...@builds.apache.org>
Subject [JENKINS] Lucene-Solr-tests-only-trunk-java7 - Build # 2855 - Still Failing
Date Mon, 02 Jul 2012 03:00:07 GMT
Build: https://builds.apache.org/job/Lucene-Solr-tests-only-trunk-java7/2855/

1 tests failed.
FAILED:  org.apache.solr.cloud.ChaosMonkeySafeLeaderTest.testDistribSearch

Error Message:
Server at http://localhost:12851/solr/collection1 returned non ok status:500, message:Server
Error

Stack Trace:
org.apache.solr.common.SolrException: Server at http://localhost:12851/solr/collection1 returned
non ok status:500, message:Server Error
	at __randomizedtesting.SeedInfo.seed([6BCB44DC7ADED2E3:EA2DCAC40D81B2DF]:0)
	at org.apache.solr.client.solrj.impl.HttpSolrServer.request(HttpSolrServer.java:376)
	at org.apache.solr.client.solrj.impl.HttpSolrServer.request(HttpSolrServer.java:182)
	at org.apache.solr.client.solrj.request.QueryRequest.process(QueryRequest.java:90)
	at org.apache.solr.client.solrj.SolrServer.query(SolrServer.java:324)
	at org.apache.solr.cloud.FullSolrCloudTest.checkShardConsistency(FullSolrCloudTest.java:1107)
	at org.apache.solr.cloud.ChaosMonkeySafeLeaderTest.doTest(ChaosMonkeySafeLeaderTest.java:114)
	at org.apache.solr.BaseDistributedSearchTestCase.testDistribSearch(BaseDistributedSearchTestCase.java:680)
	at sun.reflect.NativeMethodAccessorImpl.invoke0(Native Method)
	at sun.reflect.NativeMethodAccessorImpl.invoke(NativeMethodAccessorImpl.java:57)
	at sun.reflect.DelegatingMethodAccessorImpl.invoke(DelegatingMethodAccessorImpl.java:43)
	at java.lang.reflect.Method.invoke(Method.java:601)
	at com.carrotsearch.randomizedtesting.RandomizedRunner.invoke(RandomizedRunner.java:1969)
	at com.carrotsearch.randomizedtesting.RandomizedRunner.access$1100(RandomizedRunner.java:132)
	at com.carrotsearch.randomizedtesting.RandomizedRunner$6.evaluate(RandomizedRunner.java:814)
	at com.carrotsearch.randomizedtesting.RandomizedRunner$7.evaluate(RandomizedRunner.java:875)
	at com.carrotsearch.randomizedtesting.RandomizedRunner$8.evaluate(RandomizedRunner.java:889)
	at com.carrotsearch.randomizedtesting.rules.SystemPropertiesRestoreRule$1.evaluate(SystemPropertiesRestoreRule.java:53)
	at org.apache.lucene.util.TestRuleSetupTeardownChained$1.evaluate(TestRuleSetupTeardownChained.java:50)
	at org.apache.lucene.util.TestRuleFieldCacheSanity$1.evaluate(TestRuleFieldCacheSanity.java:32)
	at org.apache.lucene.util.AbstractBeforeAfterRule$1.evaluate(AbstractBeforeAfterRule.java:45)
	at com.carrotsearch.randomizedtesting.rules.SystemPropertiesInvariantRule$1.evaluate(SystemPropertiesInvariantRule.java:55)
	at org.apache.lucene.util.TestRuleReportUncaughtExceptions$1.evaluate(TestRuleReportUncaughtExceptions.java:68)
	at org.apache.lucene.util.TestRuleThreadAndTestName$1.evaluate(TestRuleThreadAndTestName.java:48)
	at org.apache.lucene.util.TestRuleIgnoreAfterMaxFailures$1.evaluate(TestRuleIgnoreAfterMaxFailures.java:70)
	at org.apache.lucene.util.TestRuleMarkFailure$1.evaluate(TestRuleMarkFailure.java:48)
	at com.carrotsearch.randomizedtesting.RandomizedRunner.runSingleTest(RandomizedRunner.java:821)
	at com.carrotsearch.randomizedtesting.RandomizedRunner.access$700(RandomizedRunner.java:132)
	at com.carrotsearch.randomizedtesting.RandomizedRunner$3$1.run(RandomizedRunner.java:669)
	at com.carrotsearch.randomizedtesting.RandomizedRunner$3.evaluate(RandomizedRunner.java:695)
	at com.carrotsearch.randomizedtesting.RandomizedRunner$4.evaluate(RandomizedRunner.java:734)
	at com.carrotsearch.randomizedtesting.RandomizedRunner$5.evaluate(RandomizedRunner.java:745)
	at com.carrotsearch.randomizedtesting.rules.SystemPropertiesRestoreRule$1.evaluate(SystemPropertiesRestoreRule.java:53)
	at org.apache.lucene.util.AbstractBeforeAfterRule$1.evaluate(AbstractBeforeAfterRule.java:45)
	at org.apache.lucene.util.TestRuleReportUncaughtExceptions$1.evaluate(TestRuleReportUncaughtExceptions.java:68)
	at org.apache.lucene.util.TestRuleStoreClassName$1.evaluate(TestRuleStoreClassName.java:38)
	at org.apache.lucene.util.TestRuleIcuHack$1.evaluate(TestRuleIcuHack.java:51)
	at com.carrotsearch.randomizedtesting.rules.SystemPropertiesInvariantRule$1.evaluate(SystemPropertiesInvariantRule.java:55)
	at org.apache.lucene.util.TestRuleNoInstanceHooksOverrides$1.evaluate(TestRuleNoInstanceHooksOverrides.java:53)
	at org.apache.lucene.util.TestRuleNoStaticHooksShadowing$1.evaluate(TestRuleNoStaticHooksShadowing.java:52)
	at org.apache.lucene.util.TestRuleAssertionsRequired$1.evaluate(TestRuleAssertionsRequired.java:36)
	at org.apache.lucene.util.TestRuleMarkFailure$1.evaluate(TestRuleMarkFailure.java:48)
	at org.apache.lucene.util.TestRuleIgnoreAfterMaxFailures$1.evaluate(TestRuleIgnoreAfterMaxFailures.java:70)
	at org.apache.lucene.util.TestRuleIgnoreTestSuites$1.evaluate(TestRuleIgnoreTestSuites.java:55)
	at com.carrotsearch.randomizedtesting.RandomizedRunner.runSuite(RandomizedRunner.java:605)
	at com.carrotsearch.randomizedtesting.RandomizedRunner.access$400(RandomizedRunner.java:132)
	at com.carrotsearch.randomizedtesting.RandomizedRunner$2.run(RandomizedRunner.java:551)




Build Log:
[...truncated 44804 lines...]
   [junit4]   2> 127253 T1413 oasc.RecoveryStrategy.close WARNING Stopping recovery for
core collection1 zkNodeName=127.0.0.1:33324_solr_collection1
   [junit4]   2> 127254 T1413 oasc.SolrCore.close [collection1]  CLOSING SolrCore org.apache.solr.core.SolrCore@39fda7d8
   [junit4]   2> 127256 T1413 oasc.SolrCore.closeSearcher [collection1] Closing main searcher
on request.
   [junit4]   2> 127257 T1413 oasu.DirectUpdateHandler2.close closing DirectUpdateHandler2{commits=2,autocommits=0,soft
autocommits=0,optimizes=0,rollbacks=0,expungeDeletes=0,docsPending=0,adds=0,deletesById=0,deletesByQuery=0,errors=0,cumulative_adds=336,cumulative_deletesById=161,cumulative_deletesByQuery=0,cumulative_errors=0}
   [junit4]   2> 127258 T1413 oasc.RecoveryStrategy.close WARNING Stopping recovery for
core collection1 zkNodeName=127.0.0.1:33324_solr_collection1
   [junit4]   2> 127359 T1745 oaz.ClientCnxn$EventThread.run EventThread shut down
   [junit4]   2> 127359 T1413 oaz.ZooKeeper.close Session: 0x13845985eb7001a closed
   [junit4]   2> 127359 T1413 oejsh.ContextHandler.doStop stopped o.e.j.s.ServletContextHandler{/solr,null}
   [junit4]   2> 127412 T1413 oasc.CoreContainer.shutdown Shutting down CoreContainer instance=165417724
   [junit4]   2> 127412 T1413 oasc.RecoveryStrategy.close WARNING Stopping recovery for
core collection1 zkNodeName=127.0.0.1:33328_solr_collection1
   [junit4]   2> 127412 T1413 oasc.SolrCore.close [collection1]  CLOSING SolrCore org.apache.solr.core.SolrCore@633d475
   [junit4]   2> 127415 T1413 oasc.SolrCore.closeSearcher [collection1] Closing main searcher
on request.
   [junit4]   2> 127416 T1413 oasu.DirectUpdateHandler2.close closing DirectUpdateHandler2{commits=2,autocommits=0,soft
autocommits=0,optimizes=0,rollbacks=0,expungeDeletes=0,docsPending=0,adds=0,deletesById=0,deletesByQuery=0,errors=0,cumulative_adds=357,cumulative_deletesById=174,cumulative_deletesByQuery=0,cumulative_errors=0}
   [junit4]   2> 127430 T1413 C77 P33328 oasc.SolrDeletionPolicy.onCommit SolrDeletionPolicy.onCommit:
commits:num=2
   [junit4]   2> 		commit{dir=/usr/home/hudson/hudson-slave/workspace/Lucene-Solr-tests-only-trunk-java7/checkout/solr/build/solr-core/test/J1/org.apache.solr.cloud.ChaosMonkeySafeLeaderTest-1341197409969/jetty25/index,segFN=segments_3,generation=3,filenames=[_x_nrm.cfe,
_w_Lucene40_0.prx, _12.fdt, _z.fnm, _12.fdx, _12.si, _10_Lucene40_0.tim, _y.fdt, _10_Lucene40_0.tip,
_y.fdx, _z_nrm.cfs, _13.si, _13.fnm, _w.fnm, _11_Lucene40_0.frq, _13_Lucene40_0.prx, _13_1.del,
_w.fdt, _y_Lucene40_0.tip, _11.fdx, _w.fdx, _w_2.del, _10_1.del, _11.fdt, _z_nrm.cfe, _10_Lucene40_0.frq,
_13_Lucene40_0.frq, _z_Lucene40_0.prx, _x_nrm.cfs, _12.fnm, _10_Lucene40_0.prx, _13.fdt, _13.fdx,
_w.si, _x.fdt, _z.fdt, _10.fdt, _x_Lucene40_0.tip, _x.si, _10_nrm.cfs, _11.si, _x.fdx, _z.fdx,
_y.si, _11_Lucene40_0.prx, _w_Lucene40_0.tip, _11_nrm.cfs, _y_nrm.cfe, _z_Lucene40_0.tip,
_z.si, _w_Lucene40_0.tim, _12_Lucene40_0.prx, _y_1.del, _10.fdx, _12_1.del, _12_Lucene40_0.tim,
_x_1.del, _12_Lucene40_0.tip, _z_1.del, _x_Lucene40_0.prx, _z_Lucene40_0.frq, _12_nrm.cfe,
_w_nrm.cfe, _13_nrm.cfs, _12_Lucene40_0.frq, _y.fnm, _w_Lucene40_0.frq, _x.fnm, _10.fnm, _y_Lucene40_0.tim,
_y_Lucene40_0.frq, _12_nrm.cfs, _w_nrm.cfs, _11_Lucene40_0.tip, _13_nrm.cfe, _11_Lucene40_0.tim,
_x_Lucene40_0.frq, _10.si, _10_nrm.cfe, _y_Lucene40_0.prx, _13_Lucene40_0.tip, _11_2.del,
_y_nrm.cfs, _11.fnm, _z_Lucene40_0.tim, _13_Lucene40_0.tim, _11_nrm.cfe, _x_Lucene40_0.tim,
segments_3]
   [junit4]   2> 		commit{dir=/usr/home/hudson/hudson-slave/workspace/Lucene-Solr-tests-only-trunk-java7/checkout/solr/build/solr-core/test/J1/org.apache.solr.cloud.ChaosMonkeySafeLeaderTest-1341197409969/jetty25/index,segFN=segments_4,generation=4,filenames=[_14.si,
_14_Lucene40_0.prx, _14_Lucene40_0.tip, _14_nrm.cfe, _14_Lucene40_0.tim, _14_nrm.cfs, _14.fdx,
_14.fnm, _14.fdt, _14_Lucene40_0.frq, segments_4]
   [junit4]   2> 127430 T1413 C77 P33328 oasc.SolrDeletionPolicy.updateCommits newest commit
= 4
   [junit4]   2> 127444 T1413 oasc.RecoveryStrategy.close WARNING Stopping recovery for
core collection1 zkNodeName=127.0.0.1:33328_solr_collection1
   [junit4]   2> 127545 T1759 oaz.ClientCnxn$EventThread.run EventThread shut down
   [junit4]   2> 127545 T1413 oaz.ZooKeeper.close Session: 0x13845985eb7001b closed
   [junit4]   2> 127545 T1413 oejsh.ContextHandler.doStop stopped o.e.j.s.ServletContextHandler{/solr,null}
   [junit4]   2> 127598 T1413 oasc.CoreContainer.shutdown Shutting down CoreContainer instance=2033404787
   [junit4]   2> 127598 T1413 oasc.RecoveryStrategy.close WARNING Stopping recovery for
core collection1 zkNodeName=127.0.0.1:58691_solr_collection1
   [junit4]   2> 127598 T1413 oasc.SolrCore.close [collection1]  CLOSING SolrCore org.apache.solr.core.SolrCore@324ae28
   [junit4]   2> 127600 T1413 oasc.SolrCore.closeSearcher [collection1] Closing main searcher
on request.
   [junit4]   2> 127601 T1413 oasu.DirectUpdateHandler2.close closing DirectUpdateHandler2{commits=2,autocommits=0,soft
autocommits=0,optimizes=0,rollbacks=0,expungeDeletes=0,docsPending=0,adds=0,deletesById=0,deletesByQuery=0,errors=0,cumulative_adds=323,cumulative_deletesById=152,cumulative_deletesByQuery=0,cumulative_errors=0}
   [junit4]   2> 127602 T1413 oasc.RecoveryStrategy.close WARNING Stopping recovery for
core collection1 zkNodeName=127.0.0.1:58691_solr_collection1
   [junit4]   2> 127703 T1773 oaz.ClientCnxn$EventThread.run EventThread shut down
   [junit4]   2> 127703 T1413 oaz.ZooKeeper.close Session: 0x13845985eb7001c closed
   [junit4]   2> 127703 T1413 oejsh.ContextHandler.doStop stopped o.e.j.s.ServletContextHandler{/solr,null}
   [junit4]   2> 127756 T1413 oasc.CoreContainer.shutdown Shutting down CoreContainer instance=88227479
   [junit4]   2> 127756 T1413 oasc.RecoveryStrategy.close WARNING Stopping recovery for
core collection1 zkNodeName=127.0.0.1:45079_solr_collection1
   [junit4]   2> 127756 T1413 oasc.SolrCore.close [collection1]  CLOSING SolrCore org.apache.solr.core.SolrCore@3fa2f4b0
   [junit4]   2> 127758 T1413 oasc.SolrCore.closeSearcher [collection1] Closing main searcher
on request.
   [junit4]   2> 127759 T1413 oasu.DirectUpdateHandler2.close closing DirectUpdateHandler2{commits=3,autocommits=0,soft
autocommits=0,optimizes=0,rollbacks=0,expungeDeletes=0,docsPending=0,adds=0,deletesById=0,deletesByQuery=0,errors=0,cumulative_adds=324,cumulative_deletesById=159,cumulative_deletesByQuery=0,cumulative_errors=0}
   [junit4]   2> 127760 T1413 oasc.RecoveryStrategy.close WARNING Stopping recovery for
core collection1 zkNodeName=127.0.0.1:45079_solr_collection1
   [junit4]   2> 127771 T1814 oaz.ClientCnxn$SendThread.run Client session timed out, have
not heard from server in 13108ms for sessionid 0x13845985eb7001f, closing socket connection
and attempting reconnect
   [junit4]   2> 127845 T1828 oaz.ClientCnxn$SendThread.run Client session timed out, have
not heard from server in 13401ms for sessionid 0x13845985eb70020, closing socket connection
and attempting reconnect
   [junit4]   2> 127861 T1787 oaz.ClientCnxn$EventThread.run EventThread shut down
   [junit4]   2> 127861 T1413 oaz.ZooKeeper.close Session: 0x13845985eb7001d closed
   [junit4]   2> 127861 T1413 oejsh.ContextHandler.doStop stopped o.e.j.s.ServletContextHandler{/solr,null}
   [junit4]   2> 127914 T1413 oasc.CoreContainer.shutdown Shutting down CoreContainer instance=1187347303
   [junit4]   2> 127914 T1413 oasc.RecoveryStrategy.close WARNING Stopping recovery for
core collection1 zkNodeName=127.0.0.1:24269_solr_collection1
   [junit4]   2> 127915 T1413 oasc.SolrCore.close [collection1]  CLOSING SolrCore org.apache.solr.core.SolrCore@64658ba0
   [junit4]   2> 127917 T1413 oasc.SolrCore.closeSearcher [collection1] Closing main searcher
on request.
   [junit4]   2> 127917 T1413 oasu.DirectUpdateHandler2.close closing DirectUpdateHandler2{commits=3,autocommits=0,soft
autocommits=0,optimizes=0,rollbacks=0,expungeDeletes=0,docsPending=0,adds=0,deletesById=0,deletesByQuery=0,errors=0,cumulative_adds=350,cumulative_deletesById=156,cumulative_deletesByQuery=0,cumulative_errors=0}
   [junit4]   2> 127918 T1413 oasc.RecoveryStrategy.close WARNING Stopping recovery for
core collection1 zkNodeName=127.0.0.1:24269_solr_collection1
   [junit4]   2> 128020 T1801 oaz.ClientCnxn$EventThread.run EventThread shut down
   [junit4]   2> 128020 T1413 oaz.ZooKeeper.close Session: 0x13845985eb7001e closed
   [junit4]   2> 128021 T1413 oejsh.ContextHandler.doStop stopped o.e.j.s.ServletContextHandler{/solr,null}
   [junit4]   2> 128073 T1413 oasc.CoreContainer.shutdown Shutting down CoreContainer instance=602294850
   [junit4]   2> 128073 T1413 oasc.RecoveryStrategy.close WARNING Stopping recovery for
core collection1 zkNodeName=127.0.0.1:13230_solr_collection1
   [junit4]   2> 128073 T1413 oasc.SolrCore.close [collection1]  CLOSING SolrCore org.apache.solr.core.SolrCore@143c9877
   [junit4]   2> 128075 T1413 oasc.SolrCore.closeSearcher [collection1] Closing main searcher
on request.
   [junit4]   2> 128075 T1413 oasu.DirectUpdateHandler2.close closing DirectUpdateHandler2{commits=3,autocommits=0,soft
autocommits=0,optimizes=0,rollbacks=0,expungeDeletes=0,docsPending=0,adds=0,deletesById=0,deletesByQuery=0,errors=0,cumulative_adds=342,cumulative_deletesById=169,cumulative_deletesByQuery=0,cumulative_errors=0}
   [junit4]   2> 128089 T1413 C81 P13230 oasc.SolrDeletionPolicy.onCommit SolrDeletionPolicy.onCommit:
commits:num=2
   [junit4]   2> 		commit{dir=/usr/home/hudson/hudson-slave/workspace/Lucene-Solr-tests-only-trunk-java7/checkout/solr/build/solr-core/test/J1/org.apache.solr.cloud.ChaosMonkeySafeLeaderTest-1341197409969/jetty29/index.20120702125108894,segFN=segments_4,generation=4,filenames=[_x_nrm.cfe,
_w_Lucene40_0.prx, _12.fdt, _z.fnm, _12.fdx, _12.si, _10_Lucene40_0.tim, _y.fdt, _10_Lucene40_0.tip,
_y.fdx, _z_nrm.cfs, _13.si, _13.fnm, _10_2.del, _w.fnm, _11_Lucene40_0.frq, _13_Lucene40_0.prx,
_w.fdt, _y_Lucene40_0.tip, _11.fdx, _w.fdx, _11.fdt, _z_nrm.cfe, _10_Lucene40_0.frq, _13_Lucene40_0.frq,
_z_Lucene40_0.prx, _x_nrm.cfs, _12.fnm, _10_Lucene40_0.prx, _13.fdt, _13.fdx, _w.si, _x.fdt,
_z.fdt, _10.fdt, _x_Lucene40_0.tip, _x.si, _10_nrm.cfs, _11.si, _x.fdx, _z.fdx, _y.si, _11_Lucene40_0.prx,
_w_Lucene40_0.tip, _11_nrm.cfs, _y_nrm.cfe, _z_Lucene40_0.tip, _z.si, _w_Lucene40_0.tim, _12_Lucene40_0.prx,
_10.fdx, _12_1.del, _12_Lucene40_0.tim, _x_1.del, _12_Lucene40_0.tip, _w_1.del, _x_Lucene40_0.prx,
_z_Lucene40_0.frq, _12_nrm.cfe, _w_nrm.cfe, _13_nrm.cfs, _12_Lucene40_0.frq, _y.fnm, _z_2.del,
_w_Lucene40_0.frq, _x.fnm, _10.fnm, _y_Lucene40_0.tim, _y_Lucene40_0.frq, _12_nrm.cfs, _w_nrm.cfs,
_11_Lucene40_0.tip, _13_nrm.cfe, _11_Lucene40_0.tim, _x_Lucene40_0.frq, _10.si, _10_nrm.cfe,
_y_Lucene40_0.prx, _13_Lucene40_0.tip, _11_2.del, _y_nrm.cfs, _11.fnm, _y_2.del, _z_Lucene40_0.tim,
_13_Lucene40_0.tim, _11_nrm.cfe, _x_Lucene40_0.tim, segments_4]
   [junit4]   2> 		commit{dir=/usr/home/hudson/hudson-slave/workspace/Lucene-Solr-tests-only-trunk-java7/checkout/solr/build/solr-core/test/J1/org.apache.solr.cloud.ChaosMonkeySafeLeaderTest-1341197409969/jetty29/index.20120702125108894,segFN=segments_5,generation=5,filenames=[_14.si,
_14_Lucene40_0.prx, _14_Lucene40_0.tip, _14_nrm.cfe, _14_Lucene40_0.tim, _14_nrm.cfs, _14.fdx,
segments_5, _14.fnm, _14.fdt, _14_Lucene40_0.frq]
   [junit4]   2> 128090 T1413 C81 P13230 oasc.SolrDeletionPolicy.updateCommits newest commit
= 5
   [junit4]   2> 128104 T1413 oasc.RecoveryStrategy.close WARNING Stopping recovery for
core collection1 zkNodeName=127.0.0.1:13230_solr_collection1
   [junit4]   2> 128728 T1842 oaz.ClientCnxn$SendThread.run Client session timed out, have
not heard from server in 13961ms for sessionid 0x13845985eb70021, closing socket connection
and attempting reconnect
   [junit4]   2> 129053 T1828 oaz.ClientCnxn$SendThread.startConnect Opening socket connection
to server localhost/127.0.0.1:19851
   [junit4]   2> 129213 T1814 oaz.ClientCnxn$SendThread.startConnect Opening socket connection
to server localhost/127.0.0.1:19851
   [junit4]   2> 130157 T1842 oaz.ClientCnxn$SendThread.startConnect Opening socket connection
to server localhost/127.0.0.1:19851
   [junit4]   2> 139974 T1815 oaz.ClientCnxn$EventThread.run EventThread shut down
   [junit4]   2> 139974 T1413 oaz.ZooKeeper.close Session: 0x13845985eb7001f closed
   [junit4]   2> 139975 T1413 oejsh.ContextHandler.doStop stopped o.e.j.s.ServletContextHandler{/solr,null}
   [junit4]   2> 140027 T1413 oasc.CoreContainer.shutdown Shutting down CoreContainer instance=2079453576
   [junit4]   2> 140027 T1413 oasc.RecoveryStrategy.close WARNING Stopping recovery for
core collection1 zkNodeName=127.0.0.1:21482_solr_collection1
   [junit4]   2> 140027 T1413 oasc.SolrCore.close [collection1]  CLOSING SolrCore org.apache.solr.core.SolrCore@a2ba3c3
   [junit4]   2> 140029 T1413 oasc.SolrCore.closeSearcher [collection1] Closing main searcher
on request.
   [junit4]   2> 140029 T1413 oasu.DirectUpdateHandler2.close closing DirectUpdateHandler2{commits=3,autocommits=0,soft
autocommits=0,optimizes=0,rollbacks=0,expungeDeletes=0,docsPending=0,adds=0,deletesById=0,deletesByQuery=0,errors=0,cumulative_adds=341,cumulative_deletesById=150,cumulative_deletesByQuery=0,cumulative_errors=0}
   [junit4]   2> 140043 T1413 C82 P21482 oasc.SolrDeletionPolicy.onCommit SolrDeletionPolicy.onCommit:
commits:num=2
   [junit4]   2> 		commit{dir=/usr/home/hudson/hudson-slave/workspace/Lucene-Solr-tests-only-trunk-java7/checkout/solr/build/solr-core/test/J1/org.apache.solr.cloud.ChaosMonkeySafeLeaderTest-1341197409969/jetty30/index.20120702125110354,segFN=segments_4,generation=4,filenames=[_x_nrm.cfe,
_12.fdt, _z.fnm, _12.fdx, _12.si, _10_Lucene40_0.tim, _y.fdt, _14_Lucene40_0.tip, _y.fdx,
_z_nrm.cfs, _10_Lucene40_0.tip, _13.si, _14_Lucene40_0.tim, _14.fdx, _13.fnm, _11_Lucene40_0.frq,
_13_Lucene40_0.prx, _14.fdt, _14_Lucene40_0.frq, _13_1.del, _y_Lucene40_0.tip, _11.fdx, _10_1.del,
_11.fdt, _z_nrm.cfe, _10_Lucene40_0.frq, _13_Lucene40_0.frq, _z_Lucene40_0.prx, _x_nrm.cfs,
_12.fnm, _11_1.del, _10_Lucene40_0.prx, _13.fdt, _14.fnm, _13.fdx, _z.fdt, _x.fdt, _x_Lucene40_0.tip,
_x.si, _10.fdt, _10_nrm.cfs, _z.fdx, _x.fdx, _11.si, _y.si, _11_Lucene40_0.prx, _11_nrm.cfs,
_y_nrm.cfe, _z_Lucene40_0.tip, _z.si, _12_Lucene40_0.prx, _y_1.del, _10.fdx, _12_1.del, _12_Lucene40_0.tim,
_x_1.del, _12_Lucene40_0.tip, _z_1.del, _x_Lucene40_0.prx, _z_Lucene40_0.frq, _12_nrm.cfe,
_13_nrm.cfs, _12_Lucene40_0.frq, _y.fnm, _14.si, _x.fnm, _10.fnm, _y_Lucene40_0.tim, _y_Lucene40_0.frq,
_14_nrm.cfe, _14_nrm.cfs, _12_nrm.cfs, _11_Lucene40_0.tip, _13_nrm.cfe, _11_Lucene40_0.tim,
_x_Lucene40_0.frq, _10.si, _10_nrm.cfe, _y_Lucene40_0.prx, _13_Lucene40_0.tip, _y_nrm.cfs,
_14_Lucene40_0.prx, _11.fnm, _z_Lucene40_0.tim, _13_Lucene40_0.tim, _11_nrm.cfe, _x_Lucene40_0.tim,
segments_4]
   [junit4]   2> 		commit{dir=/usr/home/hudson/hudson-slave/workspace/Lucene-Solr-tests-only-trunk-java7/checkout/solr/build/solr-core/test/J1/org.apache.solr.cloud.ChaosMonkeySafeLeaderTest-1341197409969/jetty30/index.20120702125110354,segFN=segments_5,generation=5,filenames=[_15_nrm.cfe,
_15.si, _15_Lucene40_0.tim, _15_Lucene40_0.prx, _15.fdt, _15_Lucene40_0.tip, _15.fdx, _15_Lucene40_0.frq,
_15_nrm.cfs, _15.fnm, segments_5]
   [junit4]   2> 140043 T1413 C82 P21482 oasc.SolrDeletionPolicy.updateCommits newest commit
= 5
   [junit4]   2> 140053 T1413 oasc.RecoveryStrategy.close WARNING Stopping recovery for
core collection1 zkNodeName=127.0.0.1:21482_solr_collection1
   [junit4]   2> 140154 T1829 oaz.ClientCnxn$EventThread.run EventThread shut down
   [junit4]   2> 140154 T1413 oaz.ZooKeeper.close Session: 0x13845985eb70020 closed
   [junit4]   2> 140155 T1413 oejsh.ContextHandler.doStop stopped o.e.j.s.ServletContextHandler{/solr,null}
   [junit4]   2> 140207 T1413 oasc.CoreContainer.shutdown Shutting down CoreContainer instance=1852786456
   [junit4]   2> 140207 T1413 oasc.RecoveryStrategy.close WARNING Stopping recovery for
core collection1 zkNodeName=127.0.0.1:59527_solr_collection1
   [junit4]   2> 140207 T1413 oasc.SolrCore.close [collection1]  CLOSING SolrCore org.apache.solr.core.SolrCore@3483ba7e
   [junit4]   2> 140210 T1413 oasc.SolrCore.closeSearcher [collection1] Closing main searcher
on request.
   [junit4]   2> 140210 T1413 oasu.DirectUpdateHandler2.close closing DirectUpdateHandler2{commits=3,autocommits=0,soft
autocommits=0,optimizes=0,rollbacks=0,expungeDeletes=0,docsPending=0,adds=0,deletesById=0,deletesByQuery=0,errors=0,cumulative_adds=351,cumulative_deletesById=163,cumulative_deletesByQuery=0,cumulative_errors=0}
   [junit4]   2> 140211 T1413 oasc.RecoveryStrategy.close WARNING Stopping recovery for
core collection1 zkNodeName=127.0.0.1:59527_solr_collection1
   [junit4]   2> 140931 T1843 oaz.ClientCnxn$EventThread.run EventThread shut down
   [junit4]   2> 140931 T1413 oaz.ZooKeeper.close Session: 0x13845985eb70021 closed
   [junit4]   2> 140932 T1413 oejsh.ContextHandler.doStop stopped o.e.j.s.ServletContextHandler{/solr,null}
   [junit4]   2> 141276 T1413 oas.SolrTestCaseJ4.tearDown ###Ending testDistribSearch
   [junit4]   1> I ran for 29.194sec. I stopped 0 and I started 0. I also expired 0 and
caused 0 connection losses
   [junit4]   2> NOTE: reproduce with: ant test  -Dtestcase=ChaosMonkeySafeLeaderTest -Dtests.method=testDistribSearch
-Dtests.seed=6BCB44DC7ADED2E3 -Dtests.multiplier=3 -Dtests.slow=true -Dtests.locale=fr_LU
-Dtests.timezone=Australia/NSW -Dargs="-Dfile.encoding=US-ASCII"
   [junit4]   1> 
   [junit4]   2>
   [junit4]    > (@AfterClass output)
   [junit4]   2> 141305 T1413 oas.SolrTestCaseJ4.deleteCore ###deleteCore
   [junit4]   2> NOTE: test params are: codec=Lucene40: {}, sim=DefaultSimilarity, locale=fr_LU,
timezone=Australia/NSW
   [junit4]   2> NOTE: FreeBSD 9.0-RELEASE amd64/Oracle Corporation 1.7.0_04 (64-bit)/cpus=16,threads=1,free=153788984,total=499122176
   [junit4]   2> NOTE: All tests run in this JVM: [TestTurkishLowerCaseFilterFactory, TestSolrDeletionPolicy1,
UUIDFieldTest, TestShingleFilterFactory, TestSort, TestReverseStringFilterFactory, TestGermanMinimalStemFilterFactory,
TestPropInjectDefaults, CloudStateUpdateTest, TestCzechStemFilterFactory, TestPorterStemFilterFactory,
UpdateParamsTest, LengthFilterTest, TestMultiCoreConfBootstrap, ResourceLoaderTest, TestRussianLightStemFilterFactory,
TestStopFilterFactory, TestLuceneMatchVersion, TestKeepFilterFactory, TestSuggestSpellingConverter,
TestNumberUtils, PeerSyncTest, HighlighterConfigTest, IndexReaderFactoryTest, TestXIncludeConfig,
TestCSVResponseWriter, MBeansHandlerTest, TestRangeQuery, TestArbitraryIndexDir, TestReplicationHandler,
TestWikipediaTokenizerFactory, SoftAutoCommitTest, QueryEqualityTest, CSVRequestHandlerTest,
SortByFunctionTest, TestSystemIdResolver, TestUtils, LeaderElectionTest, TestLMJelinekMercerSimilarityFactory,
LoggingHandlerTest, OverseerTest, TestBeiderMorseFilterFactory, TestHindiFilters, ZkSolrClientTest,
TestPortugueseLightStemFilterFactory, TestDocSet, DocumentAnalysisRequestHandlerTest, TestRemoteStreaming,
DocumentBuilderTest, TestPseudoReturnFields, TestRecovery, MultiTermTest, TestConfig, RAMDirectoryFactoryTest,
TestUAX29URLEmailTokenizerFactory, SpellingQueryConverterTest, IndexSchemaRuntimeFieldTest,
TestFastLRUCache, URLClassifyProcessorTest, SolrCoreTest, BasicZkTest, PrimUtilsTest, TestGermanNormalizationFilterFactory,
PolyFieldTest, SpellCheckComponentTest, TestJmxMonitoredMap, ChaosMonkeySafeLeaderTest]
   [junit4]   2> 
   [junit4] Completed on J1 in 141.32s, 1 test, 1 error <<< FAILURES!
[...truncated 433 lines...]

[...truncated 45338 lines...]

[...truncated 45338 lines...]

[...truncated 45338 lines...]

[...truncated 45338 lines...]

[...truncated 45338 lines...]



Mime
View raw message