lucene-dev mailing list archives

Site index · List index
Message view « Date » · « Thread »
Top « Date » · « Thread »
From Policeman Jenkins Server <jenk...@sd-datasolutions.de>
Subject [JENKINS] Lucene-Solr-trunk-Linux-Java8-64 - Build # 4 - Still Failing!
Date Mon, 02 Jul 2012 21:11:48 GMT
Build: http://jenkins.sd-datasolutions.de/job/Lucene-Solr-trunk-Linux-Java8-64/4/

1 tests failed.
FAILED:  org.apache.solr.handler.component.SpellCheckComponentTest.testPerDictionary

Error Message:
mismatch: '0'!='2' @ spellcheck/suggestions/bar/startOffset

Stack Trace:
java.lang.RuntimeException: mismatch: '0'!='2' @ spellcheck/suggestions/bar/startOffset
	at __randomizedtesting.SeedInfo.seed([F4E7251AF2FA96DA:33E9D1B2FA968392]:0)
	at org.apache.solr.SolrTestCaseJ4.assertJQ(SolrTestCaseJ4.java:547)
	at org.apache.solr.SolrTestCaseJ4.assertJQ(SolrTestCaseJ4.java:495)
	at org.apache.solr.handler.component.SpellCheckComponentTest.testPerDictionary(SpellCheckComponentTest.java:102)
	at sun.reflect.NativeMethodAccessorImpl.invoke0(Native Method)
	at sun.reflect.NativeMethodAccessorImpl.invoke(NativeMethodAccessorImpl.java:57)
	at sun.reflect.DelegatingMethodAccessorImpl.invoke(DelegatingMethodAccessorImpl.java:43)
	at java.lang.reflect.Method.invoke(Method.java:474)
	at com.carrotsearch.randomizedtesting.RandomizedRunner.invoke(RandomizedRunner.java:1969)
	at com.carrotsearch.randomizedtesting.RandomizedRunner.access$1100(RandomizedRunner.java:132)
	at com.carrotsearch.randomizedtesting.RandomizedRunner$6.evaluate(RandomizedRunner.java:814)
	at com.carrotsearch.randomizedtesting.RandomizedRunner$7.evaluate(RandomizedRunner.java:875)
	at com.carrotsearch.randomizedtesting.RandomizedRunner$8.evaluate(RandomizedRunner.java:889)
	at com.carrotsearch.randomizedtesting.rules.SystemPropertiesRestoreRule$1.evaluate(SystemPropertiesRestoreRule.java:53)
	at org.apache.lucene.util.TestRuleSetupTeardownChained$1.evaluate(TestRuleSetupTeardownChained.java:50)
	at org.apache.lucene.util.TestRuleFieldCacheSanity$1.evaluate(TestRuleFieldCacheSanity.java:32)
	at org.apache.lucene.util.AbstractBeforeAfterRule$1.evaluate(AbstractBeforeAfterRule.java:45)
	at com.carrotsearch.randomizedtesting.rules.SystemPropertiesInvariantRule$1.evaluate(SystemPropertiesInvariantRule.java:55)
	at org.apache.lucene.util.TestRuleReportUncaughtExceptions$1.evaluate(TestRuleReportUncaughtExceptions.java:68)
	at org.apache.lucene.util.TestRuleThreadAndTestName$1.evaluate(TestRuleThreadAndTestName.java:48)
	at org.apache.lucene.util.TestRuleIgnoreAfterMaxFailures$1.evaluate(TestRuleIgnoreAfterMaxFailures.java:70)
	at org.apache.lucene.util.TestRuleMarkFailure$1.evaluate(TestRuleMarkFailure.java:48)
	at com.carrotsearch.randomizedtesting.RandomizedRunner.runSingleTest(RandomizedRunner.java:821)
	at com.carrotsearch.randomizedtesting.RandomizedRunner.access$700(RandomizedRunner.java:132)
	at com.carrotsearch.randomizedtesting.RandomizedRunner$3$1.run(RandomizedRunner.java:669)
	at com.carrotsearch.randomizedtesting.RandomizedRunner$3.evaluate(RandomizedRunner.java:695)
	at com.carrotsearch.randomizedtesting.RandomizedRunner$4.evaluate(RandomizedRunner.java:734)
	at com.carrotsearch.randomizedtesting.RandomizedRunner$5.evaluate(RandomizedRunner.java:745)
	at com.carrotsearch.randomizedtesting.rules.SystemPropertiesRestoreRule$1.evaluate(SystemPropertiesRestoreRule.java:53)
	at org.apache.lucene.util.AbstractBeforeAfterRule$1.evaluate(AbstractBeforeAfterRule.java:45)
	at org.apache.lucene.util.TestRuleReportUncaughtExceptions$1.evaluate(TestRuleReportUncaughtExceptions.java:68)
	at org.apache.lucene.util.TestRuleStoreClassName$1.evaluate(TestRuleStoreClassName.java:38)
	at org.apache.lucene.util.TestRuleIcuHack$1.evaluate(TestRuleIcuHack.java:51)
	at com.carrotsearch.randomizedtesting.rules.SystemPropertiesInvariantRule$1.evaluate(SystemPropertiesInvariantRule.java:55)
	at org.apache.lucene.util.TestRuleNoInstanceHooksOverrides$1.evaluate(TestRuleNoInstanceHooksOverrides.java:53)
	at org.apache.lucene.util.TestRuleNoStaticHooksShadowing$1.evaluate(TestRuleNoStaticHooksShadowing.java:52)
	at org.apache.lucene.util.TestRuleAssertionsRequired$1.evaluate(TestRuleAssertionsRequired.java:36)
	at org.apache.lucene.util.TestRuleMarkFailure$1.evaluate(TestRuleMarkFailure.java:48)
	at org.apache.lucene.util.TestRuleIgnoreAfterMaxFailures$1.evaluate(TestRuleIgnoreAfterMaxFailures.java:70)
	at org.apache.lucene.util.TestRuleIgnoreTestSuites$1.evaluate(TestRuleIgnoreTestSuites.java:55)
	at com.carrotsearch.randomizedtesting.RandomizedRunner.runSuite(RandomizedRunner.java:605)
	at com.carrotsearch.randomizedtesting.RandomizedRunner.access$400(RandomizedRunner.java:132)
	at com.carrotsearch.randomizedtesting.RandomizedRunner$2.run(RandomizedRunner.java:551)




Build Log:
[...truncated 8056 lines...]
   [junit4] Suite: org.apache.solr.handler.component.SpellCheckComponentTest
   [junit4]    > (@BeforeClass output)
   [junit4]   2> 0 T870 oas.SolrTestCaseJ4.initCore ####initCore
   [junit4]   2> Creating dataDir: /mnt/ssd/jenkins/workspace/Lucene-Solr-trunk-Linux-Java8-64/checkout/solr/build/solr-core/test/J1/./solrtest-SpellCheckComponentTest-1341263315655
   [junit4]   2> 0 T870 oasc.SolrResourceLoader.<init> new SolrResourceLoader for
directory: '/mnt/ssd/jenkins/workspace/Lucene-Solr-trunk-Linux-Java8-64/checkout/solr/build/solr-core/test-files/solr/collection1/'
   [junit4]   2> 1 T870 oasc.SolrResourceLoader.replaceClassLoader Adding 'file:/mnt/ssd/jenkins/workspace/Lucene-Solr-trunk-Linux-Java8-64/checkout/solr/build/solr-core/test-files/solr/collection1/lib/classes/'
to classloader
   [junit4]   2> 1 T870 oasc.SolrResourceLoader.replaceClassLoader Adding 'file:/mnt/ssd/jenkins/workspace/Lucene-Solr-trunk-Linux-Java8-64/checkout/solr/build/solr-core/test-files/solr/collection1/lib/README'
to classloader
   [junit4]   2> 23 T870 oasc.SolrConfig.<init> Using Lucene MatchVersion: LUCENE_50
   [junit4]   2> 51 T870 oasc.SolrConfig.<init> Loaded SolrConfig: solrconfig-spellcheckcomponent.xml
   [junit4]   2> 52 T870 oass.IndexSchema.readSchema Reading Solr Schema
   [junit4]   2> 54 T870 oass.IndexSchema.readSchema Schema name=test
   [junit4]   2> 73 T755 oaz.ClientCnxn$SendThread.startConnect Opening socket connection
to server localhost.localdomain/127.0.0.1:51538
   [junit4]   2> 73 T755 oaz.ClientCnxn$SendThread.run WARNING Session 0x1384984b8e60010
for server null, unexpected error, closing socket connection and attempting reconnect java.net.ConnectException:
Connection refused
   [junit4]   2> 	at sun.nio.ch.SocketChannelImpl.checkConnect(Native Method)
   [junit4]   2> 	at sun.nio.ch.SocketChannelImpl.finishConnect(SocketChannelImpl.java:692)
   [junit4]   2> 	at org.apache.zookeeper.ClientCnxn$SendThread.run(ClientCnxn.java:1146)
   [junit4]   2> 
   [junit4]   2> 133 T3 oasu.ConcurrentLRUCache.finalize SEVERE ConcurrentLRUCache was
not destroyed prior to finalize(), indicates a bug -- POSSIBLE RESOURCE LEAK!!!
   [junit4]   2> 346 T870 oass.OpenExchangeRatesOrgProvider.init Initialized with rates=open-exchange-rates.json,
refreshInterval=1440.
   [junit4]   2> 351 T870 oass.IndexSchema.readSchema default search field in schema is
text
   [junit4]   2> 353 T870 oass.IndexSchema.readSchema unique key field: id
   [junit4]   2> 357 T870 oass.FileExchangeRateProvider.reload Reloading exchange rates
from file currency.xml
   [junit4]   2> 359 T870 oass.FileExchangeRateProvider.reload Reloading exchange rates
from file currency.xml
   [junit4]   2> 360 T870 oass.OpenExchangeRatesOrgProvider.reload Reloading exchange rates
from open-exchange-rates.json
   [junit4]   2> 361 T870 oass.OpenExchangeRatesOrgProvider.reload Reloading exchange rates
from open-exchange-rates.json
   [junit4]   2> 361 T870 oasc.SolrResourceLoader.locateSolrHome JNDI not configured for
solr (NoInitialContextEx)
   [junit4]   2> 361 T870 oasc.SolrResourceLoader.locateSolrHome using system property
solr.solr.home: /mnt/ssd/jenkins/workspace/Lucene-Solr-trunk-Linux-Java8-64/checkout/solr/build/solr-core/test-files/solr
   [junit4]   2> 361 T870 oasc.SolrResourceLoader.<init> new SolrResourceLoader for
directory: '/mnt/ssd/jenkins/workspace/Lucene-Solr-trunk-Linux-Java8-64/checkout/solr/build/solr-core/test-files/solr/'
   [junit4]   2> 361 T870 oasc.CoreContainer.<init> New CoreContainer 1671959067
   [junit4]   2> 362 T870 oasc.SolrCore.<init> [collection1] Opening new SolrCore
at /mnt/ssd/jenkins/workspace/Lucene-Solr-trunk-Linux-Java8-64/checkout/solr/build/solr-core/test-files/solr/collection1/,
dataDir=/mnt/ssd/jenkins/workspace/Lucene-Solr-trunk-Linux-Java8-64/checkout/solr/build/solr-core/test/J1/./solrtest-SpellCheckComponentTest-1341263315655/
   [junit4]   2> 362 T870 oasc.SolrCore.<init> JMX monitoring not detected for core:
collection1
   [junit4]   2> 362 T870 oasc.SolrCore.getNewIndexDir WARNING New index directory detected:
old=null new=/mnt/ssd/jenkins/workspace/Lucene-Solr-trunk-Linux-Java8-64/checkout/solr/build/solr-core/test/J1/./solrtest-SpellCheckComponentTest-1341263315655/index/
   [junit4]   2> 362 T870 oasc.SolrCore.initIndex WARNING [collection1] Solr index directory
'/mnt/ssd/jenkins/workspace/Lucene-Solr-trunk-Linux-Java8-64/checkout/solr/build/solr-core/test/J1/./solrtest-SpellCheckComponentTest-1341263315655/index'
doesn't exist. Creating new index...
   [junit4]   2> 364 T870 oasc.SolrDeletionPolicy.onCommit SolrDeletionPolicy.onCommit:
commits:num=1
   [junit4]   2> 		commit{dir=MockDirWrapper(org.apache.lucene.store.RAMDirectory@2f3cddba
lockFactory=org.apache.lucene.store.NativeFSLockFactory@423b8b54),segFN=segments_1,generation=1,filenames=[segments_1]
   [junit4]   2> 364 T870 oasc.SolrDeletionPolicy.updateCommits newest commit = 1
   [junit4]   2> 365 T870 oasc.RequestHandlers.initHandlersFromConfig created standard:
solr.StandardRequestHandler
   [junit4]   2> 365 T870 oasc.RequestHandlers.initHandlersFromConfig created spellCheckCompRH:
org.apache.solr.handler.component.SearchHandler
   [junit4]   2> 366 T870 oasc.RequestHandlers.initHandlersFromConfig created spellCheckCompRH1:
org.apache.solr.handler.component.SearchHandler
   [junit4]   2> 366 T870 oasc.RequestHandlers.initHandlersFromConfig created spellCheckWithWordbreak:
org.apache.solr.handler.component.SearchHandler
   [junit4]   2> 368 T870 oass.SolrIndexSearcher.<init> Opening Searcher@7d46c1ee
main
   [junit4]   2> 369 T870 oass.SolrIndexSearcher.<init> WARNING WARNING: Directory
impl does not support setting indexDir: org.apache.lucene.store.MockDirectoryWrapper
   [junit4]   2> 369 T870 oasu.CommitTracker.<init> Hard AutoCommit: disabled
   [junit4]   2> 369 T870 oasu.CommitTracker.<init> Soft AutoCommit: disabled
   [junit4]   2> 369 T870 oashc.SpellCheckComponent.inform Initializing spell checkers
   [junit4]   2> 374 T870 oashc.SpellCheckComponent.inform Registering newSearcher listener
for spellchecker: default
   [junit4]   2> 379 T870 oashc.SpellCheckComponent.inform Registering newSearcher listener
for spellchecker: default_teststop
   [junit4]   2> 379 T870 oass.DirectSolrSpellChecker.init init: {name=direct,classname=solr.DirectSolrSpellChecker,minQueryLength=3,maxQueryFrequency=100.0,field=teststop}
   [junit4]   2> 379 T870 oass.DirectSolrSpellChecker.init init: {name=direct_lowerfilt,classname=solr.DirectSolrSpellChecker,minQueryLength=3,maxQueryFrequency=100.0,field=lowerfilt}
   [junit4]   2> 384 T870 oashc.SpellCheckComponent.inform Registering newSearcher listener
for spellchecker: threshold
   [junit4]   2> 384 T870 oass.DirectSolrSpellChecker.init init: {name=threshold_direct,classname=solr.DirectSolrSpellChecker,field=lowerfilt,spellcheckIndexDir=spellcheckerThreshold,buildOnCommit=true,thresholdTokenFrequency=0.29}
   [junit4]   2> 384 T870 oashc.SpellCheckComponent.inform Registering newSearcher listener
for spellchecker: threshold_direct
   [junit4]   2> 388 T870 oashc.SpellCheckComponent.inform Registering newSearcher listener
for spellchecker: multipleFields
   [junit4]   2> 401 T870 oashc.SpellCheckComponent.inform Registering newSearcher listener
for spellchecker: freq
   [junit4]   2> 405 T870 oashc.SpellCheckComponent.inform Registering newSearcher listener
for spellchecker: fqcn
   [junit4]   2> 405 T870 oashc.HttpShardHandlerFactory.getParameter Setting socketTimeout
to: 0
   [junit4]   2> 406 T870 oashc.HttpShardHandlerFactory.getParameter Setting urlScheme
to: http://
   [junit4]   2> 406 T870 oashc.HttpShardHandlerFactory.getParameter Setting connTimeout
to: 0
   [junit4]   2> 406 T870 oashc.HttpShardHandlerFactory.getParameter Setting maxConnectionsPerHost
to: 20
   [junit4]   2> 406 T870 oashc.HttpShardHandlerFactory.getParameter Setting corePoolSize
to: 0
   [junit4]   2> 406 T870 oashc.HttpShardHandlerFactory.getParameter Setting maximumPoolSize
to: 2147483647
   [junit4]   2> 406 T870 oashc.HttpShardHandlerFactory.getParameter Setting maxThreadIdleTime
to: 5
   [junit4]   2> 406 T870 oashc.HttpShardHandlerFactory.getParameter Setting sizeOfQueue
to: -1
   [junit4]   2> 406 T870 oashc.HttpShardHandlerFactory.getParameter Setting fairnessPolicy
to: false
   [junit4]   2> 407 T870 oascsi.HttpClientUtil.createClient Creating new http client,
config:maxConnectionsPerHost=20&maxConnections=10000&socketTimeout=0&connTimeout=0&retry=false
   [junit4]   2> 409 T871 oasc.SolrCore.registerSearcher [collection1] Registered new searcher
Searcher@7d46c1ee main{StandardDirectoryReader(segments_1:1)}
   [junit4]   2> 409 T870 oasc.CoreContainer.register registering core: collection1
   [junit4]   2> 410 T870 oas.SolrTestCaseJ4.initCore ####initCore end
   [junit4]   2> 
   [junit4] ERROR   0.27s J1 | SpellCheckComponentTest.testPerDictionary
   [junit4]    > Throwable #1: java.lang.RuntimeException: mismatch: '0'!='2' @ spellcheck/suggestions/bar/startOffset
   [junit4]    > 	at __randomizedtesting.SeedInfo.seed([F4E7251AF2FA96DA:33E9D1B2FA968392]:0)
   [junit4]    > 	at org.apache.solr.SolrTestCaseJ4.assertJQ(SolrTestCaseJ4.java:547)
   [junit4]    > 	at org.apache.solr.SolrTestCaseJ4.assertJQ(SolrTestCaseJ4.java:495)
   [junit4]    > 	at org.apache.solr.handler.component.SpellCheckComponentTest.testPerDictionary(SpellCheckComponentTest.java:102)
   [junit4]    > 	at sun.reflect.NativeMethodAccessorImpl.invoke0(Native Method)
   [junit4]    > 	at sun.reflect.NativeMethodAccessorImpl.invoke(NativeMethodAccessorImpl.java:57)
   [junit4]    > 	at sun.reflect.DelegatingMethodAccessorImpl.invoke(DelegatingMethodAccessorImpl.java:43)
   [junit4]    > 	at java.lang.reflect.Method.invoke(Method.java:474)
   [junit4]    > 	at com.carrotsearch.randomizedtesting.RandomizedRunner.invoke(RandomizedRunner.java:1969)
   [junit4]    > 	at com.carrotsearch.randomizedtesting.RandomizedRunner.access$1100(RandomizedRunner.java:132)
   [junit4]    > 	at com.carrotsearch.randomizedtesting.RandomizedRunner$6.evaluate(RandomizedRunner.java:814)
   [junit4]    > 	at com.carrotsearch.randomizedtesting.RandomizedRunner$7.evaluate(RandomizedRunner.java:875)
   [junit4]    > 	at com.carrotsearch.randomizedtesting.RandomizedRunner$8.evaluate(RandomizedRunner.java:889)
   [junit4]    > 	at com.carrotsearch.randomizedtesting.rules.SystemPropertiesRestoreRule$1.evaluate(SystemPropertiesRestoreRule.java:53)
   [junit4]    > 	at org.apache.lucene.util.TestRuleSetupTeardownChained$1.evaluate(TestRuleSetupTeardownChained.java:50)
   [junit4]    > 	at org.apache.lucene.util.TestRuleFieldCacheSanity$1.evaluate(TestRuleFieldCacheSanity.java:32)
   [junit4]    > 	at org.apache.lucene.util.AbstractBeforeAfterRule$1.evaluate(AbstractBeforeAfterRule.java:45)
   [junit4]    > 	at com.carrotsearch.randomizedtesting.rules.SystemPropertiesInvariantRule$1.evaluate(SystemPropertiesInvariantRule.java:55)
   [junit4]    > 	at org.apache.lucene.util.TestRuleReportUncaughtExceptions$1.evaluate(TestRuleReportUncaughtExceptions.java:68)
   [junit4]    > 	at org.apache.lucene.util.TestRuleThreadAndTestName$1.evaluate(TestRuleThreadAndTestName.java:48)
   [junit4]    > 	at org.apache.lucene.util.TestRuleIgnoreAfterMaxFailures$1.evaluate(TestRuleIgnoreAfterMaxFailures.java:70)
   [junit4]    > 	at org.apache.lucene.util.TestRuleMarkFailure$1.evaluate(TestRuleMarkFailure.java:48)
   [junit4]    > 	at com.carrotsearch.randomizedtesting.RandomizedRunner.runSingleTest(RandomizedRunner.java:821)
   [junit4]    > 	at com.carrotsearch.randomizedtesting.RandomizedRunner.access$700(RandomizedRunner.java:132)
   [junit4]    > 	at com.carrotsearch.randomizedtesting.RandomizedRunner$3$1.run(RandomizedRunner.java:669)
   [junit4]    > 	at com.carrotsearch.randomizedtesting.RandomizedRunner$3.evaluate(RandomizedRunner.java:695)
   [junit4]    > 	at com.carrotsearch.randomizedtesting.RandomizedRunner$4.evaluate(RandomizedRunner.java:734)
   [junit4]    > 	at com.carrotsearch.randomizedtesting.RandomizedRunner$5.evaluate(RandomizedRunner.java:745)
   [junit4]    > 	at com.carrotsearch.randomizedtesting.rules.SystemPropertiesRestoreRule$1.evaluate(SystemPropertiesRestoreRule.java:53)
   [junit4]    > 	at org.apache.lucene.util.AbstractBeforeAfterRule$1.evaluate(AbstractBeforeAfterRule.java:45)
   [junit4]    > 	at org.apache.lucene.util.TestRuleReportUncaughtExceptions$1.evaluate(TestRuleReportUncaughtExceptions.java:68)
   [junit4]    > 	at org.apache.lucene.util.TestRuleStoreClassName$1.evaluate(TestRuleStoreClassName.java:38)
   [junit4]    > 	at org.apache.lucene.util.TestRuleIcuHack$1.evaluate(TestRuleIcuHack.java:51)
   [junit4]    > 	at com.carrotsearch.randomizedtesting.rules.SystemPropertiesInvariantRule$1.evaluate(SystemPropertiesInvariantRule.java:55)
   [junit4]    > 	at org.apache.lucene.util.TestRuleNoInstanceHooksOverrides$1.evaluate(TestRuleNoInstanceHooksOverrides.java:53)
   [junit4]    > 	at org.apache.lucene.util.TestRuleNoStaticHooksShadowing$1.evaluate(TestRuleNoStaticHooksShadowing.java:52)
   [junit4]    > 	at org.apache.lucene.util.TestRuleAssertionsRequired$1.evaluate(TestRuleAssertionsRequired.java:36)
   [junit4]    > 	at org.apache.lucene.util.TestRuleMarkFailure$1.evaluate(TestRuleMarkFailure.java:48)
   [junit4]    > 	at org.apache.lucene.util.TestRuleIgnoreAfterMaxFailures$1.evaluate(TestRuleIgnoreAfterMaxFailures.java:70)
   [junit4]    > 	at org.apache.lucene.util.TestRuleIgnoreTestSuites$1.evaluate(TestRuleIgnoreTestSuites.java:55)
   [junit4]    > 	at com.carrotsearch.randomizedtesting.RandomizedRunner.runSuite(RandomizedRunner.java:605)
   [junit4]    > 	at com.carrotsearch.randomizedtesting.RandomizedRunner.access$400(RandomizedRunner.java:132)
   [junit4]    > 	at com.carrotsearch.randomizedtesting.RandomizedRunner$2.run(RandomizedRunner.java:551)
   [junit4]    > 
   [junit4]   2> 2598 T870 oas.SolrTestCaseJ4.setUp ###Starting testPerDictionary
   [junit4]   2> 2601 T870 C71 UPDATE [collection1] webapp=null path=null params={} {add=[0]}
0 1
   [junit4]   2> 2604 T870 C71 UPDATE [collection1] webapp=null path=null params={} {add=[1]}
0 0
   [junit4]   2> 2607 T870 C71 UPDATE [collection1] webapp=null path=null params={} {add=[2]}
0 0
   [junit4]   2> 2610 T870 C71 UPDATE [collection1] webapp=null path=null params={} {add=[3]}
0 0
   [junit4]   2> 2613 T870 C71 UPDATE [collection1] webapp=null path=null params={} {add=[4]}
0 0
   [junit4]   2> 2616 T870 C71 UPDATE [collection1] webapp=null path=null params={} {add=[5]}
0 0
   [junit4]   2> 2619 T870 C71 UPDATE [collection1] webapp=null path=null params={} {add=[6]}
0 0
   [junit4]   2> 2622 T870 C71 UPDATE [collection1] webapp=null path=null params={} {add=[7]}
0 0
   [junit4]   2> 2625 T870 C71 UPDATE [collection1] webapp=null path=null params={} {add=[8]}
0 0
   [junit4]   2> 2629 T870 C71 UPDATE [collection1] webapp=null path=null params={} {add=[9]}
0 1
   [junit4]   2> 2632 T870 C71 oasu.DirectUpdateHandler2.commit start commit{flags=0,version=0,optimize=false,openSearcher=true,waitSearcher=true,expungeDeletes=false,softCommit=false}
   [junit4]   2> 2633 T870 C71 oasc.SolrDeletionPolicy.onCommit SolrDeletionPolicy.onCommit:
commits:num=2
   [junit4]   2> 		commit{dir=MockDirWrapper(org.apache.lucene.store.RAMDirectory@2f3cddba
lockFactory=org.apache.lucene.store.NativeFSLockFactory@423b8b54),segFN=segments_g,generation=16,filenames=[segments_g]
   [junit4]   2> 		commit{dir=MockDirWrapper(org.apache.lucene.store.RAMDirectory@2f3cddba
lockFactory=org.apache.lucene.store.NativeFSLockFactory@423b8b54),segFN=segments_h,generation=17,filenames=[segments_h,
_8.fdt, _8_Lucene40_0.tim, _8.fnm, _8.si, _8_Lucene40_0.tip, _8_Lucene40_0.prx, _8_Lucene40_0.frq,
_8_nrm.cfs, _8.fdx, _8_nrm.cfe]
   [junit4]   2> 2633 T870 C71 oasc.SolrDeletionPolicy.updateCommits newest commit = 17
   [junit4]   2> 2634 T870 C71 oass.SolrIndexSearcher.<init> Opening Searcher@7670489a
main
   [junit4]   2> 2634 T870 C71 oass.SolrIndexSearcher.<init> WARNING WARNING: Directory
impl does not support setting indexDir: org.apache.lucene.store.MockDirectoryWrapper
   [junit4]   2> 2634 T871 oashc.SpellCheckComponent$SpellCheckerListener.buildSpellIndex
Building spell index for spell checker: default
   [junit4]   2> 2634 T870 C71 oasu.DirectUpdateHandler2.commit end_commit_flush
   [junit4]   2> 2659 T871 oashc.SpellCheckComponent$SpellCheckerListener.buildSpellIndex
Building spell index for spell checker: default_teststop
   [junit4]   2> 2666 T871 oashc.SpellCheckComponent$SpellCheckerListener.buildSpellIndex
Building spell index for spell checker: threshold
   [junit4]   2> 2692 T871 oashc.SpellCheckComponent$SpellCheckerListener.buildSpellIndex
Building spell index for spell checker: threshold_direct
   [junit4]   2> 2692 T871 oashc.SpellCheckComponent$SpellCheckerListener.buildSpellIndex
Building spell index for spell checker: multipleFields
   [junit4]   2> 2718 T871 oashc.SpellCheckComponent$SpellCheckerListener.buildSpellIndex
Building spell index for spell checker: freq
   [junit4]   2> 2744 T871 oashc.SpellCheckComponent$SpellCheckerListener.buildSpellIndex
Building spell index for spell checker: fqcn
   [junit4]   2> 2778 T871 oasc.SolrCore.registerSearcher [collection1] Registered new
searcher Searcher@7670489a main{StandardDirectoryReader(segments_h:26 _8(5.0):C10)}
   [junit4]   2> 2778 T870 C71 UPDATE [collection1] webapp=null path=null params={} {commit=}
0 146
   [junit4]   2> 2780 T870 C71 REQ [collection1] webapp=null path=null params={spellcheck..perDict.foo=bar&spellcheck=true&spellcheck.dictionary=perDict&spellcheck..perDict.bar=foo&qt=spellCheckCompRH&json.nl=map&q=documemt&spellcheck.build=true}
hits=0 status=0 QTime=0 
   [junit4]   2> 2781 T870 oas.SolrTestCaseJ4.assertJQ SEVERE query failed JSON validation.
error=mismatch: '0'!='2' @ spellcheck/suggestions/bar/startOffset
   [junit4]   2> 	 expected =/spellcheck/suggestions/bar=={"numFound":1, "startOffset":0,
"endOffset":1, "suggestion":["foo"]}
   [junit4]   2> 	 response = {
   [junit4]   2> 	  "responseHeader":{
   [junit4]   2> 	    "status":0,
   [junit4]   2> 	    "QTime":0},
   [junit4]   2> 	  "command":"build",
   [junit4]   2> 	  "response":{"numFound":0,"start":0,"docs":[]
   [junit4]   2> 	  },
   [junit4]   2> 	  "spellcheck":{
   [junit4]   2> 	    "suggestions":{
   [junit4]   2> 	      "foo":{
   [junit4]   2> 	        "numFound":1,
   [junit4]   2> 	        "startOffset":0,
   [junit4]   2> 	        "endOffset":1,
   [junit4]   2> 	        "suggestion":["bar"]},
   [junit4]   2> 	      "bar":{
   [junit4]   2> 	        "numFound":1,
   [junit4]   2> 	        "startOffset":2,
   [junit4]   2> 	        "endOffset":3,
   [junit4]   2> 	        "suggestion":["foo"]}}}}
   [junit4]   2> 	
   [junit4]   2> 	 request = spellcheck..perDict.foo=bar&spellcheck=true&spellcheck.dictionary=perDict&spellcheck..perDict.bar=foo&qt=spellCheckCompRH&json.nl=map&q=documemt&spellcheck.build=true
   [junit4]   2> 2781 T870 oas.SolrTestCaseJ4.tearDown ###Ending testPerDictionary
   [junit4]   2> 2785 T870 C71 oasu.DirectUpdateHandler2.deleteAll [collection1] REMOVING
ALL DOCUMENTS FROM INDEX
   [junit4]   2> 2785 T870 C71 UPDATE [collection1] webapp=null path=null params={} {deleteByQuery=*:*}
0 1
   [junit4]   2> 2789 T870 C71 oasu.DirectUpdateHandler2.commit start commit{flags=0,version=0,optimize=false,openSearcher=true,waitSearcher=true,expungeDeletes=false,softCommit=false}
   [junit4]   2> 2790 T870 C71 oasc.SolrDeletionPolicy.onCommit SolrDeletionPolicy.onCommit:
commits:num=2
   [junit4]   2> 		commit{dir=MockDirWrapper(org.apache.lucene.store.RAMDirectory@2f3cddba
lockFactory=org.apache.lucene.store.NativeFSLockFactory@423b8b54),segFN=segments_h,generation=17,filenames=[segments_h,
_8.fdt, _8_Lucene40_0.tim, _8.fnm, _8.si, _8_Lucene40_0.tip, _8_Lucene40_0.prx, _8_Lucene40_0.frq,
_8_nrm.cfs, _8.fdx, _8_nrm.cfe]
   [junit4]   2> 		commit{dir=MockDirWrapper(org.apache.lucene.store.RAMDirectory@2f3cddba
lockFactory=org.apache.lucene.store.NativeFSLockFactory@423b8b54),segFN=segments_i,generation=18,filenames=[segments_i]
   [junit4]   2> 2790 T870 C71 oasc.SolrDeletionPolicy.updateCommits newest commit = 18
   [junit4]   2> 2791 T870 C71 oass.SolrIndexSearcher.<init> Opening Searcher@4666372c
main
   [junit4]   2> 2791 T870 C71 oass.SolrIndexSearcher.<init> WARNING WARNING: Directory
impl does not support setting indexDir: org.apache.lucene.store.MockDirectoryWrapper
   [junit4]   2> 2792 T871 oashc.SpellCheckComponent$SpellCheckerListener.buildSpellIndex
Building spell index for spell checker: default
   [junit4]   2> 2792 T870 C71 oasu.DirectUpdateHandler2.commit end_commit_flush
   [junit4]   2> 2800 T871 oashc.SpellCheckComponent$SpellCheckerListener.buildSpellIndex
Building spell index for spell checker: default_teststop
   [junit4]   2> 2805 T871 oashc.SpellCheckComponent$SpellCheckerListener.buildSpellIndex
Building spell index for spell checker: threshold
   [junit4]   2> 2811 T871 oashc.SpellCheckComponent$SpellCheckerListener.buildSpellIndex
Building spell index for spell checker: threshold_direct
   [junit4]   2> 2811 T871 oashc.SpellCheckComponent$SpellCheckerListener.buildSpellIndex
Building spell index for spell checker: multipleFields
   [junit4]   2> 2819 T871 oashc.SpellCheckComponent$SpellCheckerListener.buildSpellIndex
Building spell index for spell checker: freq
   [junit4]   2> 2825 T871 oashc.SpellCheckComponent$SpellCheckerListener.buildSpellIndex
Building spell index for spell checker: fqcn
   [junit4]   2> 2831 T871 oasc.SolrCore.registerSearcher [collection1] Registered new
searcher Searcher@4666372c main{StandardDirectoryReader(segments_i:27)}
   [junit4]   2> 2831 T870 C71 UPDATE [collection1] webapp=null path=null params={} {commit=}
0 42
   [junit4]   2> NOTE: reproduce with: ant test  -Dtestcase=SpellCheckComponentTest -Dtests.method=testPerDictionary
-Dtests.seed=F4E7251AF2FA96DA -Dtests.multiplier=3 -Dtests.slow=true -Dtests.locale=hr -Dtests.timezone=Asia/Taipei
-Dargs="-Dfile.encoding=UTF-8"
   [junit4]   2>
   [junit4]    > (@AfterClass output)
   [junit4]   2> 3289 T870 oas.SolrTestCaseJ4.deleteCore ###deleteCore
   [junit4]   2> 3289 T870 oasc.CoreContainer.shutdown Shutting down CoreContainer instance=1671959067
   [junit4]   2> 3289 T870 oasc.SolrCore.close [collection1]  CLOSING SolrCore org.apache.solr.core.SolrCore@6f8babc7
   [junit4]   2> 3289 T870 oasc.SolrCore.closeSearcher [collection1] Closing main searcher
on request.
   [junit4]   2> 3289 T870 oasu.DirectUpdateHandler2.close closing DirectUpdateHandler2{commits=20,autocommits=0,soft
autocommits=0,optimizes=0,rollbacks=0,expungeDeletes=0,docsPending=0,adds=0,deletesById=0,deletesByQuery=0,errors=0,cumulative_adds=92,cumulative_deletesById=0,cumulative_deletesByQuery=9,cumulative_errors=0}
   [junit4]   2> NOTE: test params are: codec=Lucene40: {end1=Lucene40(minBlockSize=66
maxBlockSize=192), end2=PostingsFormat(name=Lucene40WithOrds), gram3=MockFixedIntBlock(blockSize=923),
word=Lucene40(minBlockSize=66 maxBlockSize=192), gram2=PostingsFormat(name=Lucene40WithOrds),
end3=MockFixedIntBlock(blockSize=923), start4=MockFixedIntBlock(blockSize=923), start1=PostingsFormat(name=Lucene40WithOrds),
start2=Lucene40(minBlockSize=66 maxBlockSize=192), gram1=Lucene40(minBlockSize=66 maxBlockSize=192),
end4=PostingsFormat(name=Memory doPackFST= false), gram4=PostingsFormat(name=Memory doPackFST=
false), start3=PostingsFormat(name=Memory doPackFST= false)}, sim=RandomSimilarityProvider(queryNorm=false,coord=false):
{}, locale=hr, timezone=Asia/Taipei
   [junit4]   2> NOTE: Linux 2.6.32-41-server amd64/Oracle Corporation 1.8.0-ea (64-bit)/cpus=8,threads=1,free=151768944,total=285409280
   [junit4]   2> NOTE: All tests run in this JVM: [DistributedTermsComponentTest, FileBasedSpellCheckerTest,
TestReplicationHandler, TestNGramFilters, ZkSolrClientTest, TestPluginEnable, TestSort, TestReverseStringFilterFactory,
TestKeywordMarkerFilterFactory, UniqFieldsUpdateProcessorFactoryTest, ReturnFieldsTest, TestJapaneseTokenizerFactory,
TestTrie, TestCoreContainer, TestHungarianLightStemFilterFactory, TestSolrXMLSerializer, TestDocSet,
TestNorwegianMinimalStemFilterFactory, TestPortugueseLightStemFilterFactory, TestIBSimilarityFactory,
TestLuceneMatchVersion, IndexReaderFactoryTest, TestMultiCoreConfBootstrap, IndexSchemaRuntimeFieldTest,
TestPersianNormalizationFilterFactory, DirectSolrConnectionTest, CommonGramsFilterFactoryTest,
TestEnglishMinimalStemFilterFactory, TestGermanNormalizationFilterFactory, RAMDirectoryFactoryTest,
TestArbitraryIndexDir, MBeansHandlerTest, TestBeiderMorseFilterFactory, SignatureUpdateProcessorFactoryTest,
FieldAnalysisRequestHandlerTest, TestHindiFilters, BasicZkTest, TestCollationField, CSVRequestHandlerTest,
TestPatternReplaceFilterFactory, TestUAX29URLEmailTokenizerFactory, TestHunspellStemFilterFactory,
TestCSVResponseWriter, TestElisionFilterFactory, TermVectorComponentTest, TestValueSourceCache,
SolrCoreTest, URLClassifyProcessorTest, CloudStateTest, TestPropInjectDefaults, SpellCheckCollatorTest,
TestGermanMinimalStemFilterFactory, IndexSchemaTest, DocumentBuilderTest, UpdateParamsTest,
JsonLoaderTest, TestCzechStemFilterFactory, CloudStateUpdateTest, FullSolrCloudTest, AlternateDirectoryTest,
SoftAutoCommitTest, SampleTest, SearchHandlerTest, FieldMutatingUpdateProcessorTest, SuggesterFSTTest,
UUIDFieldTest, TestLMJelinekMercerSimilarityFactory, TestGreekStemFilterFactory, TestLMDirichletSimilarityFactory,
WordBreakSolrSpellCheckerTest, TestTurkishLowerCaseFilterFactory, TestStopFilterFactory, TestGroupingSearch,
TestUtils, TestNumberUtils, TestDefaultSimilarityFactory, XsltUpdateRequestHandlerTest, QueryEqualityTest,
PrimUtilsTest, HighlighterConfigTest, TestIndexSearcher, TestShingleFilterFactory, SortByFunctionTest,
LoggingHandlerTest, TestPorterStemFilterFactory, TestBinaryResponseWriter, TestIndonesianStemFilterFactory,
StandardRequestHandlerTest, TestFastLRUCache, SpellCheckComponentTest]
   [junit4]   2> 
   [junit4] Completed on J1 in 3.30s, 9 tests, 1 error <<< FAILURES!

[...truncated 305 lines...]
BUILD FAILED
/mnt/ssd/jenkins/workspace/Lucene-Solr-trunk-Linux-Java8-64/checkout/build.xml:29: The following
error occurred while executing this line:
/mnt/ssd/jenkins/workspace/Lucene-Solr-trunk-Linux-Java8-64/checkout/solr/build.xml:144: The
following error occurred while executing this line:
/mnt/ssd/jenkins/workspace/Lucene-Solr-trunk-Linux-Java8-64/checkout/lucene/module-build.xml:62:
The following error occurred while executing this line:
/mnt/ssd/jenkins/workspace/Lucene-Solr-trunk-Linux-Java8-64/checkout/lucene/common-build.xml:1047:
The following error occurred while executing this line:
/mnt/ssd/jenkins/workspace/Lucene-Solr-trunk-Linux-Java8-64/checkout/lucene/common-build.xml:760:
There were test failures: 282 suites, 1021 tests, 1 error, 5 ignored

Total time: 23 minutes 7 seconds
Build step 'Execute shell' marked build as failure
Archiving artifacts
Recording test results
Email was triggered for: Failure
Sending email for trigger: Failure




Mime
View raw message