lucene-dev mailing list archives

Site index · List index
Message view « Date » · « Thread »
Top « Date » · « Thread »
From Policeman Jenkins Server <jenk...@sd-datasolutions.de>
Subject [JENKINS] Lucene-Solr-4.x-Linux (64bit/jdk1.8.0-ea-b49) - Build # 9 - Failure!
Date Mon, 30 Jul 2012 04:22:35 GMT
Build: http://jenkins.sd-datasolutions.de/job/Lucene-Solr-4.x-Linux/9/
Java: 64bit/jdk1.8.0-ea-b49 -server -XX:+UseG1GC

1 tests failed.
REGRESSION:  org.apache.solr.handler.component.DistributedQueryElevationComponentTest.testDistribSearch

Error Message:
.responseHeader.params.size()==9,9skipped=5,4

Stack Trace:
junit.framework.AssertionFailedError: .responseHeader.params.size()==9,9skipped=5,4
	at __randomizedtesting.SeedInfo.seed([1E2731A7931AF8F5:9FC1BFBFE44598C9]:0)
	at junit.framework.Assert.fail(Assert.java:50)
	at org.apache.solr.BaseDistributedSearchTestCase.compareResponses(BaseDistributedSearchTestCase.java:670)
	at org.apache.solr.BaseDistributedSearchTestCase.query(BaseDistributedSearchTestCase.java:392)
	at org.apache.solr.handler.component.DistributedQueryElevationComponentTest.doTest(DistributedQueryElevationComponentTest.java:81)
	at org.apache.solr.BaseDistributedSearchTestCase.testDistribSearch(BaseDistributedSearchTestCase.java:679)
	at sun.reflect.NativeMethodAccessorImpl.invoke0(Native Method)
	at sun.reflect.NativeMethodAccessorImpl.invoke(NativeMethodAccessorImpl.java:57)
	at sun.reflect.DelegatingMethodAccessorImpl.invoke(DelegatingMethodAccessorImpl.java:43)
	at java.lang.reflect.Method.invoke(Method.java:474)
	at com.carrotsearch.randomizedtesting.RandomizedRunner.invoke(RandomizedRunner.java:1995)
	at com.carrotsearch.randomizedtesting.RandomizedRunner.access$1100(RandomizedRunner.java:132)
	at com.carrotsearch.randomizedtesting.RandomizedRunner$6.evaluate(RandomizedRunner.java:818)
	at com.carrotsearch.randomizedtesting.RandomizedRunner$7.evaluate(RandomizedRunner.java:877)
	at com.carrotsearch.randomizedtesting.RandomizedRunner$8.evaluate(RandomizedRunner.java:891)
	at com.carrotsearch.randomizedtesting.rules.SystemPropertiesRestoreRule$1.evaluate(SystemPropertiesRestoreRule.java:53)
	at org.apache.lucene.util.TestRuleSetupTeardownChained$1.evaluate(TestRuleSetupTeardownChained.java:50)
	at org.apache.lucene.util.TestRuleFieldCacheSanity$1.evaluate(TestRuleFieldCacheSanity.java:32)
	at org.apache.lucene.util.AbstractBeforeAfterRule$1.evaluate(AbstractBeforeAfterRule.java:45)
	at com.carrotsearch.randomizedtesting.rules.SystemPropertiesInvariantRule$1.evaluate(SystemPropertiesInvariantRule.java:55)
	at org.apache.lucene.util.TestRuleReportUncaughtExceptions$1.evaluate(TestRuleReportUncaughtExceptions.java:68)
	at org.apache.lucene.util.TestRuleThreadAndTestName$1.evaluate(TestRuleThreadAndTestName.java:48)
	at org.apache.lucene.util.TestRuleIgnoreAfterMaxFailures$1.evaluate(TestRuleIgnoreAfterMaxFailures.java:70)
	at org.apache.lucene.util.TestRuleMarkFailure$1.evaluate(TestRuleMarkFailure.java:48)
	at com.carrotsearch.randomizedtesting.RandomizedRunner.runSingleTest(RandomizedRunner.java:825)
	at com.carrotsearch.randomizedtesting.RandomizedRunner.access$700(RandomizedRunner.java:132)
	at com.carrotsearch.randomizedtesting.RandomizedRunner$3$1.run(RandomizedRunner.java:671)
	at com.carrotsearch.randomizedtesting.RandomizedRunner$3.evaluate(RandomizedRunner.java:697)
	at com.carrotsearch.randomizedtesting.RandomizedRunner$4.evaluate(RandomizedRunner.java:736)
	at com.carrotsearch.randomizedtesting.RandomizedRunner$5.evaluate(RandomizedRunner.java:747)
	at com.carrotsearch.randomizedtesting.rules.SystemPropertiesRestoreRule$1.evaluate(SystemPropertiesRestoreRule.java:53)
	at org.apache.lucene.util.AbstractBeforeAfterRule$1.evaluate(AbstractBeforeAfterRule.java:45)
	at org.apache.lucene.util.TestRuleReportUncaughtExceptions$1.evaluate(TestRuleReportUncaughtExceptions.java:68)
	at org.apache.lucene.util.TestRuleStoreClassName$1.evaluate(TestRuleStoreClassName.java:38)
	at com.carrotsearch.randomizedtesting.rules.SystemPropertiesInvariantRule$1.evaluate(SystemPropertiesInvariantRule.java:55)
	at org.apache.lucene.util.TestRuleNoInstanceHooksOverrides$1.evaluate(TestRuleNoInstanceHooksOverrides.java:53)
	at org.apache.lucene.util.TestRuleNoStaticHooksShadowing$1.evaluate(TestRuleNoStaticHooksShadowing.java:52)
	at org.apache.lucene.util.TestRuleAssertionsRequired$1.evaluate(TestRuleAssertionsRequired.java:36)
	at org.apache.lucene.util.TestRuleMarkFailure$1.evaluate(TestRuleMarkFailure.java:48)
	at org.apache.lucene.util.TestRuleIgnoreAfterMaxFailures$1.evaluate(TestRuleIgnoreAfterMaxFailures.java:70)
	at org.apache.lucene.util.TestRuleIgnoreTestSuites$1.evaluate(TestRuleIgnoreTestSuites.java:55)
	at com.carrotsearch.randomizedtesting.RandomizedRunner.runSuite(RandomizedRunner.java:605)
	at com.carrotsearch.randomizedtesting.RandomizedRunner.access$400(RandomizedRunner.java:132)
	at com.carrotsearch.randomizedtesting.RandomizedRunner$2.run(RandomizedRunner.java:551)




Build Log:
[...truncated 7633 lines...]
[junit4:junit4] Suite: org.apache.solr.handler.component.DistributedQueryElevationComponentTest
[junit4:junit4] FAILURE 1.42s J0 | DistributedQueryElevationComponentTest.testDistribSearch
[junit4:junit4]    > Throwable #1: junit.framework.AssertionFailedError: .responseHeader.params.size()==9,9skipped=5,4
[junit4:junit4]    > 	at __randomizedtesting.SeedInfo.seed([1E2731A7931AF8F5:9FC1BFBFE44598C9]:0)
[junit4:junit4]    > 	at junit.framework.Assert.fail(Assert.java:50)
[junit4:junit4]    > 	at org.apache.solr.BaseDistributedSearchTestCase.compareResponses(BaseDistributedSearchTestCase.java:670)
[junit4:junit4]    > 	at org.apache.solr.BaseDistributedSearchTestCase.query(BaseDistributedSearchTestCase.java:392)
[junit4:junit4]    > 	at org.apache.solr.handler.component.DistributedQueryElevationComponentTest.doTest(DistributedQueryElevationComponentTest.java:81)
[junit4:junit4]    > 	at org.apache.solr.BaseDistributedSearchTestCase.testDistribSearch(BaseDistributedSearchTestCase.java:679)
[junit4:junit4]    > 	at sun.reflect.NativeMethodAccessorImpl.invoke0(Native Method)
[junit4:junit4]    > 	at sun.reflect.NativeMethodAccessorImpl.invoke(NativeMethodAccessorImpl.java:57)
[junit4:junit4]    > 	at sun.reflect.DelegatingMethodAccessorImpl.invoke(DelegatingMethodAccessorImpl.java:43)
[junit4:junit4]    > 	at java.lang.reflect.Method.invoke(Method.java:474)
[junit4:junit4]    > 	at com.carrotsearch.randomizedtesting.RandomizedRunner.invoke(RandomizedRunner.java:1995)
[junit4:junit4]    > 	at com.carrotsearch.randomizedtesting.RandomizedRunner.access$1100(RandomizedRunner.java:132)
[junit4:junit4]    > 	at com.carrotsearch.randomizedtesting.RandomizedRunner$6.evaluate(RandomizedRunner.java:818)
[junit4:junit4]    > 	at com.carrotsearch.randomizedtesting.RandomizedRunner$7.evaluate(RandomizedRunner.java:877)
[junit4:junit4]    > 	at com.carrotsearch.randomizedtesting.RandomizedRunner$8.evaluate(RandomizedRunner.java:891)
[junit4:junit4]    > 	at com.carrotsearch.randomizedtesting.rules.SystemPropertiesRestoreRule$1.evaluate(SystemPropertiesRestoreRule.java:53)
[junit4:junit4]    > 	at org.apache.lucene.util.TestRuleSetupTeardownChained$1.evaluate(TestRuleSetupTeardownChained.java:50)
[junit4:junit4]    > 	at org.apache.lucene.util.TestRuleFieldCacheSanity$1.evaluate(TestRuleFieldCacheSanity.java:32)
[junit4:junit4]    > 	at org.apache.lucene.util.AbstractBeforeAfterRule$1.evaluate(AbstractBeforeAfterRule.java:45)
[junit4:junit4]    > 	at com.carrotsearch.randomizedtesting.rules.SystemPropertiesInvariantRule$1.evaluate(SystemPropertiesInvariantRule.java:55)
[junit4:junit4]    > 	at org.apache.lucene.util.TestRuleReportUncaughtExceptions$1.evaluate(TestRuleReportUncaughtExceptions.java:68)
[junit4:junit4]    > 	at org.apache.lucene.util.TestRuleThreadAndTestName$1.evaluate(TestRuleThreadAndTestName.java:48)
[junit4:junit4]    > 	at org.apache.lucene.util.TestRuleIgnoreAfterMaxFailures$1.evaluate(TestRuleIgnoreAfterMaxFailures.java:70)
[junit4:junit4]    > 	at org.apache.lucene.util.TestRuleMarkFailure$1.evaluate(TestRuleMarkFailure.java:48)
[junit4:junit4]    > 	at com.carrotsearch.randomizedtesting.RandomizedRunner.runSingleTest(RandomizedRunner.java:825)
[junit4:junit4]    > 	at com.carrotsearch.randomizedtesting.RandomizedRunner.access$700(RandomizedRunner.java:132)
[junit4:junit4]    > 	at com.carrotsearch.randomizedtesting.RandomizedRunner$3$1.run(RandomizedRunner.java:671)
[junit4:junit4]    > 	at com.carrotsearch.randomizedtesting.RandomizedRunner$3.evaluate(RandomizedRunner.java:697)
[junit4:junit4]    > 	at com.carrotsearch.randomizedtesting.RandomizedRunner$4.evaluate(RandomizedRunner.java:736)
[junit4:junit4]    > 	at com.carrotsearch.randomizedtesting.RandomizedRunner$5.evaluate(RandomizedRunner.java:747)
[junit4:junit4]    > 	at com.carrotsearch.randomizedtesting.rules.SystemPropertiesRestoreRule$1.evaluate(SystemPropertiesRestoreRule.java:53)
[junit4:junit4]    > 	at org.apache.lucene.util.AbstractBeforeAfterRule$1.evaluate(AbstractBeforeAfterRule.java:45)
[junit4:junit4]    > 	at org.apache.lucene.util.TestRuleReportUncaughtExceptions$1.evaluate(TestRuleReportUncaughtExceptions.java:68)
[junit4:junit4]    > 	at org.apache.lucene.util.TestRuleStoreClassName$1.evaluate(TestRuleStoreClassName.java:38)
[junit4:junit4]    > 	at com.carrotsearch.randomizedtesting.rules.SystemPropertiesInvariantRule$1.evaluate(SystemPropertiesInvariantRule.java:55)
[junit4:junit4]    > 	at org.apache.lucene.util.TestRuleNoInstanceHooksOverrides$1.evaluate(TestRuleNoInstanceHooksOverrides.java:53)
[junit4:junit4]    > 	at org.apache.lucene.util.TestRuleNoStaticHooksShadowing$1.evaluate(TestRuleNoStaticHooksShadowing.java:52)
[junit4:junit4]    > 	at org.apache.lucene.util.TestRuleAssertionsRequired$1.evaluate(TestRuleAssertionsRequired.java:36)
[junit4:junit4]    > 	at org.apache.lucene.util.TestRuleMarkFailure$1.evaluate(TestRuleMarkFailure.java:48)
[junit4:junit4]    > 	at org.apache.lucene.util.TestRuleIgnoreAfterMaxFailures$1.evaluate(TestRuleIgnoreAfterMaxFailures.java:70)
[junit4:junit4]    > 	at org.apache.lucene.util.TestRuleIgnoreTestSuites$1.evaluate(TestRuleIgnoreTestSuites.java:55)
[junit4:junit4]    > 	at com.carrotsearch.randomizedtesting.RandomizedRunner.runSuite(RandomizedRunner.java:605)
[junit4:junit4]    > 	at com.carrotsearch.randomizedtesting.RandomizedRunner.access$400(RandomizedRunner.java:132)
[junit4:junit4]    > 	at com.carrotsearch.randomizedtesting.RandomizedRunner$2.run(RandomizedRunner.java:551)
[junit4:junit4]    > 
[junit4:junit4]   2> 2 T2328 oas.SolrTestCaseJ4.setUp ###Starting testDistribSearch
[junit4:junit4]   2> 2 T2328 oejs.Server.doStart jetty-8.1.2.v20120308
[junit4:junit4]   2> 5 T2328 oejs.AbstractConnector.doStart Started SocketConnector@0.0.0.0:54797
[junit4:junit4]   2> 6 T2328 oasc.SolrResourceLoader.locateSolrHome JNDI not configured for solr (NoInitialContextEx)
[junit4:junit4]   2> 6 T2328 oasc.SolrResourceLoader.locateSolrHome using system property solr.solr.home: /mnt/ssd/jenkins/workspace/Lucene-Solr-4.x-Linux/checkout/solr/build/solr-core/test-files/solr
[junit4:junit4]   2> 6 T2328 oasc.SolrResourceLoader.<init> new SolrResourceLoader for deduced Solr Home: '/mnt/ssd/jenkins/workspace/Lucene-Solr-4.x-Linux/checkout/solr/build/solr-core/test-files/solr/'
[junit4:junit4]   2> 17 T2328 oass.SolrDispatchFilter.init SolrDispatchFilter.init()
[junit4:junit4]   2> 18 T2328 oasc.SolrResourceLoader.locateSolrHome JNDI not configured for solr (NoInitialContextEx)
[junit4:junit4]   2> 18 T2328 oasc.SolrResourceLoader.locateSolrHome using system property solr.solr.home: /mnt/ssd/jenkins/workspace/Lucene-Solr-4.x-Linux/checkout/solr/build/solr-core/test-files/solr
[junit4:junit4]   2> 18 T2328 oasc.CoreContainer$Initializer.initialize looking for solr.xml: /mnt/ssd/jenkins/workspace/Lucene-Solr-4.x-Linux/checkout/solr/build/solr-core/test-files/solr/solr.xml
[junit4:junit4]   2> 19 T2328 oasc.CoreContainer.<init> New CoreContainer 798079976
[junit4:junit4]   2> 19 T2328 oasc.CoreContainer.load Loading CoreContainer using Solr Home: '/mnt/ssd/jenkins/workspace/Lucene-Solr-4.x-Linux/checkout/solr/build/solr-core/test-files/solr/'
[junit4:junit4]   2> 19 T2328 oasc.SolrResourceLoader.<init> new SolrResourceLoader for directory: '/mnt/ssd/jenkins/workspace/Lucene-Solr-4.x-Linux/checkout/solr/build/solr-core/test-files/solr/'
[junit4:junit4]   2> 33 T2328 oasc.CoreContainer.load Registering Log Listener
[junit4:junit4]   2> 47 T2328 oasc.CoreContainer.create Creating SolrCore 'collection1' using instanceDir: /mnt/ssd/jenkins/workspace/Lucene-Solr-4.x-Linux/checkout/solr/build/solr-core/test-files/solr/collection1
[junit4:junit4]   2> 47 T2328 oasc.SolrResourceLoader.<init> new SolrResourceLoader for directory: '/mnt/ssd/jenkins/workspace/Lucene-Solr-4.x-Linux/checkout/solr/build/solr-core/test-files/solr/collection1/'
[junit4:junit4]   2> 48 T2328 oasc.SolrResourceLoader.replaceClassLoader Adding 'file:/mnt/ssd/jenkins/workspace/Lucene-Solr-4.x-Linux/checkout/solr/build/solr-core/test-files/solr/collection1/lib/README' to classloader
[junit4:junit4]   2> 48 T2328 oasc.SolrResourceLoader.replaceClassLoader Adding 'file:/mnt/ssd/jenkins/workspace/Lucene-Solr-4.x-Linux/checkout/solr/build/solr-core/test-files/solr/collection1/lib/classes/' to classloader
[junit4:junit4]   2> 69 T2328 oasc.SolrConfig.<init> Using Lucene MatchVersion: LUCENE_40
[junit4:junit4]   2> 97 T2328 oasc.SolrConfig.<init> Loaded SolrConfig: solrconfig-elevate.xml
[junit4:junit4]   2> 97 T2328 oass.IndexSchema.readSchema Reading Solr Schema
[junit4:junit4]   2> 100 T2328 oass.IndexSchema.readSchema Schema name=example
[junit4:junit4]   2> 214 T2328 oass.IndexSchema.readSchema default search field in schema is text
[junit4:junit4]   2> 216 T2328 oass.IndexSchema.readSchema unique key field: id
[junit4:junit4]   2> 218 T2328 oasc.SolrCore.<init> [collection1] Opening new SolrCore at /mnt/ssd/jenkins/workspace/Lucene-Solr-4.x-Linux/checkout/solr/build/solr-core/test-files/solr/collection1/, dataDir=./org.apache.solr.handler.component.DistributedQueryElevationComponentTest-1343622085880/control/data/
[junit4:junit4]   2> 218 T2328 oasc.JmxMonitoredMap.<init> JMX monitoring is enabled. Adding Solr mbeans to JMX Server: com.sun.jmx.mbeanserver.JmxMBeanServer@186c26bc
[junit4:junit4]   2> 219 T2328 oasc.SolrCore.getNewIndexDir WARNING New index directory detected: old=null new=./org.apache.solr.handler.component.DistributedQueryElevationComponentTest-1343622085880/control/data/index/
[junit4:junit4]   2> 219 T2328 oasc.SolrCore.initIndex WARNING [collection1] Solr index directory './org.apache.solr.handler.component.DistributedQueryElevationComponentTest-1343622085880/control/data/index' doesn't exist. Creating new index...
[junit4:junit4]   2> 220 T2328 oasc.SolrDeletionPolicy.onCommit SolrDeletionPolicy.onCommit: commits:num=1
[junit4:junit4]   2> 		commit{dir=MockDirWrapper(org.apache.lucene.store.RAMDirectory@1c1622a1 lockFactory=org.apache.lucene.store.SingleInstanceLockFactory@7af6d9d5),segFN=segments_1,generation=1,filenames=[segments_1]
[junit4:junit4]   2> 221 T2328 oasc.SolrDeletionPolicy.updateCommits newest commit = 1
[junit4:junit4]   2> 221 T2328 oasc.RequestHandlers.initHandlersFromConfig created /update: solr.UpdateRequestHandler
[junit4:junit4]   2> 222 T2328 oasc.RequestHandlers.initHandlersFromConfig created /elevate: org.apache.solr.handler.component.SearchHandler
[junit4:junit4]   2> 222 T2328 oasc.RequestHandlers.initHandlersFromConfig created /dataElevate: org.apache.solr.handler.component.SearchHandler
[junit4:junit4]   2> 222 T2328 oashl.XMLLoader.init xsltCacheLifetimeSeconds=60
[junit4:junit4]   2> 223 T2328 oasc.RequestHandlers.initHandlersFromConfig WARNING no default request handler is registered (either '/select' or 'standard')
[junit4:junit4]   2> 224 T2328 oasc.SolrCore.initDeprecatedSupport WARNING solrconfig.xml uses deprecated <admin/gettableFiles>, Please update your config to use the ShowFileRequestHandler.
[junit4:junit4]   2> 224 T2328 oasc.SolrCore.initDeprecatedSupport WARNING adding ShowFileRequestHandler with hidden files: [SOLRCONFIG-MASTER3.XML, STOP-1.TXT, SCHEMA.XML, SOLRCONFIG-SPELLCHECKER.XML, SCHEMA-COLLATEFILTER.XML, SOLRCONFIG-LAZYWRITER.XML, PROTWORDS.TXT, STOP-SNOWBALL.TXT, BAD-SCHEMA-NOT-INDEXED-BUT-NORMS.XML, SOLRCONFIG-TERMINDEX.XML, SCHEMA-BM25.XML, SCHEMA-IB.XML, SOLRCONFIG-REPEATER.XML, SOLRCONFIG-SLAVE.XML, CURRENCY.XML, SCHEMA-REQUIRED-FIELDS.XML, SOLRCONFIG-BASIC-LUCENEVERSION31.XML, SOLRCONFIG-SLAVE1.XML, SCHEMA11.XML, SOLRCONFIG-MASTER1-KEEPONEBACKUP.XML, DA_UTF8.XML, SCHEMA-NUMERIC.XML, TRIVIAL.UPDATEPROCESSOR0.JS, BAD-SCHEMA-UNIQUEKEY-USES-DEFAULT.XML, SOLRCONFIG-BASIC.XML, SCHEMA-SIM.XML, SOLRCONFIG-QUERYSENDER.XML, SOLRCONFIG-FUNCTIONQUERY.XML, SOLRCONFIG-HIGHLIGHT.XML, SOLRCONFIG-QUERYSENDER-NOQUERY.XML, SOLRCONFIG-NATIVELOCK.XML, SOLRCONFIG-SIMPLELOCK.XML, SCHEMA-REPLICATION2.XML, SOLRCONFIG-PHRASESUGGEST.XML, SOLRCONFIG-TLOG.XML, KEEP-1.TXT, SOLRCONFIG-SPELLCHECKCOMPONENT.XML, STOPTYPES-2.TXT, STEMDICT.TXT, HUNSPELL-TEST.AFF, SOLRCONFIG-NOCACHE.XML, SOLRCONFIG-REQHANDLER.INCL, BAD-SCHEMA-UNIQUEKEY-IS-COPYFIELD-DEST.XML, BAD-SCHEMA-EXTERNAL-FILEFIELD.XML, SCHEMA-STOP-KEEP.XML, SOLRCONFIG-XINCLUDE.XML, DA_COMPOUNDDICTIONARY.TXT, SOLRCONFIG-SOLR-749.XML, BAD-SOLRCONFIG-MISSING-SCRIPTFILE.XML, CONDITIONAL.UPDATEPROCESSOR.JS, SCHEMA12.XML, SCHEMA-COLLATE.XML, SCHEMA-LUCENEMATCHVERSION.XML, WDFTYPES.TXT, SOLRCONFIG-MERGEPOLICY.XML, BAD-SCHEMA-NONTEXT-ANALYZER.XML, SCHEMA-TRIE.XML, BAD-SOLRCONFIG-INVALID-SCRIPTFILE.XML, XSLT, SOLRCONFIG_PERF.XML, HUNSPELL-TEST.DIC, ADDFIELDS.UPDATEPROCESSOR.JS, THROW.ERROR.ON.ADD.UPDATEPROCESSOR.JS, SCHEMA-MINIMAL.XML, STOPWITHBOM.TXT, MISSLEADING.EXTENSION.UPDATEPROCESSOR.JS.TXT, SOLRCONFIG-MASTER.XML, SCHEMA-REVERSED.XML, SCHEMA-COPYFIELD-TEST.XML, SCHEMA-SPELLCHECKER.XML, SOLRCONFIG-UPDATE-PROCESSOR-CHAINS.XML, SOLRCONFIG-DELPOLICY1.XML, MAPPING-ISOLATIN1ACCENT.TXT, BAD-SCHEMA-NOT-INDEXED-BUT-TF.XML, BAD-MP-SOLRCONFIG.XML, BAD-SCHEMA-DUP-FIELDTYPE.XML, SOLRCONFIG_CODEC.XML, BAD-SOLRCONFIG-BOGUS-SCRIPTENGINE-NAME.XML, BAD-SCHEMA-SIM-GLOBAL-VS-FT-MISMATCH.XML, SOLRCONFIG-PROPINJECT.XML, SCHEMA_CODEC.XML, SCHEMA-LMDIRICHLET.XML, SCHEMA-TFIDF.XML, SOLRCONFIG-SOLCOREPROPERTIES.XML, STOPWORDSWRONGENCODING.TXT, SOLRCONFIG-ALTDIRECTORY.XML, MISSING.FUNCTIONS.UPDATEPROCESSOR.JS, SOLRCONFIG-ENABLEPLUGIN.XML, BAD-SCHEMA-DUP-DYNAMICFIELD.XML, SCHEMA-BINARYFIELD.XML, SOLRCONFIG-CACHING.XML, SCHEMA-CHARFILTERS.XML, OPEN-EXCHANGE-RATES.JSON, SOLRCONFIG-TRANSFORMERS.XML, STOPTYPES-1.TXT, SCHEMA-DFR.XML, STOP-2.TXT, BAD-SCHEMA-DUP-FIELD.XML, ELEVATE.XML, SCHEMA-NOT-REQUIRED-UNIQUE-KEY.XML, OLD_SYNONYMS.TXT, SCHEMA15.XML, SYNONYMS.TXT, TRIVIAL.UPDATEPROCESSOR1.JS, SOLRCONFIG-MASTER1.XML, BAD_SOLRCONFIG.XML, STOPWORDS.TXT, SCHEMASURROUND.XML, SCHEMA-PHRASESUGGEST.XML, SOLRCONFIG-PROPINJECT-INDEXDEFAULT.XML, COMPOUNDDICTIONARY.TXT, SOLRCONFIG-DELPOLICY2.XML, BAD-SCHEMA-NOT-INDEXED-BUT-POS.XML, KEEP-2.TXT, SCHEMA-LMJELINEKMERCER.XML, FRENCHARTICLES.TXT, SOLRCONFIG-ELEVATE.XML, PHRASESUGGEST.TXT, SOLRCONFIG-SCRIPT-UPDATEPROCESSOR.XML, SCHEMA-FOLDING.XML, BAD-SCHEMA-OMIT-TF-BUT-NOT-POS.XML, SCHEMA-REPLICATION1.XML, SOLRCONFIG-MASTER2.XML, BAD-SCHEMA-CODEC-GLOBAL-VS-FT-MISMATCH.XML, HYPHENATION.DTD]
[junit4:junit4]   2> 226 T2328 oass.SolrIndexSearcher.<init> Opening Searcher@5d749d1b main
[junit4:junit4]   2> 226 T2328 oass.SolrIndexSearcher.getIndexDir WARNING WARNING: Directory impl does not support setting indexDir: org.apache.lucene.store.MockDirectoryWrapper
[junit4:junit4]   2> 227 T2328 oasu.CommitTracker.<init> Hard AutoCommit: disabled
[junit4:junit4]   2> 227 T2328 oasu.CommitTracker.<init> Soft AutoCommit: disabled
[junit4:junit4]   2> 227 T2328 oashc.QueryElevationComponent.inform Loading QueryElevation from: /mnt/ssd/jenkins/workspace/Lucene-Solr-4.x-Linux/checkout/solr/build/solr-core/test-files/solr/collection1/conf/elevate.xml
[junit4:junit4]   2> 233 T2328 oashc.QueryElevationComponent.inform Loading QueryElevation from: /mnt/ssd/jenkins/workspace/Lucene-Solr-4.x-Linux/checkout/solr/build/solr-core/test-files/solr/collection1/conf/elevate.xml
[junit4:junit4]   2> 239 T2328 oashc.HttpShardHandlerFactory.getParameter Setting socketTimeout to: 0
[junit4:junit4]   2> 239 T2328 oashc.HttpShardHandlerFactory.getParameter Setting urlScheme to: http://
[junit4:junit4]   2> 240 T2328 oashc.HttpShardHandlerFactory.getParameter Setting connTimeout to: 0
[junit4:junit4]   2> 240 T2328 oashc.HttpShardHandlerFactory.getParameter Setting maxConnectionsPerHost to: 20
[junit4:junit4]   2> 240 T2328 oashc.HttpShardHandlerFactory.getParameter Setting corePoolSize to: 0
[junit4:junit4]   2> 241 T2328 oashc.HttpShardHandlerFactory.getParameter Setting maximumPoolSize to: 2147483647
[junit4:junit4]   2> 241 T2328 oashc.HttpShardHandlerFactory.getParameter Setting maxThreadIdleTime to: 5
[junit4:junit4]   2> 241 T2328 oashc.HttpShardHandlerFactory.getParameter Setting sizeOfQueue to: -1
[junit4:junit4]   2> 242 T2328 oashc.HttpShardHandlerFactory.getParameter Setting fairnessPolicy to: false
[junit4:junit4]   2> 242 T2328 oascsi.HttpClientUtil.createClient Creating new http client, config:maxConnectionsPerHost=20&maxConnections=10000&socketTimeout=0&connTimeout=0&retry=false
[junit4:junit4]   2> 245 T2328 oasc.CoreContainer.register registering core: collection1
[junit4:junit4]   2> 245 T2328 oass.SolrDispatchFilter.init user.dir=/mnt/ssd/jenkins/workspace/Lucene-Solr-4.x-Linux/checkout/solr/build/solr-core/test/J0
[junit4:junit4]   2> 245 T2328 oass.SolrDispatchFilter.init SolrDispatchFilter.init() done
[junit4:junit4]   2> 245 T2328 oascsi.HttpClientUtil.createClient Creating new http client, config:maxConnections=128&maxConnectionsPerHost=32&followRedirects=false
[junit4:junit4]   2> 247 T2338 oasc.SolrCore.registerSearcher [collection1] Registered new searcher Searcher@5d749d1b main{StandardDirectoryReader(segments_1:1)}
[junit4:junit4]   2> 249 T2328 oejs.Server.doStart jetty-8.1.2.v20120308
[junit4:junit4]   2> 251 T2328 oejs.AbstractConnector.doStart Started SocketConnector@0.0.0.0:45909
[junit4:junit4]   2> 252 T2328 oasc.SolrResourceLoader.locateSolrHome JNDI not configured for solr (NoInitialContextEx)
[junit4:junit4]   2> 252 T2328 oasc.SolrResourceLoader.locateSolrHome using system property solr.solr.home: /mnt/ssd/jenkins/workspace/Lucene-Solr-4.x-Linux/checkout/solr/build/solr-core/test-files/solr
[junit4:junit4]   2> 252 T2328 oasc.SolrResourceLoader.<init> new SolrResourceLoader for deduced Solr Home: '/mnt/ssd/jenkins/workspace/Lucene-Solr-4.x-Linux/checkout/solr/build/solr-core/test-files/solr/'
[junit4:junit4]   2> 259 T2328 oass.SolrDispatchFilter.init SolrDispatchFilter.init()
[junit4:junit4]   2> 260 T2328 oasc.SolrResourceLoader.locateSolrHome JNDI not configured for solr (NoInitialContextEx)
[junit4:junit4]   2> 260 T2328 oasc.SolrResourceLoader.locateSolrHome using system property solr.solr.home: /mnt/ssd/jenkins/workspace/Lucene-Solr-4.x-Linux/checkout/solr/build/solr-core/test-files/solr
[junit4:junit4]   2> 260 T2328 oasc.CoreContainer$Initializer.initialize looking for solr.xml: /mnt/ssd/jenkins/workspace/Lucene-Solr-4.x-Linux/checkout/solr/build/solr-core/test-files/solr/solr.xml
[junit4:junit4]   2> 260 T2328 oasc.CoreContainer.<init> New CoreContainer 1310406655
[junit4:junit4]   2> 260 T2328 oasc.CoreContainer.load Loading CoreContainer using Solr Home: '/mnt/ssd/jenkins/workspace/Lucene-Solr-4.x-Linux/checkout/solr/build/solr-core/test-files/solr/'
[junit4:junit4]   2> 261 T2328 oasc.SolrResourceLoader.<init> new SolrResourceLoader for directory: '/mnt/ssd/jenkins/workspace/Lucene-Solr-4.x-Linux/checkout/solr/build/solr-core/test-files/solr/'
[junit4:junit4]   2> 270 T2328 oasc.CoreContainer.load Registering Log Listener
[junit4:junit4]   2> 279 T2328 oasc.CoreContainer.create Creating SolrCore 'collection1' using instanceDir: /mnt/ssd/jenkins/workspace/Lucene-Solr-4.x-Linux/checkout/solr/build/solr-core/test-files/solr/collection1
[junit4:junit4]   2> 280 T2328 oasc.SolrResourceLoader.<init> new SolrResourceLoader for directory: '/mnt/ssd/jenkins/workspace/Lucene-Solr-4.x-Linux/checkout/solr/build/solr-core/test-files/solr/collection1/'
[junit4:junit4]   2> 280 T2328 oasc.SolrResourceLoader.replaceClassLoader Adding 'file:/mnt/ssd/jenkins/workspace/Lucene-Solr-4.x-Linux/checkout/solr/build/solr-core/test-files/solr/collection1/lib/README' to classloader
[junit4:junit4]   2> 280 T2328 oasc.SolrResourceLoader.replaceClassLoader Adding 'file:/mnt/ssd/jenkins/workspace/Lucene-Solr-4.x-Linux/checkout/solr/build/solr-core/test-files/solr/collection1/lib/classes/' to classloader
[junit4:junit4]   2> 299 T2328 oasc.SolrConfig.<init> Using Lucene MatchVersion: LUCENE_40
[junit4:junit4]   2> 326 T2328 oasc.SolrConfig.<init> Loaded SolrConfig: solrconfig-elevate.xml
[junit4:junit4]   2> 326 T2328 oass.IndexSchema.readSchema Reading Solr Schema
[junit4:junit4]   2> 328 T2328 oass.IndexSchema.readSchema Schema name=example
[junit4:junit4]   2> 473 T2328 oass.IndexSchema.readSchema default search field in schema is text
[junit4:junit4]   2> 474 T2328 oass.IndexSchema.readSchema unique key field: id
[junit4:junit4]   2> 476 T2328 oasc.SolrCore.<init> [collection1] Opening new SolrCore at /mnt/ssd/jenkins/workspace/Lucene-Solr-4.x-Linux/checkout/solr/build/solr-core/test-files/solr/collection1/, dataDir=./org.apache.solr.handler.component.DistributedQueryElevationComponentTest-1343622085880/shard0/data/
[junit4:junit4]   2> 476 T2328 oasc.JmxMonitoredMap.<init> JMX monitoring is enabled. Adding Solr mbeans to JMX Server: com.sun.jmx.mbeanserver.JmxMBeanServer@186c26bc
[junit4:junit4]   2> 477 T2328 oasc.SolrCore.getNewIndexDir WARNING New index directory detected: old=null new=./org.apache.solr.handler.component.DistributedQueryElevationComponentTest-1343622085880/shard0/data/index/
[junit4:junit4]   2> 477 T2328 oasc.SolrCore.initIndex WARNING [collection1] Solr index directory './org.apache.solr.handler.component.DistributedQueryElevationComponentTest-1343622085880/shard0/data/index' doesn't exist. Creating new index...
[junit4:junit4]   2> 478 T2328 oasc.SolrDeletionPolicy.onCommit SolrDeletionPolicy.onCommit: commits:num=1
[junit4:junit4]   2> 		commit{dir=MockDirWrapper(org.apache.lucene.store.RAMDirectory@17c19fe6 lockFactory=org.apache.lucene.store.SingleInstanceLockFactory@48e59a2a),segFN=segments_1,generation=1,filenames=[segments_1]
[junit4:junit4]   2> 478 T2328 oasc.SolrDeletionPolicy.updateCommits newest commit = 1
[junit4:junit4]   2> 479 T2328 oasc.RequestHandlers.initHandlersFromConfig created /update: solr.UpdateRequestHandler
[junit4:junit4]   2> 480 T2328 oasc.RequestHandlers.initHandlersFromConfig created /elevate: org.apache.solr.handler.component.SearchHandler
[junit4:junit4]   2> 480 T2328 oasc.RequestHandlers.initHandlersFromConfig created /dataElevate: org.apache.solr.handler.component.SearchHandler
[junit4:junit4]   2> 480 T2328 oashl.XMLLoader.init xsltCacheLifetimeSeconds=60
[junit4:junit4]   2> 480 T2328 oasc.RequestHandlers.initHandlersFromConfig WARNING no default request handler is registered (either '/select' or 'standard')
[junit4:junit4]   2> 481 T2328 oasc.SolrCore.initDeprecatedSupport WARNING solrconfig.xml uses deprecated <admin/gettableFiles>, Please update your config to use the ShowFileRequestHandler.
[junit4:junit4]   2> 482 T2328 oasc.SolrCore.initDeprecatedSupport WARNING adding ShowFileRequestHandler with hidden files: [SOLRCONFIG-MASTER3.XML, STOP-1.TXT, SCHEMA.XML, SOLRCONFIG-SPELLCHECKER.XML, SCHEMA-COLLATEFILTER.XML, SOLRCONFIG-LAZYWRITER.XML, PROTWORDS.TXT, STOP-SNOWBALL.TXT, BAD-SCHEMA-NOT-INDEXED-BUT-NORMS.XML, SOLRCONFIG-TERMINDEX.XML, SCHEMA-BM25.XML, SCHEMA-IB.XML, SOLRCONFIG-REPEATER.XML, SOLRCONFIG-SLAVE.XML, CURRENCY.XML, SCHEMA-REQUIRED-FIELDS.XML, SOLRCONFIG-BASIC-LUCENEVERSION31.XML, SOLRCONFIG-SLAVE1.XML, SCHEMA11.XML, SOLRCONFIG-MASTER1-KEEPONEBACKUP.XML, DA_UTF8.XML, SCHEMA-NUMERIC.XML, TRIVIAL.UPDATEPROCESSOR0.JS, BAD-SCHEMA-UNIQUEKEY-USES-DEFAULT.XML, SOLRCONFIG-BASIC.XML, SCHEMA-SIM.XML, SOLRCONFIG-QUERYSENDER.XML, SOLRCONFIG-FUNCTIONQUERY.XML, SOLRCONFIG-HIGHLIGHT.XML, SOLRCONFIG-QUERYSENDER-NOQUERY.XML, SOLRCONFIG-NATIVELOCK.XML, SOLRCONFIG-SIMPLELOCK.XML, SCHEMA-REPLICATION2.XML, SOLRCONFIG-PHRASESUGGEST.XML, SOLRCONFIG-TLOG.XML, KEEP-1.TXT, SOLRCONFIG-SPELLCHECKCOMPONENT.XML, STOPTYPES-2.TXT, STEMDICT.TXT, HUNSPELL-TEST.AFF, SOLRCONFIG-NOCACHE.XML, SOLRCONFIG-REQHANDLER.INCL, BAD-SCHEMA-UNIQUEKEY-IS-COPYFIELD-DEST.XML, BAD-SCHEMA-EXTERNAL-FILEFIELD.XML, SCHEMA-STOP-KEEP.XML, SOLRCONFIG-XINCLUDE.XML, DA_COMPOUNDDICTIONARY.TXT, SOLRCONFIG-SOLR-749.XML, BAD-SOLRCONFIG-MISSING-SCRIPTFILE.XML, CONDITIONAL.UPDATEPROCESSOR.JS, SCHEMA12.XML, SCHEMA-COLLATE.XML, SCHEMA-LUCENEMATCHVERSION.XML, WDFTYPES.TXT, SOLRCONFIG-MERGEPOLICY.XML, BAD-SCHEMA-NONTEXT-ANALYZER.XML, SCHEMA-TRIE.XML, BAD-SOLRCONFIG-INVALID-SCRIPTFILE.XML, XSLT, SOLRCONFIG_PERF.XML, HUNSPELL-TEST.DIC, ADDFIELDS.UPDATEPROCESSOR.JS, THROW.ERROR.ON.ADD.UPDATEPROCESSOR.JS, SCHEMA-MINIMAL.XML, STOPWITHBOM.TXT, MISSLEADING.EXTENSION.UPDATEPROCESSOR.JS.TXT, SOLRCONFIG-MASTER.XML, SCHEMA-REVERSED.XML, SCHEMA-COPYFIELD-TEST.XML, SCHEMA-SPELLCHECKER.XML, SOLRCONFIG-UPDATE-PROCESSOR-CHAINS.XML, SOLRCONFIG-DELPOLICY1.XML, MAPPING-ISOLATIN1ACCENT.TXT, BAD-SCHEMA-NOT-INDEXED-BUT-TF.XML, BAD-MP-SOLRCONFIG.XML, BAD-SCHEMA-DUP-FIELDTYPE.XML, SOLRCONFIG_CODEC.XML, BAD-SOLRCONFIG-BOGUS-SCRIPTENGINE-NAME.XML, BAD-SCHEMA-SIM-GLOBAL-VS-FT-MISMATCH.XML, SOLRCONFIG-PROPINJECT.XML, SCHEMA_CODEC.XML, SCHEMA-LMDIRICHLET.XML, SCHEMA-TFIDF.XML, SOLRCONFIG-SOLCOREPROPERTIES.XML, STOPWORDSWRONGENCODING.TXT, SOLRCONFIG-ALTDIRECTORY.XML, MISSING.FUNCTIONS.UPDATEPROCESSOR.JS, SOLRCONFIG-ENABLEPLUGIN.XML, BAD-SCHEMA-DUP-DYNAMICFIELD.XML, SCHEMA-BINARYFIELD.XML, SOLRCONFIG-CACHING.XML, SCHEMA-CHARFILTERS.XML, OPEN-EXCHANGE-RATES.JSON, SOLRCONFIG-TRANSFORMERS.XML, STOPTYPES-1.TXT, SCHEMA-DFR.XML, STOP-2.TXT, BAD-SCHEMA-DUP-FIELD.XML, ELEVATE.XML, SCHEMA-NOT-REQUIRED-UNIQUE-KEY.XML, OLD_SYNONYMS.TXT, SCHEMA15.XML, SYNONYMS.TXT, TRIVIAL.UPDATEPROCESSOR1.JS, SOLRCONFIG-MASTER1.XML, BAD_SOLRCONFIG.XML, STOPWORDS.TXT, SCHEMASURROUND.XML, SCHEMA-PHRASESUGGEST.XML, SOLRCONFIG-PROPINJECT-INDEXDEFAULT.XML, COMPOUNDDICTIONARY.TXT, SOLRCONFIG-DELPOLICY2.XML, BAD-SCHEMA-NOT-INDEXED-BUT-POS.XML, KEEP-2.TXT, SCHEMA-LMJELINEKMERCER.XML, FRENCHARTICLES.TXT, SOLRCONFIG-ELEVATE.XML, PHRASESUGGEST.TXT, SOLRCONFIG-SCRIPT-UPDATEPROCESSOR.XML, SCHEMA-FOLDING.XML, BAD-SCHEMA-OMIT-TF-BUT-NOT-POS.XML, SCHEMA-REPLICATION1.XML, SOLRCONFIG-MASTER2.XML, BAD-SCHEMA-CODEC-GLOBAL-VS-FT-MISMATCH.XML, HYPHENATION.DTD]
[junit4:junit4]   2> 484 T2328 oass.SolrIndexSearcher.<init> Opening Searcher@15614163 main
[junit4:junit4]   2> 484 T2328 oass.SolrIndexSearcher.getIndexDir WARNING WARNING: Directory impl does not support setting indexDir: org.apache.lucene.store.MockDirectoryWrapper
[junit4:junit4]   2> 484 T2328 oasu.CommitTracker.<init> Hard AutoCommit: disabled
[junit4:junit4]   2> 484 T2328 oasu.CommitTracker.<init> Soft AutoCommit: disabled
[junit4:junit4]   2> 485 T2328 oashc.QueryElevationComponent.inform Loading QueryElevation from: /mnt/ssd/jenkins/workspace/Lucene-Solr-4.x-Linux/checkout/solr/build/solr-core/test-files/solr/collection1/conf/elevate.xml
[junit4:junit4]   2> 491 T2328 oashc.QueryElevationComponent.inform Loading QueryElevation from: /mnt/ssd/jenkins/workspace/Lucene-Solr-4.x-Linux/checkout/solr/build/solr-core/test-files/solr/collection1/conf/elevate.xml
[junit4:junit4]   2> 496 T2328 oashc.HttpShardHandlerFactory.getParameter Setting socketTimeout to: 0
[junit4:junit4]   2> 497 T2328 oashc.HttpShardHandlerFactory.getParameter Setting urlScheme to: http://
[junit4:junit4]   2> 497 T2328 oashc.HttpShardHandlerFactory.getParameter Setting connTimeout to: 0
[junit4:junit4]   2> 497 T2328 oashc.HttpShardHandlerFactory.getParameter Setting maxConnectionsPerHost to: 20
[junit4:junit4]   2> 498 T2328 oashc.HttpShardHandlerFactory.getParameter Setting corePoolSize to: 0
[junit4:junit4]   2> 498 T2328 oashc.HttpShardHandlerFactory.getParameter Setting maximumPoolSize to: 2147483647
[junit4:junit4]   2> 498 T2328 oashc.HttpShardHandlerFactory.getParameter Setting maxThreadIdleTime to: 5
[junit4:junit4]   2> 499 T2328 oashc.HttpShardHandlerFactory.getParameter Setting sizeOfQueue to: -1
[junit4:junit4]   2> 499 T2328 oashc.HttpShardHandlerFactory.getParameter Setting fairnessPolicy to: false
[junit4:junit4]   2> 499 T2328 oascsi.HttpClientUtil.createClient Creating new http client, config:maxConnectionsPerHost=20&maxConnections=10000&socketTimeout=0&connTimeout=0&retry=false
[junit4:junit4]   2> 502 T2348 oasc.SolrCore.registerSearcher [collection1] Registered new searcher Searcher@15614163 main{StandardDirectoryReader(segments_1:1)}
[junit4:junit4]   2> 502 T2328 oasc.CoreContainer.register registering core: collection1
[junit4:junit4]   2> 503 T2328 oass.SolrDispatchFilter.init user.dir=/mnt/ssd/jenkins/workspace/Lucene-Solr-4.x-Linux/checkout/solr/build/solr-core/test/J0
[junit4:junit4]   2> 503 T2328 oass.SolrDispatchFilter.init SolrDispatchFilter.init() done
[junit4:junit4]   2> 503 T2328 oascsi.HttpClientUtil.createClient Creating new http client, config:maxConnections=128&maxConnectionsPerHost=32&followRedirects=false
[junit4:junit4]   2> 506 T2328 oejs.Server.doStart jetty-8.1.2.v20120308
[junit4:junit4]   2> 516 T2328 oejs.AbstractConnector.doStart Started SocketConnector@0.0.0.0:48522
[junit4:junit4]   2> 516 T2328 oasc.SolrResourceLoader.locateSolrHome JNDI not configured for solr (NoInitialContextEx)
[junit4:junit4]   2> 517 T2328 oasc.SolrResourceLoader.locateSolrHome using system property solr.solr.home: /mnt/ssd/jenkins/workspace/Lucene-Solr-4.x-Linux/checkout/solr/build/solr-core/test-files/solr
[junit4:junit4]   2> 517 T2328 oasc.SolrResourceLoader.<init> new SolrResourceLoader for deduced Solr Home: '/mnt/ssd/jenkins/workspace/Lucene-Solr-4.x-Linux/checkout/solr/build/solr-core/test-files/solr/'
[junit4:junit4]   2> 525 T2328 oass.SolrDispatchFilter.init SolrDispatchFilter.init()
[junit4:junit4]   2> 526 T2328 oasc.SolrResourceLoader.locateSolrHome JNDI not configured for solr (NoInitialContextEx)
[junit4:junit4]   2> 526 T2328 oasc.SolrResourceLoader.locateSolrHome using system property solr.solr.home: /mnt/ssd/jenkins/workspace/Lucene-Solr-4.x-Linux/checkout/solr/build/solr-core/test-files/solr
[junit4:junit4]   2> 526 T2328 oasc.CoreContainer$Initializer.initialize looking for solr.xml: /mnt/ssd/jenkins/workspace/Lucene-Solr-4.x-Linux/checkout/solr/build/solr-core/test-files/solr/solr.xml
[junit4:junit4]   2> 526 T2328 oasc.CoreContainer.<init> New CoreContainer 872994276
[junit4:junit4]   2> 526 T2328 oasc.CoreContainer.load Loading CoreContainer using Solr Home: '/mnt/ssd/jenkins/workspace/Lucene-Solr-4.x-Linux/checkout/solr/build/solr-core/test-files/solr/'
[junit4:junit4]   2> 527 T2328 oasc.SolrResourceLoader.<init> new SolrResourceLoader for directory: '/mnt/ssd/jenkins/workspace/Lucene-Solr-4.x-Linux/checkout/solr/build/solr-core/test-files/solr/'
[junit4:junit4]   2> 537 T2328 oasc.CoreContainer.load Registering Log Listener
[junit4:junit4]   2> 551 T2328 oasc.CoreContainer.create Creating SolrCore 'collection1' using instanceDir: /mnt/ssd/jenkins/workspace/Lucene-Solr-4.x-Linux/checkout/solr/build/solr-core/test-files/solr/collection1
[junit4:junit4]   2> 552 T2328 oasc.SolrResourceLoader.<init> new SolrResourceLoader for directory: '/mnt/ssd/jenkins/workspace/Lucene-Solr-4.x-Linux/checkout/solr/build/solr-core/test-files/solr/collection1/'
[junit4:junit4]   2> 552 T2328 oasc.SolrResourceLoader.replaceClassLoader Adding 'file:/mnt/ssd/jenkins/workspace/Lucene-Solr-4.x-Linux/checkout/solr/build/solr-core/test-files/solr/collection1/lib/README' to classloader
[junit4:junit4]   2> 553 T2328 oasc.SolrResourceLoader.replaceClassLoader Adding 'file:/mnt/ssd/jenkins/workspace/Lucene-Solr-4.x-Linux/checkout/solr/build/solr-core/test-files/solr/collection1/lib/classes/' to classloader
[junit4:junit4]   2> 580 T2328 oasc.SolrConfig.<init> Using Lucene MatchVersion: LUCENE_40
[junit4:junit4]   2> 607 T2328 oasc.SolrConfig.<init> Loaded SolrConfig: solrconfig-elevate.xml
[junit4:junit4]   2> 607 T2328 oass.IndexSchema.readSchema Reading Solr Schema
[junit4:junit4]   2> 609 T2328 oass.IndexSchema.readSchema Schema name=example
[junit4:junit4]   2> 716 T2328 oass.IndexSchema.readSchema default search field in schema is text
[junit4:junit4]   2> 717 T2328 oass.IndexSchema.readSchema unique key field: id
[junit4:junit4]   2> 719 T2328 oasc.SolrCore.<init> [collection1] Opening new SolrCore at /mnt/ssd/jenkins/workspace/Lucene-Solr-4.x-Linux/checkout/solr/build/solr-core/test-files/solr/collection1/, dataDir=./org.apache.solr.handler.component.DistributedQueryElevationComponentTest-1343622085880/shard1/data/
[junit4:junit4]   2> 720 T2328 oasc.JmxMonitoredMap.<init> JMX monitoring is enabled. Adding Solr mbeans to JMX Server: com.sun.jmx.mbeanserver.JmxMBeanServer@186c26bc
[junit4:junit4]   2> 720 T2328 oasc.SolrCore.getNewIndexDir WARNING New index directory detected: old=null new=./org.apache.solr.handler.component.DistributedQueryElevationComponentTest-1343622085880/shard1/data/index/
[junit4:junit4]   2> 720 T2328 oasc.SolrCore.initIndex WARNING [collection1] Solr index directory './org.apache.solr.handler.component.DistributedQueryElevationComponentTest-1343622085880/shard1/data/index' doesn't exist. Creating new index...
[junit4:junit4]   2> 721 T2328 oasc.SolrDeletionPolicy.onCommit SolrDeletionPolicy.onCommit: commits:num=1
[junit4:junit4]   2> 		commit{dir=MockDirWrapper(org.apache.lucene.store.RAMDirectory@63d404c4 lockFactory=org.apache.lucene.store.SingleInstanceLockFactory@4ca6798c),segFN=segments_1,generation=1,filenames=[segments_1]
[junit4:junit4]   2> 722 T2328 oasc.SolrDeletionPolicy.updateCommits newest commit = 1
[junit4:junit4]   2> 722 T2328 oasc.RequestHandlers.initHandlersFromConfig created /update: solr.UpdateRequestHandler
[junit4:junit4]   2> 723 T2328 oasc.RequestHandlers.initHandlersFromConfig created /elevate: org.apache.solr.handler.component.SearchHandler
[junit4:junit4]   2> 723 T2328 oasc.RequestHandlers.initHandlersFromConfig created /dataElevate: org.apache.solr.handler.component.SearchHandler
[junit4:junit4]   2> 723 T2328 oashl.XMLLoader.init xsltCacheLifetimeSeconds=60
[junit4:junit4]   2> 724 T2328 oasc.RequestHandlers.initHandlersFromConfig WARNING no default request handler is registered (either '/select' or 'standard')
[junit4:junit4]   2> 725 T2328 oasc.SolrCore.initDeprecatedSupport WARNING solrconfig.xml uses deprecated <admin/gettableFiles>, Please update your config to use the ShowFileRequestHandler.
[junit4:junit4]   2> 725 T2328 oasc.SolrCore.initDeprecatedSupport WARNING adding ShowFileRequestHandler with hidden files: [SOLRCONFIG-MASTER3.XML, STOP-1.TXT, SCHEMA.XML, SOLRCONFIG-SPELLCHECKER.XML, SCHEMA-COLLATEFILTER.XML, SOLRCONFIG-LAZYWRITER.XML, PROTWORDS.TXT, STOP-SNOWBALL.TXT, BAD-SCHEMA-NOT-INDEXED-BUT-NORMS.XML, SOLRCONFIG-TERMINDEX.XML, SCHEMA-BM25.XML, SCHEMA-IB.XML, SOLRCONFIG-REPEATER.XML, SOLRCONFIG-SLAVE.XML, CURRENCY.XML, SCHEMA-REQUIRED-FIELDS.XML, SOLRCONFIG-BASIC-LUCENEVERSION31.XML, SOLRCONFIG-SLAVE1.XML, SCHEMA11.XML, SOLRCONFIG-MASTER1-KEEPONEBACKUP.XML, DA_UTF8.XML, SCHEMA-NUMERIC.XML, TRIVIAL.UPDATEPROCESSOR0.JS, BAD-SCHEMA-UNIQUEKEY-USES-DEFAULT.XML, SOLRCONFIG-BASIC.XML, SCHEMA-SIM.XML, SOLRCONFIG-QUERYSENDER.XML, SOLRCONFIG-FUNCTIONQUERY.XML, SOLRCONFIG-HIGHLIGHT.XML, SOLRCONFIG-QUERYSENDER-NOQUERY.XML, SOLRCONFIG-NATIVELOCK.XML, SOLRCONFIG-SIMPLELOCK.XML, SCHEMA-REPLICATION2.XML, SOLRCONFIG-PHRASESUGGEST.XML, SOLRCONFIG-TLOG.XML, KEEP-1.TXT, SOLRCONFIG-SPELLCHECKCOMPONENT.XML, STOPTYPES-2.TXT, STEMDICT.TXT, HUNSPELL-TEST.AFF, SOLRCONFIG-NOCACHE.XML, SOLRCONFIG-REQHANDLER.INCL, BAD-SCHEMA-UNIQUEKEY-IS-COPYFIELD-DEST.XML, BAD-SCHEMA-EXTERNAL-FILEFIELD.XML, SCHEMA-STOP-KEEP.XML, SOLRCONFIG-XINCLUDE.XML, DA_COMPOUNDDICTIONARY.TXT, SOLRCONFIG-SOLR-749.XML, BAD-SOLRCONFIG-MISSING-SCRIPTFILE.XML, CONDITIONAL.UPDATEPROCESSOR.JS, SCHEMA12.XML, SCHEMA-COLLATE.XML, SCHEMA-LUCENEMATCHVERSION.XML, WDFTYPES.TXT, SOLRCONFIG-MERGEPOLICY.XML, BAD-SCHEMA-NONTEXT-ANALYZER.XML, SCHEMA-TRIE.XML, BAD-SOLRCONFIG-INVALID-SCRIPTFILE.XML, XSLT, SOLRCONFIG_PERF.XML, HUNSPELL-TEST.DIC, ADDFIELDS.UPDATEPROCESSOR.JS, THROW.ERROR.ON.ADD.UPDATEPROCESSOR.JS, SCHEMA-MINIMAL.XML, STOPWITHBOM.TXT, MISSLEADING.EXTENSION.UPDATEPROCESSOR.JS.TXT, SOLRCONFIG-MASTER.XML, SCHEMA-REVERSED.XML, SCHEMA-COPYFIELD-TEST.XML, SCHEMA-SPELLCHECKER.XML, SOLRCONFIG-UPDATE-PROCESSOR-CHAINS.XML, SOLRCONFIG-DELPOLICY1.XML, MAPPING-ISOLATIN1ACCENT.TXT, BAD-SCHEMA-NOT-INDEXED-BUT-TF.XML, BAD-MP-SOLRCONFIG.XML, BAD-SCHEMA-DUP-FIELDTYPE.XML, SOLRCONFIG_CODEC.XML, BAD-SOLRCONFIG-BOGUS-SCRIPTENGINE-NAME.XML, BAD-SCHEMA-SIM-GLOBAL-VS-FT-MISMATCH.XML, SOLRCONFIG-PROPINJECT.XML, SCHEMA_CODEC.XML, SCHEMA-LMDIRICHLET.XML, SCHEMA-TFIDF.XML, SOLRCONFIG-SOLCOREPROPERTIES.XML, STOPWORDSWRONGENCODING.TXT, SOLRCONFIG-ALTDIRECTORY.XML, MISSING.FUNCTIONS.UPDATEPROCESSOR.JS, SOLRCONFIG-ENABLEPLUGIN.XML, BAD-SCHEMA-DUP-DYNAMICFIELD.XML, SCHEMA-BINARYFIELD.XML, SOLRCONFIG-CACHING.XML, SCHEMA-CHARFILTERS.XML, OPEN-EXCHANGE-RATES.JSON, SOLRCONFIG-TRANSFORMERS.XML, STOPTYPES-1.TXT, SCHEMA-DFR.XML, STOP-2.TXT, BAD-SCHEMA-DUP-FIELD.XML, ELEVATE.XML, SCHEMA-NOT-REQUIRED-UNIQUE-KEY.XML, OLD_SYNONYMS.TXT, SCHEMA15.XML, SYNONYMS.TXT, TRIVIAL.UPDATEPROCESSOR1.JS, SOLRCONFIG-MASTER1.XML, BAD_SOLRCONFIG.XML, STOPWORDS.TXT, SCHEMASURROUND.XML, SCHEMA-PHRASESUGGEST.XML, SOLRCONFIG-PROPINJECT-INDEXDEFAULT.XML, COMPOUNDDICTIONARY.TXT, SOLRCONFIG-DELPOLICY2.XML, BAD-SCHEMA-NOT-INDEXED-BUT-POS.XML, KEEP-2.TXT, SCHEMA-LMJELINEKMERCER.XML, FRENCHARTICLES.TXT, SOLRCONFIG-ELEVATE.XML, PHRASESUGGEST.TXT, SOLRCONFIG-SCRIPT-UPDATEPROCESSOR.XML, SCHEMA-FOLDING.XML, BAD-SCHEMA-OMIT-TF-BUT-NOT-POS.XML, SCHEMA-REPLICATION1.XML, SOLRCONFIG-MASTER2.XML, BAD-SCHEMA-CODEC-GLOBAL-VS-FT-MISMATCH.XML, HYPHENATION.DTD]
[junit4:junit4]   2> 727 T2328 oass.SolrIndexSearcher.<init> Opening Searcher@55bbf995 main
[junit4:junit4]   2> 727 T2328 oass.SolrIndexSearcher.getIndexDir WARNING WARNING: Directory impl does not support setting indexDir: org.apache.lucene.store.MockDirectoryWrapper
[junit4:junit4]   2> 727 T2328 oasu.CommitTracker.<init> Hard AutoCommit: disabled
[junit4:junit4]   2> 728 T2328 oasu.CommitTracker.<init> Soft AutoCommit: disabled
[junit4:junit4]   2> 728 T2328 oashc.QueryElevationComponent.inform Loading QueryElevation from: /mnt/ssd/jenkins/workspace/Lucene-Solr-4.x-Linux/checkout/solr/build/solr-core/test-files/solr/collection1/conf/elevate.xml
[junit4:junit4]   2> 733 T2328 oashc.QueryElevationComponent.inform Loading QueryElevation from: /mnt/ssd/jenkins/workspace/Lucene-Solr-4.x-Linux/checkout/solr/build/solr-core/test-files/solr/collection1/conf/elevate.xml
[junit4:junit4]   2> 739 T2328 oashc.HttpShardHandlerFactory.getParameter Setting socketTimeout to: 0
[junit4:junit4]   2> 739 T2328 oashc.HttpShardHandlerFactory.getParameter Setting urlScheme to: http://
[junit4:junit4]   2> 739 T2328 oashc.HttpShardHandlerFactory.getParameter Setting connTimeout to: 0
[junit4:junit4]   2> 740 T2328 oashc.HttpShardHandlerFactory.getParameter Setting maxConnectionsPerHost to: 20
[junit4:junit4]   2> 740 T2328 oashc.HttpShardHandlerFactory.getParameter Setting corePoolSize to: 0
[junit4:junit4]   2> 740 T2328 oashc.HttpShardHandlerFactory.getParameter Setting maximumPoolSize to: 2147483647
[junit4:junit4]   2> 740 T2328 oashc.HttpShardHandlerFactory.getParameter Setting maxThreadIdleTime to: 5
[junit4:junit4]   2> 740 T2328 oashc.HttpShardHandlerFactory.getParameter Setting sizeOfQueue to: -1
[junit4:junit4]   2> 741 T2328 oashc.HttpShardHandlerFactory.getParameter Setting fairnessPolicy to: false
[junit4:junit4]   2> 741 T2328 oascsi.HttpClientUtil.createClient Creating new http client, config:maxConnectionsPerHost=20&maxConnections=10000&socketTimeout=0&connTimeout=0&retry=false
[junit4:junit4]   2> 743 T2358 oasc.SolrCore.registerSearcher [collection1] Registered new searcher Searcher@55bbf995 main{StandardDirectoryReader(segments_1:1)}
[junit4:junit4]   2> 743 T2328 oasc.CoreContainer.register registering core: collection1
[junit4:junit4]   2> 743 T2328 oass.SolrDispatchFilter.init user.dir=/mnt/ssd/jenkins/workspace/Lucene-Solr-4.x-Linux/checkout/solr/build/solr-core/test/J0
[junit4:junit4]   2> 743 T2328 oass.SolrDispatchFilter.init SolrDispatchFilter.init() done
[junit4:junit4]   2> 743 T2328 oascsi.HttpClientUtil.createClient Creating new http client, config:maxConnections=128&maxConnectionsPerHost=32&followRedirects=false
[junit4:junit4]   2> 745 T2328 oejs.Server.doStart jetty-8.1.2.v20120308
[junit4:junit4]   2> 746 T2328 oejs.AbstractConnector.doStart Started SocketConnector@0.0.0.0:46917
[junit4:junit4]   2> 747 T2328 oasc.SolrResourceLoader.locateSolrHome JNDI not configured for solr (NoInitialContextEx)
[junit4:junit4]   2> 747 T2328 oasc.SolrResourceLoader.locateSolrHome using system property solr.solr.home: /mnt/ssd/jenkins/workspace/Lucene-Solr-4.x-Linux/checkout/solr/build/solr-core/test-files/solr
[junit4:junit4]   2> 747 T2328 oasc.SolrResourceLoader.<init> new SolrResourceLoader for deduced Solr Home: '/mnt/ssd/jenkins/workspace/Lucene-Solr-4.x-Linux/checkout/solr/build/solr-core/test-files/solr/'
[junit4:junit4]   2> 754 T2328 oass.SolrDispatchFilter.init SolrDispatchFilter.init()
[junit4:junit4]   2> 755 T2328 oasc.SolrResourceLoader.locateSolrHome JNDI not configured for solr (NoInitialContextEx)
[junit4:junit4]   2> 755 T2328 oasc.SolrResourceLoader.locateSolrHome using system property solr.solr.home: /mnt/ssd/jenkins/workspace/Lucene-Solr-4.x-Linux/checkout/solr/build/solr-core/test-files/solr
[junit4:junit4]   2> 755 T2328 oasc.CoreContainer$Initializer.initialize looking for solr.xml: /mnt/ssd/jenkins/workspace/Lucene-Solr-4.x-Linux/checkout/solr/build/solr-core/test-files/solr/solr.xml
[junit4:junit4]   2> 755 T2328 oasc.CoreContainer.<init> New CoreContainer 168917844
[junit4:junit4]   2> 755 T2328 oasc.CoreContainer.load Loading CoreContainer using Solr Home: '/mnt/ssd/jenkins/workspace/Lucene-Solr-4.x-Linux/checkout/solr/build/solr-core/test-files/solr/'
[junit4:junit4]   2> 756 T2328 oasc.SolrResourceLoader.<init> new SolrResourceLoader for directory: '/mnt/ssd/jenkins/workspace/Lucene-Solr-4.x-Linux/checkout/solr/build/solr-core/test-files/solr/'
[junit4:junit4]   2> 764 T2328 oasc.CoreContainer.load Registering Log Listener
[junit4:junit4]   2> 777 T2328 oasc.CoreContainer.create Creating SolrCore 'collection1' using instanceDir: /mnt/ssd/jenkins/workspace/Lucene-Solr-4.x-Linux/checkout/solr/build/solr-core/test-files/solr/collection1
[junit4:junit4]   2> 778 T2328 oasc.SolrResourceLoader.<init> new SolrResourceLoader for directory: '/mnt/ssd/jenkins/workspace/Lucene-Solr-4.x-Linux/checkout/solr/build/solr-core/test-files/solr/collection1/'
[junit4:junit4]   2> 778 T2328 oasc.SolrResourceLoader.replaceClassLoader Adding 'file:/mnt/ssd/jenkins/workspace/Lucene-Solr-4.x-Linux/checkout/solr/build/solr-core/test-files/solr/collection1/lib/README' to classloader
[junit4:junit4]   2> 779 T2328 oasc.SolrResourceLoader.replaceClassLoader Adding 'file:/mnt/ssd/jenkins/workspace/Lucene-Solr-4.x-Linux/checkout/solr/build/solr-core/test-files/solr/collection1/lib/classes/' to classloader
[junit4:junit4]   2> 799 T2328 oasc.SolrConfig.<init> Using Lucene MatchVersion: LUCENE_40
[junit4:junit4]   2> 826 T2328 oasc.SolrConfig.<init> Loaded SolrConfig: solrconfig-elevate.xml
[junit4:junit4]   2> 826 T2328 oass.IndexSchema.readSchema Reading Solr Schema
[junit4:junit4]   2> 828 T2328 oass.IndexSchema.readSchema Schema name=example
[junit4:junit4]   2> 945 T1789 oaz.ClientCnxn$SendThread.startConnect Opening socket connection to server localhost.localdomain/127.0.0.1:36278
[junit4:junit4]   2> 945 T1789 oaz.ClientCnxn$SendThread.run WARNING Session 0x138d61b33ea0010 for server null, unexpected error, closing socket connection and attempting reconnect java.net.ConnectException: Connection refused
[junit4:junit4]   2> 	at sun.nio.ch.SocketChannelImpl.checkConnect(Native Method)
[junit4:junit4]   2> 	at sun.nio.ch.SocketChannelImpl.finishConnect(SocketChannelImpl.java:692)
[junit4:junit4]   2> 	at org.apache.zookeeper.ClientCnxn$SendThread.run(ClientCnxn.java:1143)
[junit4:junit4]   2> 
[junit4:junit4]   2> 974 T2328 oass.IndexSchema.readSchema default search field in schema is text
[junit4:junit4]   2> 976 T2328 oass.IndexSchema.readSchema unique key field: id
[junit4:junit4]   2> 978 T2328 oasc.SolrCore.<init> [collection1] Opening new SolrCore at /mnt/ssd/jenkins/workspace/Lucene-Solr-4.x-Linux/checkout/solr/build/solr-core/test-files/solr/collection1/, dataDir=./org.apache.solr.handler.component.DistributedQueryElevationComponentTest-1343622085880/shard2/data/
[junit4:junit4]   2> 978 T2328 oasc.JmxMonitoredMap.<init> JMX monitoring is enabled. Adding Solr mbeans to JMX Server: com.sun.jmx.mbeanserver.JmxMBeanServer@186c26bc
[junit4:junit4]   2> 978 T2328 oasc.SolrCore.getNewIndexDir WARNING New index directory detected: old=null new=./org.apache.solr.handler.component.DistributedQueryElevationComponentTest-1343622085880/shard2/data/index/
[junit4:junit4]   2> 979 T2328 oasc.SolrCore.initIndex WARNING [collection1] Solr index directory './org.apache.solr.handler.component.DistributedQueryElevationComponentTest-1343622085880/shard2/data/index' doesn't exist. Creating new index...
[junit4:junit4]   2> 980 T2328 oasc.SolrDeletionPolicy.onCommit SolrDeletionPolicy.onCommit: commits:num=1
[junit4:junit4]   2> 		commit{dir=MockDirWrapper(org.apache.lucene.store.RAMDirectory@4b5dc180 lockFactory=org.apache.lucene.store.SingleInstanceLockFactory@7c040523),segFN=segments_1,generation=1,filenames=[segments_1]
[junit4:junit4]   2> 980 T2328 oasc.SolrDeletionPolicy.updateCommits newest commit = 1
[junit4:junit4]   2> 981 T2328 oasc.RequestHandlers.initHandlersFromConfig created /update: solr.UpdateRequestHandler
[junit4:junit4]   2> 981 T2328 oasc.RequestHandlers.initHandlersFromConfig created /elevate: org.apache.solr.handler.component.SearchHandler
[junit4:junit4]   2> 981 T2328 oasc.RequestHandlers.initHandlersFromConfig created /dataElevate: org.apache.solr.handler.component.SearchHandler
[junit4:junit4]   2> 982 T2328 oashl.XMLLoader.init xsltCacheLifetimeSeconds=60
[junit4:junit4]   2> 982 T2328 oasc.RequestHandlers.initHandlersFromConfig WARNING no default request handler is registered (either '/select' or 'standard')
[junit4:junit4]   2> 983 T2328 oasc.SolrCore.initDeprecatedSupport WARNING solrconfig.xml uses deprecated <admin/gettableFiles>, Please update your config to use the ShowFileRequestHandler.
[junit4:junit4]   2> 984 T2328 oasc.SolrCore.initDeprecatedSupport WARNING adding ShowFileRequestHandler with hidden files: [SOLRCONFIG-MASTER3.XML, STOP-1.TXT, SCHEMA.XML, SOLRCONFIG-SPELLCHECKER.XML, SCHEMA-COLLATEFILTER.XML, SOLRCONFIG-LAZYWRITER.XML, PROTWORDS.TXT, STOP-SNOWBALL.TXT, BAD-SCHEMA-NOT-INDEXED-BUT-NORMS.XML, SOLRCONFIG-TERMINDEX.XML, SCHEMA-BM25.XML, SCHEMA-IB.XML, SOLRCONFIG-REPEATER.XML, SOLRCONFIG-SLAVE.XML, CURRENCY.XML, SCHEMA-REQUIRED-FIELDS.XML, SOLRCONFIG-BASIC-LUCENEVERSION31.XML, SOLRCONFIG-SLAVE1.XML, SCHEMA11.XML, SOLRCONFIG-MASTER1-KEEPONEBACKUP.XML, DA_UTF8.XML, SCHEMA-NUMERIC.XML, TRIVIAL.UPDATEPROCESSOR0.JS, BAD-SCHEMA-UNIQUEKEY-USES-DEFAULT.XML, SOLRCONFIG-BASIC.XML, SCHEMA-SIM.XML, SOLRCONFIG-QUERYSENDER.XML, SOLRCONFIG-FUNCTIONQUERY.XML, SOLRCONFIG-HIGHLIGHT.XML, SOLRCONFIG-QUERYSENDER-NOQUERY.XML, SOLRCONFIG-NATIVELOCK.XML, SOLRCONFIG-SIMPLELOCK.XML, SCHEMA-REPLICATION2.XML, SOLRCONFIG-PHRASESUGGEST.XML, SOLRCONFIG-TLOG.XML, KEEP-1.TXT, SOLRCONFIG-SPELLCHECKCOMPONENT.XML, STOPTYPES-2.TXT, STEMDICT.TXT, HUNSPELL-TEST.AFF, SOLRCONFIG-NOCACHE.XML, SOLRCONFIG-REQHANDLER.INCL, BAD-SCHEMA-UNIQUEKEY-IS-COPYFIELD-DEST.XML, BAD-SCHEMA-EXTERNAL-FILEFIELD.XML, SCHEMA-STOP-KEEP.XML, SOLRCONFIG-XINCLUDE.XML, DA_COMPOUNDDICTIONARY.TXT, SOLRCONFIG-SOLR-749.XML, BAD-SOLRCONFIG-MISSING-SCRIPTFILE.XML, CONDITIONAL.UPDATEPROCESSOR.JS, SCHEMA12.XML, SCHEMA-COLLATE.XML, SCHEMA-LUCENEMATCHVERSION.XML, WDFTYPES.TXT, SOLRCONFIG-MERGEPOLICY.XML, BAD-SCHEMA-NONTEXT-ANALYZER.XML, SCHEMA-TRIE.XML, BAD-SOLRCONFIG-INVALID-SCRIPTFILE.XML, XSLT, SOLRCONFIG_PERF.XML, HUNSPELL-TEST.DIC, ADDFIELDS.UPDATEPROCESSOR.JS, THROW.ERROR.ON.ADD.UPDATEPROCESSOR.JS, SCHEMA-MINIMAL.XML, STOPWITHBOM.TXT, MISSLEADING.EXTENSION.UPDATEPROCESSOR.JS.TXT, SOLRCONFIG-MASTER.XML, SCHEMA-REVERSED.XML, SCHEMA-COPYFIELD-TEST.XML, SCHEMA-SPELLCHECKER.XML, SOLRCONFIG-UPDATE-PROCESSOR-CHAINS.XML, SOLRCONFIG-DELPOLICY1.XML, MAPPING-ISOLATIN1ACCENT.TXT, BAD-SCHEMA-NOT-INDEXED-BUT-TF.XML, BAD-MP-SOLRCONFIG.XML, BAD-SCHEMA-DUP-FIELDTYPE.XML, SOLRCONFIG_CODEC.XML, BAD-SOLRCONFIG-BOGUS-SCRIPTENGINE-NAME.XML, BAD-SCHEMA-SIM-GLOBAL-VS-FT-MISMATCH.XML, SOLRCONFIG-PROPINJECT.XML, SCHEMA_CODEC.XML, SCHEMA-LMDIRICHLET.XML, SCHEMA-TFIDF.XML, SOLRCONFIG-SOLCOREPROPERTIES.XML, STOPWORDSWRONGENCODING.TXT, SOLRCONFIG-ALTDIRECTORY.XML, MISSING.FUNCTIONS.UPDATEPROCESSOR.JS, SOLRCONFIG-ENABLEPLUGIN.XML, BAD-SCHEMA-DUP-DYNAMICFIELD.XML, SCHEMA-BINARYFIELD.XML, SOLRCONFIG-CACHING.XML, SCHEMA-CHARFILTERS.XML, OPEN-EXCHANGE-RATES.JSON, SOLRCONFIG-TRANSFORMERS.XML, STOPTYPES-1.TXT, SCHEMA-DFR.XML, STOP-2.TXT, BAD-SCHEMA-DUP-FIELD.XML, ELEVATE.XML, SCHEMA-NOT-REQUIRED-UNIQUE-KEY.XML, OLD_SYNONYMS.TXT, SCHEMA15.XML, SYNONYMS.TXT, TRIVIAL.UPDATEPROCESSOR1.JS, SOLRCONFIG-MASTER1.XML, BAD_SOLRCONFIG.XML, STOPWORDS.TXT, SCHEMASURROUND.XML, SCHEMA-PHRASESUGGEST.XML, SOLRCONFIG-PROPINJECT-INDEXDEFAULT.XML, COMPOUNDDICTIONARY.TXT, SOLRCONFIG-DELPOLICY2.XML, BAD-SCHEMA-NOT-INDEXED-BUT-POS.XML, KEEP-2.TXT, SCHEMA-LMJELINEKMERCER.XML, FRENCHARTICLES.TXT, SOLRCONFIG-ELEVATE.XML, PHRASESUGGEST.TXT, SOLRCONFIG-SCRIPT-UPDATEPROCESSOR.XML, SCHEMA-FOLDING.XML, BAD-SCHEMA-OMIT-TF-BUT-NOT-POS.XML, SCHEMA-REPLICATION1.XML, SOLRCONFIG-MASTER2.XML, BAD-SCHEMA-CODEC-GLOBAL-VS-FT-MISMATCH.XML, HYPHENATION.DTD]
[junit4:junit4]   2> 985 T2328 oass.SolrIndexSearcher.<init> Opening Searcher@3416e08b main
[junit4:junit4]   2> 986 T2328 oass.SolrIndexSearcher.getIndexDir WARNING WARNING: Directory impl does not support setting indexDir: org.apache.lucene.store.MockDirectoryWrapper
[junit4:junit4]   2> 986 T2328 oasu.CommitTracker.<init> Hard AutoCommit: disabled
[junit4:junit4]   2> 986 T2328 oasu.CommitTracker.<init> Soft AutoCommit: disabled
[junit4:junit4]   2> 987 T2328 oashc.QueryElevationComponent.inform Loading QueryElevation from: /mnt/ssd/jenkins/workspace/Lucene-Solr-4.x-Linux/checkout/solr/build/solr-core/test-files/solr/collection1/conf/elevate.xml
[junit4:junit4]   2> 992 T2328 oashc.QueryElevationComponent.inform Loading QueryElevation from: /mnt/ssd/jenkins/workspace/Lucene-Solr-4.x-Linux/checkout/solr/build/solr-core/test-files/solr/collection1/conf/elevate.xml
[junit4:junit4]   2> 999 T2328 oashc.HttpShardHandlerFactory.getParameter Setting socketTimeout to: 0
[junit4:junit4]   2> 1000 T2328 oashc.HttpShardHandlerFactory.getParameter Setting urlScheme to: http://
[junit4:junit4]   2> 1000 T2328 oashc.HttpShardHandlerFactory.getParameter Setting connTimeout to: 0
[junit4:junit4]   2> 1000 T2328 oashc.HttpShardHandlerFactory.getParameter Setting maxConnectionsPerHost to: 20
[junit4:junit4]   2> 1001 T2328 oashc.HttpShardHandlerFactory.getParameter Setting corePoolSize to: 0
[junit4:junit4]   2> 1001 T2328 oashc.HttpShardHandlerFactory.getParameter Setting maximumPoolSize to: 2147483647
[junit4:junit4]   2> 1001 T2328 oashc.HttpShardHandlerFactory.getParameter Setting maxThreadIdleTime to: 5
[junit4:junit4]   2> 1002 T2328 oashc.HttpShardHandlerFactory.getParameter Setting sizeOfQueue to: -1
[junit4:junit4]   2> 1002 T2328 oashc.HttpShardHandlerFactory.getParameter Setting fairnessPolicy to: false
[junit4:junit4]   2> 1002 T2328 oascsi.HttpClientUtil.createClient Creating new http client, config:maxConnectionsPerHost=20&maxConnections=10000&socketTimeout=0&connTimeout=0&retry=false
[junit4:junit4]   2> 1005 T2328 oasc.CoreContainer.register registering core: collection1
[junit4:junit4]   2> 1006 T2328 oass.SolrDispatchFilter.init user.dir=/mnt/ssd/jenkins/workspace/Lucene-Solr-4.x-Linux/checkout/solr/build/solr-core/test/J0
[junit4:junit4]   2> 1006 T2328 oass.SolrDispatchFilter.init SolrDispatchFilter.init() done
[junit4:junit4]   2> 1006 T2328 oascsi.HttpClientUtil.createClient Creating new http client, config:maxConnections=128&maxConnectionsPerHost=32&followRedirects=false
[junit4:junit4]   2> ASYNC  NEW_CORE C164 name=collection1 org.apache.solr.core.SolrCore@465592c2
[junit4:junit4]   2> 1013 T2330 C164 oasu.DirectUpdateHandler2.deleteAll [collection1] REMOVING ALL DOCUMENTS FROM INDEX
[junit4:junit4]   2> 1014 T2330 C164 oasc.SolrDeletionPolicy.onInit SolrDeletionPolicy.onInit: commits:num=1
[junit4:junit4]   2> 		commit{dir=MockDirWrapper(org.apache.lucene.store.RAMDirectory@1c1622a1 lockFactory=org.apache.lucene.store.SingleInstanceLockFactory@7af6d9d5),segFN=segments_1,generation=1,filenames=[segments_1]
[junit4:junit4]   2> 1014 T2330 C164 oasc.SolrDeletionPolicy.updateCommits newest commit = 1
[junit4:junit4]   2> 1015 T2330 C164 UPDATE [collection1] webapp=/solr path=/update params={version=2&wt=javabin} {deleteByQuery=*:*} 0 3
[junit4:junit4]   2> 1015 T2368 oasc.SolrCore.registerSearcher [collection1] Registered new searcher Searcher@3416e08b main{StandardDirectoryReader(segments_1:1)}
[junit4:junit4]   2> ASYNC  NEW_CORE C165 name=collection1 org.apache.solr.core.SolrCore@51c5e703
[junit4:junit4]   2> 1019 T2341 C165 oasu.DirectUpdateHandler2.deleteAll [collection1] REMOVING ALL DOCUMENTS FROM INDEX
[junit4:junit4]   2> 1020 T2341 C165 oasc.SolrDeletionPolicy.onInit SolrDeletionPolicy.onInit: commits:num=1
[junit4:junit4]   2> 		commit{dir=MockDirWrapper(org.apache.lucene.store.RAMDirectory@17c19fe6 lockFactory=org.apache.lucene.store.SingleInstanceLockFactory@48e59a2a),segFN=segments_1,generation=1,filenames=[segments_1]
[junit4:junit4]   2> 1022 T2341 C165 oasc.SolrDeletionPolicy.updateCommits newest commit = 1
[junit4:junit4]   2> 1022 T2341 C165 UPDATE [collection1] webapp=/solr path=/update params={version=2&wt=javabin} {deleteByQuery=*:*} 0 3
[junit4:junit4]   2> ASYNC  NEW_CORE C166 name=collection1 org.apache.solr.core.SolrCore@180c9bf9
[junit4:junit4]   2> 1026 T2352 C166 oasu.DirectUpdateHandler2.deleteAll [collection1] REMOVING ALL DOCUMENTS FROM INDEX
[junit4:junit4]   2> 1028 T2352 C166 oasc.SolrDeletionPolicy.onInit SolrDeletionPolicy.onInit: commits:num=1
[junit4:junit4]   2> 		commit{dir=MockDirWrapper(org.apache.lucene.store.RAMDirectory@63d404c4 lockFactory=org.apache.lucene.store.SingleInstanceLockFactory@4ca6798c),segFN=segments_1,generation=1,filenames=[segments_1]
[junit4:junit4]   2> 1028 T2352 C166 oasc.SolrDeletionPolicy.updateCommits newest commit = 1
[junit4:junit4]   2> 1028 T2352 C166 UPDATE [collection1] webapp=/solr path=/update params={version=2&wt=javabin} {deleteByQuery=*:*} 0 2
[junit4:junit4]   2> ASYNC  NEW_CORE C167 name=collection1 org.apache.solr.core.SolrCore@3e707df6
[junit4:junit4]   2> 1032 T2361 C167 oasu.DirectUpdateHandler2.deleteAll [collection1] REMOVING ALL DOCUMENTS FROM INDEX
[junit4:junit4]   2> 1033 T2361 C167 oasc.SolrDeletionPolicy.onInit SolrDeletionPolicy.onInit: commits:num=1
[junit4:junit4]   2> 		commit{dir=MockDirWrapper(org.apache.lucene.store.RAMDirectory@4b5dc180 lockFactory=org.apache.lucene.store.SingleInstanceLockFactory@7c040523),segFN=segments_1,generation=1,filenames=[segments_1]
[junit4:junit4]   2> 1034 T2361 C167 oasc.SolrDeletionPolicy.updateCommits newest commit = 1
[junit4:junit4]   2> 1034 T2361 C167 UPDATE [collection1] webapp=/solr path=/update params={version=2&wt=javabin} {deleteByQuery=*:*} 0 2
[junit4:junit4]   2> 1037 T2330 C164 UPDATE [collection1] webapp=/solr path=/update params={version=2&wt=javabin} {add=[1]} 0 0
[junit4:junit4]   2> 1040 T2341 C165 UPDATE [collection1] webapp=/solr path=/update params={version=2&wt=javabin} {add=[1]} 0 1
[junit4:junit4]   2> 1042 T2330 C164 UPDATE [collection1] webapp=/solr path=/update params={version=2&wt=javabin} {add=[2]} 0 0
[junit4:junit4]   2> 1044 T2352 C166 UPDATE [collection1] webapp=/solr path=/update params={version=2&wt=javabin} {add=[2]} 0 0
[junit4:junit4]   2> 1047 T2330 C164 UPDATE [collection1] webapp=/solr path=/update params={version=2&wt=javabin} {add=[3]} 0 0
[junit4:junit4]   2> 1051 T2361 C167 UPDATE [collection1] webapp=/solr path=/update params={version=2&wt=javabin} {add=[3]} 0 1
[junit4:junit4]   2> 1053 T2330 C164 UPDATE [collection1] webapp=/solr path=/update params={version=2&wt=javabin} {add=[4]} 0 0
[junit4:junit4]   2> 1055 T2341 C165 UPDATE [collection1] webapp=/solr path=/update params={version=2&wt=javabin} {add=[4]} 0 0
[junit4:junit4]   2> 1058 T2330 C164 UPDATE [collection1] webapp=/solr path=/update params={version=2&wt=javabin} {add=[5]} 0 1
[junit4:junit4]   2> 1060 T2352 C166 UPDATE [collection1] webapp=/solr path=/update params={version=2&wt=javabin} {add=[5]} 0 0
[junit4:junit4]   2> 1062 T2330 C164 UPDATE [collection1] webapp=/solr path=/update params={version=2&wt=javabin} {add=[6]} 0 0
[junit4:junit4]   2> 1064 T2361 C167 UPDATE [collection1] webapp=/solr path=/update params={version=2&wt=javabin} {add=[6]} 0 0
[junit4:junit4]   2> 1067 T2330 C164 UPDATE [collection1] webapp=/solr path=/update params={version=2&wt=javabin} {add=[7]} 0 1
[junit4:junit4]   2> 1069 T2361 C167 UPDATE [collection1] webapp=/solr path=/update params={version=2&wt=javabin} {add=[7]} 0 0
[junit4:junit4]   2> 1071 T2330 C164 oasu.DirectUpdateHandler2.commit start commit{flags=0,_version_=0,optimize=false,openSearcher=true,waitSearcher=true,expungeDeletes=false,softCommit=false}
[junit4:junit4]   2> 1072 T2330 C164 oasc.SolrDeletionPolicy.onCommit SolrDeletionPolicy.onCommit: commits:num=2
[junit4:junit4]   2> 		commit{dir=MockDirWrapper(org.apache.lucene.store.RAMDirectory@1c1622a1 lockFactory=org.apache.lucene.store.SingleInstanceLockFactory@7af6d9d5),segFN=segments_1,generation=1,filenames=[segments_1]
[junit4:junit4]   2> 		commit{dir=MockDirWrapper(org.apache.lucene.store.RAMDirectory@1c1622a1 lockFactory=org.apache.lucene.store.SingleInstanceLockFactory@7af6d9d5),segFN=segments_2,generation=2,filenames=[_0_Pulsing40_0.frq, _0_Lucene40_0.prx, _0_nrm.cfs, _0_Lucene40_0.frq, _0.si, _0_Pulsing40_0.tim, _0_Lucene40_0.tip, _0_Pulsing40_0.prx, segments_2, _0.fnm, _0_Pulsing40_0.tip, _0_Lucene40_0.tim, _0.fdt, _0.fdx, _0_nrm.cfe]
[junit4:junit4]   2> 1073 T2330 C164 oasc.SolrDeletionPolicy.updateCommits newest commit = 2
[junit4:junit4]   2> 1074 T2330 C164 oass.SolrIndexSearcher.<init> Opening Searcher@38588dff main
[junit4:junit4]   2> 1074 T2330 C164 oass.SolrIndexSearcher.getIndexDir WARNING WARNING: Directory impl does not support setting indexDir: org.apache.lucene.store.MockDirectoryWrapper
[junit4:junit4]   2> 1075 T2338 oasc.SolrCore.registerSearcher [collection1] Registered new searcher Searcher@38588dff main{StandardDirectoryReader(segments_2:4 _0(4.0.0.1):C7)}
[junit4:junit4]   2> 1075 T2330 C164 oasu.DirectUpdateHandler2.commit end_commit_flush
[junit4:junit4]   2> 1076 T2330 C164 UPDATE [collection1] webapp=/solr path=/update params={wt=javabin&commit=true&softCommit=false&waitSearcher=true&version=2} {commit=} 0 5
[junit4:junit4]   2> 1078 T2341 C165 oasu.DirectUpdateHandler2.commit start commit{flags=0,_version_=0,optimize=false,openSearcher=true,waitSearcher=true,expungeDeletes=false,softCommit=false}
[junit4:junit4]   2> 1080 T2341 C165 oasc.SolrDeletionPolicy.onCommit SolrDeletionPolicy.onCommit: commits:num=2
[junit4:junit4]   2> 		commit{dir=MockDirWrapper(org.apache.lucene.store.RAMDirectory@17c19fe6 lockFactory=org.apache.lucene.store.SingleInstanceLockFactory@48e59a2a),segFN=segments_1,generation=1,filenames=[segments_1]
[junit4:junit4]   2> 		commit{dir=MockDirWrapper(org.apache.lucene.store.RAMDirectory@17c19fe6 lockFactory=org.apache.lucene.store.SingleInstanceLockFactory@48e59a2a),segFN=segments_2,generation=2,filenames=[_0_Pulsing40_0.frq, _0_Lucene40_0.prx, _0_nrm.cfs, _0_Lucene40_0.frq, _0.si, _0_Pulsing40_0.tim, _0_Lucene40_0.tip, _0_Pulsing40_0.prx, segments_2, _0.fnm, _0_Pulsing40_0.tip, _0_Lucene40_0.tim, _0.fdt, _0.fdx, _0_nrm.cfe]
[junit4:junit4]   2> 1080 T2341 C165 oasc.SolrDeletionPolicy.updateCommits newest commit = 2
[junit4:junit4]   2> 1081 T2341 C165 oass.SolrIndexSearcher.<init> Opening Searcher@2f9e7ec3 main
[junit4:junit4]   2> 1081 T2341 C165 oass.SolrIndexSearcher.getIndexDir WARNING WARNING: Directory impl does not support setting indexDir: org.apache.lucene.store.MockDirectoryWrapper
[junit4:junit4]   2> 1082 T2341 C165 oasu.DirectUpdateHandler2.commit end_commit_flush
[junit4:junit4]   2> 1082 T2348 oasc.SolrCore.registerSearcher [collection1] Registered new searcher Searcher@2f9e7ec3 main{StandardDirectoryReader(segments_2:4 _0(4.0.0.1):C2)}
[junit4:junit4]   2> 1083 T2341 C165 UPDATE [collection1] webapp=/solr path=/update params={wt=javabin&commit=true&softCommit=false&waitSearcher=true&version=2} {commit=} 0 5
[junit4:junit4]   2> 1085 T2352 C166 oasu.DirectUpdateHandler2.commit start commit{flags=0,_version_=0,optimize=false,openSearcher=true,waitSearcher=true,expungeDeletes=false,softCommit=false}
[junit4:junit4]   2> 1086 T2352 C166 oasc.SolrDeletionPolicy.onCommit SolrDeletionPolicy.onCommit: commits:num=2
[junit4:junit4]   2> 		commit{dir=MockDirWrapper(org.apache.lucene.store.RAMDirectory@63d404c4 lockFactory=org.apache.lucene.store.SingleInstanceLockFactory@4ca6798c),segFN=segments_1,generation=1,filenames=[segments_1]
[junit4:junit4]   2> 		commit{dir=MockDirWrapper(org.apache.lucene.store.RAMDirectory@63d404c4 lockFactory=org.apache.lucene.store.SingleInstanceLockFactory@4ca6798c),segFN=segments_2,generation=2,filenames=[_0_Pulsing40_0.frq, _0_Lucene40_0.prx, _0_nrm.cfs, _0_Lucene40_0.frq, _0.si, _0_Pulsing40_0.tim, _0_Lucene40_0.tip, _0_Pulsing40_0.prx, segments_2, _0.fnm, _0_Pulsing40_0.tip, _0_Lucene40_0.tim, _0.fdt, _0.fdx, _0_nrm.cfe]
[junit4:junit4]   2> 1087 T2352 C166 oasc.SolrDeletionPolicy.updateCommits newest commit = 2
[junit4:junit4]   2> 1088 T2352 C166 oass.SolrIndexSearcher.<init> Opening Searcher@1b72a93 main
[junit4:junit4]   2> 1088 T2352 C166 oass.SolrIndexSearcher.getIndexDir WARNING WARNING: Directory impl does not support setting indexDir: org.apache.lucene.store.MockDirectoryWrapper
[junit4:junit4]   2> 1089 T2352 C166 oasu.DirectUpdateHandler2.commit end_commit_flush
[junit4:junit4]   2> 1089 T2358 oasc.SolrCore.registerSearcher [collection1] Registered new searcher Searcher@1b72a93 main{StandardDirectoryReader(segments_2:4 _0(4.0.0.1):C2)}
[junit4:junit4]   2> 1091 T2352 C166 UPDATE [collection1] webapp=/solr path=/update params={wt=javabin&commit=true&softCommit=false&waitSearcher=true&version=2} {commit=} 0 6
[junit4:junit4]   2> 1093 T2361 C167 oasu.DirectUpdateHandler2.commit start commit{flags=0,_version_=0,optimize=false,openSearcher=true,waitSearcher=true,expungeDeletes=false,softCommit=false}
[junit4:junit4]   2> 1094 T2361 C167 oasc.SolrDeletionPolicy.onCommit SolrDeletionPolicy.onCommit: commits:num=2
[junit4:junit4]   2> 		commit{dir=MockDirWrapper(org.apache.lucene.store.RAMDirectory@4b5dc180 lockFactory=org.apache.lucene.store.SingleInstanceLockFactory@7c040523),segFN=segments_1,generation=1,filenames=[segments_1]
[junit4:junit4]   2> 		commit{dir=MockDirWrapper(org.apache.lucene.store.RAMDirectory@4b5dc180 lockFactory=org.apache.lucene.store.SingleInstanceLockFactory@7c040523),segFN=segments_2,generation=2,filenames=[_0_Pulsing40_0.frq, _0_Lucene40_0.prx, _0_nrm.cfs, _0_Lucene40_0.frq, _0.si, _0_Pulsing40_0.tim, _0_Lucene40_0.tip, _0_Pulsing40_0.prx, segments_2, _0.fnm, _0_Pulsing40_0.tip, _0_Lucene40_0.tim, _0.fdt, _0.fdx, _0_nrm.cfe]
[junit4:junit4]   2> 1095 T2361 C167 oasc.SolrDeletionPolicy.updateCommits newest commit = 2
[junit4:junit4]   2> 1096 T2361 C167 oass.SolrIndexSearcher.<init> Opening Searcher@1be45e0f main
[junit4:junit4]   2> 1096 T2361 C167 oass.SolrIndexSearcher.getIndexDir WARNING WARNING: Directory impl does not support setting indexDir: org.apache.lucene.store.MockDirectoryWrapper
[junit4:junit4]   2> 1097 T2361 C167 oasu.DirectUpdateHandler2.commit end_commit_flush
[junit4:junit4]   2> 1097 T2368 oasc.SolrCore.registerSearcher [collection1] Registered new searcher Searcher@1be45e0f main{StandardDirectoryReader(segments_2:4 _0(4.0.0.1):C3)}
[junit4:junit4]   2> 1098 T2361 C167 UPDATE [collection1] webapp=/solr path=/update params={wt=javabin&commit=true&softCommit=false&waitSearcher=true&version=2} {commit=} 0 5
[junit4:junit4]   2> 1104 T2330 C164 REQ [collection1] webapp=/solr path=/elevate params={fl=id,+score,+[elevated]&qt=/elevate&q=*:*&version=2&wt=javabin&shards.qt=/elevate&rows=500&sort=id+desc&distrib=false} hits=7 status=0 QTime=1 
[junit4:junit4]   2> 1119 T2342 C165 REQ [collection1] webapp=/solr path=/elevate params={start=0&q=*:*&version=2&isShard=true&rows=500&shards.qt=/elevate&fl=id,score&fsv=true&shard.url=localhost:45909/solr&qt=/elevate&wt=javabin&NOW=1343622086990&distrib=false&sort=id+desc} hits=2 status=0 QTime=1 
[junit4:junit4]   2> 1119 T2362 C167 REQ [collection1] webapp=/solr path=/elevate params={start=0&q=*:*&version=2&isShard=true&rows=500&shards.qt=/elevate&fl=id,score&fsv=true&shard.url=localhost:46917/solr&qt=/elevate&wt=javabin&NOW=1343622086990&distrib=false&sort=id+desc} hits=3 status=0 QTime=1 
[junit4:junit4]   2> 1127 T2353 C166 REQ [collection1] webapp=/solr path=/elevate params={start=0&q=*:*&version=2&isShard=true&rows=500&shards.qt=/elevate&fl=id,score&fsv=true&shard.url=localhost:48522/solr&qt=/elevate&wt=javabin&NOW=1343622086990&distrib=false&sort=id+desc} hits=2 status=0 QTime=9 
[junit4:junit4]   2> 1131 T2342 C165 REQ [collection1] webapp=/solr path=/elevate params={ids=4.0,1.0&q=*:*&version=2&isShard=true&shards.qt=/elevate&rows=500&fl=id,+score,+[elevated]&qt=/elevate&shard.url=localhost:45909/solr&wt=javabin&NOW=1343622086990&distrib=false} status=0 QTime=0 
[junit4:junit4]   2> 1131 T2353 C166 REQ [collection1] webapp=/solr path=/elevate params={ids=5.0,2.0&q=*:*&version=2&isShard=true&shards.qt=/elevate&rows=500&fl=id,+score,+[elevated]&qt=/elevate&shard.url=localhost:48522/solr&wt=javabin&NOW=1343622086990&distrib=false} status=0 QTime=0 
[junit4:junit4]   2> 1131 T2362 C167 REQ [collection1] webapp=/solr path=/elevate params={ids=6.0,7.0,3.0&q=*:*&version=2&isShard=true&shards.qt=/elevate&rows=500&fl=id,+score,+[elevated]&qt=/elevate&shard.url=localhost:46917/solr&wt=javabin&NOW=1343622086990&distrib=false} status=0 QTime=0 
[junit4:junit4]   2> 1132 T2361 C167 REQ [collection1] webapp=/solr path=/elevate params={fl=id,+score,+[elevated]&qt=/elevate&q=*:*&version=2&wt=javabin&shards=localhost:45909/solr,localhost:48522/solr,localhost:46917/solr&shards.qt=/elevate&rows=500&sort=id+desc} status=0 QTime=20 
[junit4:junit4]   2> 1147 T2328 oas.BaseDistributedSearchTestCase.compareResponses SEVERE Mismatched responses:
[junit4:junit4]   2> 	{responseHeader={status=0,QTime=20,params={fl=id, score, [elevated],qt=/elevate,q=*:*,version=2,wt=javabin,shards=localhost:45909/solr,localhost:48522/solr,localhost:46917/solr,shards.qt=/elevate,rows=500,sort=id desc}},response={numFound=7,start=0,maxScore=1.0,docs=[SolrDocument{id=7.0, [elevated]=false, score=1.0}, SolrDocument{id=6.0, [elevated]=false, score=1.0}, SolrDocument{id=5.0, [elevated]=false, score=1.0}, SolrDocument{id=4.0, [elevated]=false, score=1.0}, SolrDocument{id=3.0, [elevated]=false, score=1.0}, SolrDocument{id=2.0, [elevated]=false, score=1.0}, SolrDocument{id=1.0, [elevated]=false, score=1.0}]}}
[junit4:junit4]   2> 	{responseHeader={status=0,QTime=1,params={fl=id, score, [elevated],qt=/elevate,q=*:*,version=2,wt=javabin,shards.qt=/elevate,rows=500,sort=id desc,distrib=false}},response={numFound=7,start=0,maxScore=1.0,docs=[SolrDocument{id=7.0, score=1.0, [elevated]=false}, SolrDocument{id=6.0, score=1.0, [elevated]=false}, SolrDocument{id=5.0, score=1.0, [elevated]=false}, SolrDocument{id=4.0, score=1.0, [elevated]=false}, SolrDocument{id=3.0, score=1.0, [elevated]=false}, SolrDocument{id=2.0, score=1.0, [elevated]=false}, SolrDocument{id=1.0, score=1.0, [elevated]=false}]}}
[junit4:junit4]   2> 1149 T2328 oasc.CoreContainer.shutdown Shutting down CoreContainer instance=798079976
[junit4:junit4]   2> 1150 T2328 oasc.SolrCore.close [collection1]  CLOSING SolrCore org.apache.solr.core.SolrCore@465592c2
[junit4:junit4]   2> 1151 T2328 oasc.SolrCore.closeSearcher [collection1] Closing main searcher on request.
[junit4:junit4]   2> 1151 T2328 oasu.DirectUpdateHandler2.close closing DirectUpdateHandler2{commits=1,autocommits=0,soft autocommits=0,optimizes=0,rollbacks=0,expungeDeletes=0,docsPending=0,adds=0,deletesById=0,deletesByQuery=0,errors=0,cumulative_adds=7,cumulative_deletesById=0,cumulative_deletesByQuery=1,cumulative_errors=0}
[junit4:junit4]   2> 1154 T2328 oejsh.ContextHandler.doStop stopped o.e.j.s.ServletContextHandler{/solr,null}
[junit4:junit4]   2> 1207 T2328 oasc.CoreContainer.shutdown Shutting down CoreContainer instance=1310406655
[junit4:junit4]   2> 1208 T2328 oasc.SolrCore.close [collection1]  CLOSING SolrCore org.apache.solr.core.SolrCore@51c5e703
[junit4:junit4]   2> 1209 T2328 oasc.SolrCore.closeSearcher [collection1] Closing main searcher on request.
[junit4:junit4]   2> 1209 T2328 oasu.DirectUpdateHandler2.close closing DirectUpdateHandler2{commits=1,autocommits=0,soft autocommits=0,optimizes=0,rollbacks=0,expungeDeletes=0,docsPending=0,adds=0,deletesById=0,deletesByQuery=0,errors=0,cumulative_adds=2,cumulative_deletesById=0,cumulative_deletesByQuery=1,cumulative_errors=0}
[junit4:junit4]   2> 1212 T2328 oejsh.ContextHandler.doStop stopped o.e.j.s.ServletContextHandler{/solr,null}
[junit4:junit4]   2> 1267 T2328 oasc.CoreContainer.shutdown Shutting down CoreContainer instance=872994276
[junit4:junit4]   2> 1267 T2328 oasc.SolrCore.close [collection1]  CLOSING SolrCore org.apache.solr.core.SolrCore@180c9bf9
[junit4:junit4]   2> 1268 T2328 oasc.SolrCore.closeSearcher [collection1] Closing main searcher on request.
[junit4:junit4]   2> 1268 T2328 oasu.DirectUpdateHandler2.close closing DirectUpdateHandler2{commits=1,autocommits=0,soft autocommits=0,optimizes=0,rollbacks=0,expungeDeletes=0,docsPending=0,adds=0,deletesById=0,deletesByQuery=0,errors=0,cumulative_adds=2,cumulative_deletesById=0,cumulative_deletesByQuery=1,cumulative_errors=0}
[junit4:junit4]   2> 1271 T2328 oejsh.ContextHandler.doStop stopped o.e.j.s.ServletContextHandler{/solr,null}
[junit4:junit4]   2> 1322 T2328 oasc.CoreContainer.shutdown Shutting down CoreContainer instance=168917844
[junit4:junit4]   2> 1323 T2328 oasc.SolrCore.close [collection1]  CLOSING SolrCore org.apache.solr.core.SolrCore@3e707df6
[junit4:junit4]   2> 1323 T2328 oasc.SolrCore.closeSearcher [collection1] Closing main searcher on request.
[junit4:junit4]   2> 1324 T2328 oasu.DirectUpdateHandler2.close closing DirectUpdateHandler2{commits=1,autocommits=0,soft autocommits=0,optimizes=0,rollbacks=0,expungeDeletes=0,docsPending=0,adds=0,deletesById=0,deletesByQuery=0,errors=0,cumulative_adds=3,cumulative_deletesById=0,cumulative_deletesByQuery=1,cumulative_errors=0}
[junit4:junit4]   2> 1326 T2328 oejsh.ContextHandler.doStop stopped o.e.j.s.ServletContextHandler{/solr,null}
[junit4:junit4]   2> 1379 T2328 oas.SolrTestCaseJ4.tearDown ###Ending testDistribSearch
[junit4:junit4]   2> NOTE: reproduce with: ant test  -Dtestcase=DistributedQueryElevationComponentTest -Dtests.method=testDistribSearch -Dtests.seed=1E2731A7931AF8F5 -Dtests.multiplier=3 -Dtests.slow=true -Dtests.locale=en_AU -Dtests.timezone=America/North_Dakota/Center -Dtests.file.encoding=UTF-8
[junit4:junit4]   2>
[junit4:junit4]    > (@AfterClass output)
[junit4:junit4]   2> 1425 T2328 oas.SolrTestCaseJ4.deleteCore ###deleteCore
[junit4:junit4]   2> NOTE: test params are: codec=Lucene40: {text=Pulsing40(freqCutoff=5 minBlockSize=86 maxBlockSize=204), id=Lucene40(minBlockSize=86 maxBlockSize=204), field_t=Lucene40(minBlockSize=86 maxBlockSize=204), int_i=Pulsing40(freqCutoff=5 minBlockSize=86 maxBlockSize=204), plow_t=Pulsing40(freqCutoff=5 minBlockSize=86 maxBlockSize=204)}, sim=DefaultSimilarity, locale=en_AU, timezone=America/North_Dakota/Center
[junit4:junit4]   2> NOTE: Linux 3.2.0-27-generic amd64/Oracle Corporation 1.8.0-ea (64-bit)/cpus=8,threads=1,free=322189208,total=536870912
[junit4:junit4]   2> NOTE: All tests run in this JVM: [BadComponentTest, MinimalSchemaTest, IndexSchemaRuntimeFieldTest, TestXIncludeConfig, PingRequestHandlerTest, HighlighterConfigTest, TestPseudoReturnFields, FastVectorHighlighterTest, TestCollationField, DirectSolrConnectionTest, PeerSyncTest, CoreAdminHandlerTest, TestSearchPerf, DirectSolrSpellCheckerTest, TestRandomFaceting, TestReload, DefaultValueUpdateProcessorTest, TestSort, DateFieldTest, AutoCommitTest, CacheHeaderTest, MoreLikeThisHandlerTest, TestExtendedDismaxParser, WordBreakSolrSpellCheckerTest, TestDistributedGrouping, SolrCoreTest, PreAnalyzedFieldTest, TestStressLucene, RAMDirectoryFactoryTest, XmlUpdateRequestHandlerTest, TestNumberUtils, MBeansHandlerTest, AlternateDirectoryTest, SOLR749Test, TestRecovery, TermsComponentTest, TestJmxMonitoredMap, TestQuerySenderNoQuery, AnalysisAfterCoreReloadTest, DOMUtilTest, RequestHandlersTest, CSVRequestHandlerTest, TestLFUCache, DistributedTermsComponentTest, TestIndexSearcher, CoreContainerCoreInitFailuresTest, TestUtils, DocumentAnalysisRequestHandlerTest, TestSurroundQueryParser, TestCoreContainer, SolrCoreCheckLockOnStartupTest, OverseerTest, FullSolrCloudTest, FullSolrCloudDistribCmdsTest, DistributedSpellCheckComponentTest, TestRealTimeGet, CloudStateUpdateTest, BasicZkTest, ZkSolrClientTest, StatsComponentTest, TestRangeQuery, TestMultiCoreConfBootstrap, SimpleFacetsTest, LukeRequestHandlerTest, TestFiltering, FileBasedSpellCheckerTest, ConvertedLegacyTest, QueryElevationComponentTest, SortByFunctionTest, SignatureUpdateProcessorFactoryTest, TestBinaryResponseWriter, TestJmxIntegration, SampleTest, HighlighterTest, TestFunctionQuery, SolrRequestParserTest, TestRemoteStreaming, TestWordDelimiterFilterFactory, PolyFieldTest, SpatialFilterTest, TestCSVResponseWriter, DistributedQueryElevationComponentTest]
[junit4:junit4]   2> 
[junit4:junit4] Completed on J0 in 1.43s, 1 test, 1 failure <<< FAILURES!

[...truncated 223 lines...]
BUILD FAILED
/mnt/ssd/jenkins/workspace/Lucene-Solr-4.x-Linux/checkout/build.xml:29: The following error occurred while executing this line:
/mnt/ssd/jenkins/workspace/Lucene-Solr-4.x-Linux/checkout/solr/build.xml:144: The following error occurred while executing this line:
/mnt/ssd/jenkins/workspace/Lucene-Solr-4.x-Linux/checkout/lucene/module-build.xml:62: The following error occurred while executing this line:
/mnt/ssd/jenkins/workspace/Lucene-Solr-4.x-Linux/checkout/lucene/common-build.xml:1095: The following error occurred while executing this line:
/mnt/ssd/jenkins/workspace/Lucene-Solr-4.x-Linux/checkout/lucene/common-build.xml:790: There were test failures: 223 suites, 901 tests, 1 failure, 6 ignored (1 assumption)

Total time: 20 minutes 41 seconds
Build step 'Execute shell' marked build as failure
Archiving artifacts
Recording test results
Email was triggered for: Failure
Sending email for trigger: Failure



Mime
View raw message