lucene-dev mailing list archives

Site index · List index
Message view « Date » · « Thread »
Top « Date » · « Thread »
From Apache Jenkins Server <jenk...@builds.apache.org>
Subject [JENKINS] Lucene-Solr-tests-only-4.x - Build # 354 - Failure
Date Sat, 28 Jul 2012 20:06:22 GMT
Build: https://builds.apache.org/job/Lucene-Solr-tests-only-4.x/354/

1 tests failed.
FAILED:  org.apache.lucene.analysis.util.TestFilesystemResourceLoader.testBaseDir

Error Message:
Resource not found: ./fsResourceLoaderBase3961439632tmp/template.txt

Stack Trace:
java.io.IOException: Resource not found: ./fsResourceLoaderBase3961439632tmp/template.txt
	at __randomizedtesting.SeedInfo.seed([339C78F70C80AC8F:9B5CE7D7AA6A2B7]:0)
	at org.apache.lucene.analysis.util.ClasspathResourceLoader.openResource(ClasspathResourceLoader.java:67)
	at org.apache.lucene.analysis.util.FilesystemResourceLoader.openResource(FilesystemResourceLoader.java:86)
	at org.apache.lucene.analysis.util.TestFilesystemResourceLoader.testBaseDir(TestFilesystemResourceLoader.java:77)
	at sun.reflect.NativeMethodAccessorImpl.invoke0(Native Method)
	at sun.reflect.NativeMethodAccessorImpl.invoke(NativeMethodAccessorImpl.java:57)
	at sun.reflect.DelegatingMethodAccessorImpl.invoke(DelegatingMethodAccessorImpl.java:43)
	at java.lang.reflect.Method.invoke(Method.java:616)
	at com.carrotsearch.randomizedtesting.RandomizedRunner.invoke(RandomizedRunner.java:1995)
	at com.carrotsearch.randomizedtesting.RandomizedRunner.access$1100(RandomizedRunner.java:132)
	at com.carrotsearch.randomizedtesting.RandomizedRunner$6.evaluate(RandomizedRunner.java:818)
	at com.carrotsearch.randomizedtesting.RandomizedRunner$7.evaluate(RandomizedRunner.java:877)
	at com.carrotsearch.randomizedtesting.RandomizedRunner$8.evaluate(RandomizedRunner.java:891)
	at org.apache.lucene.util.TestRuleSetupTeardownChained$1.evaluate(TestRuleSetupTeardownChained.java:50)
	at org.apache.lucene.util.TestRuleFieldCacheSanity$1.evaluate(TestRuleFieldCacheSanity.java:32)
	at org.apache.lucene.util.AbstractBeforeAfterRule$1.evaluate(AbstractBeforeAfterRule.java:45)
	at com.carrotsearch.randomizedtesting.rules.SystemPropertiesInvariantRule$1.evaluate(SystemPropertiesInvariantRule.java:55)
	at org.apache.lucene.util.TestRuleReportUncaughtExceptions$1.evaluate(TestRuleReportUncaughtExceptions.java:68)
	at org.apache.lucene.util.TestRuleThreadAndTestName$1.evaluate(TestRuleThreadAndTestName.java:48)
	at org.apache.lucene.util.TestRuleIgnoreAfterMaxFailures$1.evaluate(TestRuleIgnoreAfterMaxFailures.java:70)
	at org.apache.lucene.util.TestRuleMarkFailure$1.evaluate(TestRuleMarkFailure.java:48)
	at com.carrotsearch.randomizedtesting.RandomizedRunner.runSingleTest(RandomizedRunner.java:825)
	at com.carrotsearch.randomizedtesting.RandomizedRunner.access$700(RandomizedRunner.java:132)
	at com.carrotsearch.randomizedtesting.RandomizedRunner$3$1.run(RandomizedRunner.java:671)
	at com.carrotsearch.randomizedtesting.RandomizedRunner$3.evaluate(RandomizedRunner.java:697)
	at com.carrotsearch.randomizedtesting.RandomizedRunner$4.evaluate(RandomizedRunner.java:736)
	at com.carrotsearch.randomizedtesting.RandomizedRunner$5.evaluate(RandomizedRunner.java:747)
	at org.apache.lucene.util.AbstractBeforeAfterRule$1.evaluate(AbstractBeforeAfterRule.java:45)
	at org.apache.lucene.util.TestRuleReportUncaughtExceptions$1.evaluate(TestRuleReportUncaughtExceptions.java:68)
	at org.apache.lucene.util.TestRuleStoreClassName$1.evaluate(TestRuleStoreClassName.java:38)
	at com.carrotsearch.randomizedtesting.rules.SystemPropertiesInvariantRule$1.evaluate(SystemPropertiesInvariantRule.java:55)
	at org.apache.lucene.util.TestRuleNoInstanceHooksOverrides$1.evaluate(TestRuleNoInstanceHooksOverrides.java:53)
	at org.apache.lucene.util.TestRuleNoStaticHooksShadowing$1.evaluate(TestRuleNoStaticHooksShadowing.java:52)
	at org.apache.lucene.util.TestRuleAssertionsRequired$1.evaluate(TestRuleAssertionsRequired.java:36)
	at org.apache.lucene.util.TestRuleMarkFailure$1.evaluate(TestRuleMarkFailure.java:48)
	at org.apache.lucene.util.TestRuleIgnoreAfterMaxFailures$1.evaluate(TestRuleIgnoreAfterMaxFailures.java:70)
	at org.apache.lucene.util.TestRuleIgnoreTestSuites$1.evaluate(TestRuleIgnoreTestSuites.java:55)
	at com.carrotsearch.randomizedtesting.RandomizedRunner.runSuite(RandomizedRunner.java:605)
	at com.carrotsearch.randomizedtesting.RandomizedRunner.access$400(RandomizedRunner.java:132)
	at com.carrotsearch.randomizedtesting.RandomizedRunner$2.run(RandomizedRunner.java:551)




Build Log:
[...truncated 4805 lines...]
[junit4:junit4] Suite: org.apache.lucene.analysis.payloads.TokenOffsetPayloadTokenFilterTest
[junit4:junit4] Completed on J0 in 0.01s, 1 test
[junit4:junit4]  
[junit4:junit4] Suite: org.apache.lucene.analysis.ar.TestArabicLetterTokenizer
[junit4:junit4] Completed on J1 in 0.01s, 2 tests
[junit4:junit4]  
[junit4:junit4] Suite: org.apache.lucene.analysis.charfilter.TestMappingCharFilterFactory
[junit4:junit4] Completed on J0 in 0.01s, 1 test
[junit4:junit4]  
[junit4:junit4] Suite: org.apache.lucene.analysis.cjk.TestCJKWidthFilterFactory
[junit4:junit4] Completed on J1 in 0.01s, 1 test
[junit4:junit4]  
[junit4:junit4] Suite: org.apache.lucene.analysis.cn.TestChineseFilterFactory
[junit4:junit4] Completed on J0 in 0.01s, 1 test
[junit4:junit4]  
[junit4:junit4] Suite: org.apache.lucene.analysis.commongrams.TestCommonGramsFilterFactory
[junit4:junit4] Completed on J0 in 0.02s, 2 tests
[junit4:junit4]  
[junit4:junit4] Suite: org.apache.lucene.analysis.core.TestAllAnalyzersHaveFactories
[junit4:junit4] Completed on J0 in 0.28s, 1 test
[junit4:junit4]  
[junit4:junit4] Suite: org.apache.lucene.analysis.cn.TestChineseTokenizer
[junit4:junit4] Completed on J1 in 1.44s, 5 tests
[junit4:junit4]  
[junit4:junit4] Suite: org.apache.lucene.analysis.core.TestTypeTokenFilterFactory
[junit4:junit4] Completed on J1 in 0.02s, 4 tests
[junit4:junit4]  
[junit4:junit4] Suite: org.apache.lucene.analysis.de.TestGermanMinimalStemFilterFactory
[junit4:junit4] Completed on J1 in 0.01s, 1 test
[junit4:junit4]  
[junit4:junit4] Suite: org.apache.lucene.analysis.en.TestPorterStemFilterFactory
[junit4:junit4] Completed on J1 in 0.01s, 1 test
[junit4:junit4]  
[junit4:junit4] Suite: org.apache.lucene.analysis.fi.TestFinnishLightStemFilterFactory
[junit4:junit4] Completed on J1 in 0.01s, 1 test
[junit4:junit4]  
[junit4:junit4] Suite: org.apache.lucene.analysis.hi.TestHindiFilters
[junit4:junit4] Completed on J1 in 0.02s, 3 tests
[junit4:junit4]  
[junit4:junit4] Suite: org.apache.lucene.analysis.hu.TestHungarianLightStemFilterFactory
[junit4:junit4] Completed on J1 in 0.02s, 1 test
[junit4:junit4]  
[junit4:junit4] Suite: org.apache.lucene.analysis.hunspell.TestHunspellStemFilterFactory
[junit4:junit4] Completed on J1 in 0.04s, 1 test
[junit4:junit4]  
[junit4:junit4] Suite: org.apache.lucene.analysis.id.TestIndonesianStemFilterFactory
[junit4:junit4] Completed on J1 in 0.02s, 2 tests
[junit4:junit4]  
[junit4:junit4] Suite: org.apache.lucene.analysis.miscellaneous.PatternAnalyzerTest
[junit4:junit4] Completed on J1 in 1.29s, 5 tests
[junit4:junit4]  
[junit4:junit4] Suite: org.apache.lucene.analysis.miscellaneous.TestCapitalizationFilterFactory
[junit4:junit4] Completed on J1 in 0.04s, 7 tests
[junit4:junit4]  
[junit4:junit4] Suite: org.apache.lucene.analysis.miscellaneous.TestKeywordMarkerFilterFactory
[junit4:junit4] Completed on J1 in 0.02s, 2 tests
[junit4:junit4]  
[junit4:junit4] Suite: org.apache.lucene.analysis.miscellaneous.TestRemoveDuplicatesTokenFilterFactory
[junit4:junit4] Completed on J1 in 0.01s, 1 test
[junit4:junit4]  
[junit4:junit4] Suite: org.apache.lucene.analysis.miscellaneous.TestStemmerOverrideFilterFactory
[junit4:junit4] Completed on J1 in 0.02s, 2 tests
[junit4:junit4]  
[junit4:junit4] Suite: org.apache.lucene.analysis.miscellaneous.TestTrimFilterFactory
[junit4:junit4] Completed on J1 in 0.01s, 1 test
[junit4:junit4]  
[junit4:junit4] Suite: org.apache.lucene.analysis.ngram.TestNGramFilters
[junit4:junit4] Completed on J1 in 0.05s, 10 tests
[junit4:junit4]  
[junit4:junit4] Suite: org.apache.lucene.analysis.pattern.TestPatternReplaceCharFilterFactory
[junit4:junit4] Completed on J1 in 0.02s, 3 tests
[junit4:junit4]  
[junit4:junit4] Suite: org.apache.lucene.analysis.pattern.TestPatternReplaceFilterFactory
[junit4:junit4] Completed on J1 in 0.01s, 1 test
[junit4:junit4]  
[junit4:junit4] Suite: org.apache.lucene.analysis.pattern.TestPatternTokenizerFactory
[junit4:junit4] Completed on J1 in 0.01s, 1 test
[junit4:junit4]  
[junit4:junit4] Suite: org.apache.lucene.analysis.ru.TestRussianLetterTokenizer
[junit4:junit4] Completed on J1 in 0.02s, 2 tests
[junit4:junit4]  
[junit4:junit4] Suite: org.apache.lucene.analysis.ru.TestRussianLightStemFilterFactory
[junit4:junit4] Completed on J1 in 0.01s, 1 test
[junit4:junit4]  
[junit4:junit4] Suite: org.apache.lucene.analysis.shingle.TestShingleFilterFactory
[junit4:junit4] Completed on J1 in 0.11s, 13 tests
[junit4:junit4]  
[junit4:junit4] Suite: org.apache.lucene.analysis.synonym.TestMultiWordSynonyms
[junit4:junit4] Completed on J1 in 0.02s, 2 tests
[junit4:junit4]  
[junit4:junit4] Suite: org.apache.lucene.analysis.synonym.TestSynonymFilterFactory
[junit4:junit4] Completed on J1 in 0.03s, 4 tests
[junit4:junit4]  
[junit4:junit4] Suite: org.apache.lucene.analysis.synonym.TestSynonymMap
[junit4:junit4] Completed on J1 in 0.04s, 6 tests
[junit4:junit4]  
[junit4:junit4] Suite: org.apache.lucene.analysis.tr.TestTurkishLowerCaseFilterFactory
[junit4:junit4] Completed on J1 in 0.01s, 1 test
[junit4:junit4]  
[junit4:junit4] Suite: org.apache.lucene.analysis.util.TestFilesystemResourceLoader
[junit4:junit4] ERROR   0.04s J1 | TestFilesystemResourceLoader.testBaseDir
[junit4:junit4]    > Throwable #1: java.io.IOException: Resource not found: ./fsResourceLoaderBase3961439632tmp/template.txt
[junit4:junit4]    > 	at __randomizedtesting.SeedInfo.seed([339C78F70C80AC8F:9B5CE7D7AA6A2B7]:0)
[junit4:junit4]    > 	at org.apache.lucene.analysis.util.ClasspathResourceLoader.openResource(ClasspathResourceLoader.java:67)
[junit4:junit4]    > 	at org.apache.lucene.analysis.util.FilesystemResourceLoader.openResource(FilesystemResourceLoader.java:86)
[junit4:junit4]    > 	at org.apache.lucene.analysis.util.TestFilesystemResourceLoader.testBaseDir(TestFilesystemResourceLoader.java:77)
[junit4:junit4]    > 	at sun.reflect.NativeMethodAccessorImpl.invoke0(Native Method)
[junit4:junit4]    > 	at sun.reflect.NativeMethodAccessorImpl.invoke(NativeMethodAccessorImpl.java:57)
[junit4:junit4]    > 	at sun.reflect.DelegatingMethodAccessorImpl.invoke(DelegatingMethodAccessorImpl.java:43)
[junit4:junit4]    > 	at java.lang.reflect.Method.invoke(Method.java:616)
[junit4:junit4]    > 	at com.carrotsearch.randomizedtesting.RandomizedRunner.invoke(RandomizedRunner.java:1995)
[junit4:junit4]    > 	at com.carrotsearch.randomizedtesting.RandomizedRunner.access$1100(RandomizedRunner.java:132)
[junit4:junit4]    > 	at com.carrotsearch.randomizedtesting.RandomizedRunner$6.evaluate(RandomizedRunner.java:818)
[junit4:junit4]    > 	at com.carrotsearch.randomizedtesting.RandomizedRunner$7.evaluate(RandomizedRunner.java:877)
[junit4:junit4]    > 	at com.carrotsearch.randomizedtesting.RandomizedRunner$8.evaluate(RandomizedRunner.java:891)
[junit4:junit4]    > 	at org.apache.lucene.util.TestRuleSetupTeardownChained$1.evaluate(TestRuleSetupTeardownChained.java:50)
[junit4:junit4]    > 	at org.apache.lucene.util.TestRuleFieldCacheSanity$1.evaluate(TestRuleFieldCacheSanity.java:32)
[junit4:junit4]    > 	at org.apache.lucene.util.AbstractBeforeAfterRule$1.evaluate(AbstractBeforeAfterRule.java:45)
[junit4:junit4]    > 	at com.carrotsearch.randomizedtesting.rules.SystemPropertiesInvariantRule$1.evaluate(SystemPropertiesInvariantRule.java:55)
[junit4:junit4]    > 	at org.apache.lucene.util.TestRuleReportUncaughtExceptions$1.evaluate(TestRuleReportUncaughtExceptions.java:68)
[junit4:junit4]    > 	at org.apache.lucene.util.TestRuleThreadAndTestName$1.evaluate(TestRuleThreadAndTestName.java:48)
[junit4:junit4]    > 	at org.apache.lucene.util.TestRuleIgnoreAfterMaxFailures$1.evaluate(TestRuleIgnoreAfterMaxFailures.java:70)
[junit4:junit4]    > 	at org.apache.lucene.util.TestRuleMarkFailure$1.evaluate(TestRuleMarkFailure.java:48)
[junit4:junit4]    > 	at com.carrotsearch.randomizedtesting.RandomizedRunner.runSingleTest(RandomizedRunner.java:825)
[junit4:junit4]    > 	at com.carrotsearch.randomizedtesting.RandomizedRunner.access$700(RandomizedRunner.java:132)
[junit4:junit4]    > 	at com.carrotsearch.randomizedtesting.RandomizedRunner$3$1.run(RandomizedRunner.java:671)
[junit4:junit4]    > 	at com.carrotsearch.randomizedtesting.RandomizedRunner$3.evaluate(RandomizedRunner.java:697)
[junit4:junit4]    > 	at com.carrotsearch.randomizedtesting.RandomizedRunner$4.evaluate(RandomizedRunner.java:736)
[junit4:junit4]    > 	at com.carrotsearch.randomizedtesting.RandomizedRunner$5.evaluate(RandomizedRunner.java:747)
[junit4:junit4]    > 	at org.apache.lucene.util.AbstractBeforeAfterRule$1.evaluate(AbstractBeforeAfterRule.java:45)
[junit4:junit4]    > 	at org.apache.lucene.util.TestRuleReportUncaughtExceptions$1.evaluate(TestRuleReportUncaughtExceptions.java:68)
[junit4:junit4]    > 	at org.apache.lucene.util.TestRuleStoreClassName$1.evaluate(TestRuleStoreClassName.java:38)
[junit4:junit4]    > 	at com.carrotsearch.randomizedtesting.rules.SystemPropertiesInvariantRule$1.evaluate(SystemPropertiesInvariantRule.java:55)
[junit4:junit4]    > 	at org.apache.lucene.util.TestRuleNoInstanceHooksOverrides$1.evaluate(TestRuleNoInstanceHooksOverrides.java:53)
[junit4:junit4]    > 	at org.apache.lucene.util.TestRuleNoStaticHooksShadowing$1.evaluate(TestRuleNoStaticHooksShadowing.java:52)
[junit4:junit4]    > 	at org.apache.lucene.util.TestRuleAssertionsRequired$1.evaluate(TestRuleAssertionsRequired.java:36)
[junit4:junit4]    > 	at org.apache.lucene.util.TestRuleMarkFailure$1.evaluate(TestRuleMarkFailure.java:48)
[junit4:junit4]    > 	at org.apache.lucene.util.TestRuleIgnoreAfterMaxFailures$1.evaluate(TestRuleIgnoreAfterMaxFailures.java:70)
[junit4:junit4]    > 	at org.apache.lucene.util.TestRuleIgnoreTestSuites$1.evaluate(TestRuleIgnoreTestSuites.java:55)
[junit4:junit4]    > 	at com.carrotsearch.randomizedtesting.RandomizedRunner.runSuite(RandomizedRunner.java:605)
[junit4:junit4]    > 	at com.carrotsearch.randomizedtesting.RandomizedRunner.access$400(RandomizedRunner.java:132)
[junit4:junit4]    > 	at com.carrotsearch.randomizedtesting.RandomizedRunner$2.run(RandomizedRunner.java:551)
[junit4:junit4]    > 
[junit4:junit4]   2> NOTE: reproduce with: ant test  -Dtestcase=TestFilesystemResourceLoader
-Dtests.method=testBaseDir -Dtests.seed=339C78F70C80AC8F -Dtests.multiplier=3 -Dtests.slow=true
-Dtests.locale=de_AT -Dtests.timezone=Singapore -Dtests.file.encoding=US-ASCII
[junit4:junit4]   2>
[junit4:junit4]    > (@AfterClass output)
[junit4:junit4]   2> NOTE: test params are: codec=Lucene40: {}, sim=DefaultSimilarity,
locale=de_AT, timezone=Singapore
[junit4:junit4]   2> NOTE: FreeBSD 9.0-RELEASE amd64/Sun Microsystems Inc. 1.6.0_32 (64-bit)/cpus=16,threads=1,free=101372408,total=261029888
[junit4:junit4]   2> NOTE: All tests run in this JVM: [TestIndonesianStemmer, TestTrimFilter,
TestItalianAnalyzer, TestSingleTokenTokenFilter, TestUAX29URLEmailTokenizerFactory, TokenTypeSinkTokenizerTest,
TestASCIIFoldingFilter, TestLatvianAnalyzer, TestGermanNormalizationFilterFactory, QueryAutoStopWordAnalyzerTest,
TestCJKBigramFilterFactory, TestPortugueseMinimalStemFilter, TestDutchStemmer, TestElisionFilterFactory,
TestSnowballPorterFilterFactory, TestStemmerOverrideFilter, TestMappingCharFilter, TestPrefixAndSuffixAwareTokenFilter,
TestCJKTokenizerFactory, WikipediaTokenizerTest, TestRussianFilters, TestNorwegianLightStemFilterFactory,
TestGermanNormalizationFilter, TestTurkishLowerCaseFilter, TestReverseStringFilter, TestGermanLightStemFilterFactory,
DateRecognizerSinkTokenizerTest, TestKeepFilterFactory, ShingleFilterTest, TestLengthFilterFactory,
TestEnglishMinimalStemFilterFactory, TestAnalysisSPILoader, TestChineseTokenizerFactory, TokenRangeSinkTokenizerTest,
TestPortugueseLightStemFilterFactory, TestSpanishAnalyzer, TestThaiWordFilterFactory, TestStopAnalyzer,
TestFrenchMinimalStemFilterFactory, TestPathHierarchyTokenizer, TestGermanAnalyzer, TestBrazilianStemFilterFactory,
TestCJKWidthFilter, TestCommonGramsQueryFilterFactory, TestItalianLightStemFilterFactory,
TestGreekLowerCaseFilterFactory, TestPortugueseStemFilterFactory, TestPersianNormalizationFilterFactory,
TestCollationKeyAnalyzer, TestIrishLowerCaseFilter, TestGalicianMinimalStemFilterFactory,
TestCollationKeyFilterFactory, TestCJKAnalyzer, TestHyphenationCompoundWordTokenFilterFactory,
TestCharArrayIterator, TestHindiNormalizer, TestSynonymMapFilter, TestRandomChains, TestRemoveDuplicatesTokenFilter,
TestCharTokenizers, TestPatternReplaceFilter, TestPortugueseStemFilter, TestPatternTokenizer,
TestFinnishLightStemFilter, TestFrenchLightStemFilter, TestKStemmer, TestRussianLightStemFilter,
TestIrishAnalyzer, TestTurkishAnalyzer, TestCzechAnalyzer, TestNorwegianLightStemFilter, TestRomanianAnalyzer,
TestArabicAnalyzer, TestSwedishAnalyzer, TestDanishAnalyzer, TestKeywordAnalyzer, TestPortugueseAnalyzer,
TestEnglishMinimalStemFilter, ShingleAnalyzerWrapperTest, TestHungarianLightStemFilter, TestLimitTokenCountAnalyzer,
TestArabicStemFilter, TestCharArraySet, TestSolrSynonymParser, TestIndicNormalizer, TestCharacterUtils,
TestHindiStemmer, TestKeywordMarkerFilter, TestPrefixAwareTokenFilter, TestWordnetSynonymParser,
TestEmptyTokenStream, TestArabicLetterTokenizer, TestCJKWidthFilterFactory, TestChineseTokenizer,
TestTypeTokenFilterFactory, TestGermanMinimalStemFilterFactory, TestPorterStemFilterFactory,
TestFinnishLightStemFilterFactory, TestHindiFilters, TestHungarianLightStemFilterFactory,
TestHunspellStemFilterFactory, TestIndonesianStemFilterFactory, PatternAnalyzerTest, TestCapitalizationFilterFactory,
TestKeywordMarkerFilterFactory, TestRemoveDuplicatesTokenFilterFactory, TestStemmerOverrideFilterFactory,
TestTrimFilterFactory, TestNGramFilters, TestPatternReplaceCharFilterFactory, TestPatternReplaceFilterFactory,
TestPatternTokenizerFactory, TestRussianLetterTokenizer, TestRussianLightStemFilterFactory,
TestShingleFilterFactory, TestMultiWordSynonyms, TestSynonymFilterFactory, TestSynonymMap,
TestTurkishLowerCaseFilterFactory, TestFilesystemResourceLoader]
[junit4:junit4]   2> 
[junit4:junit4] Completed on J1 in 0.07s, 2 tests, 1 error <<< FAILURES!
[...truncated 30 lines...]

[...truncated 4986 lines...]

[...truncated 4986 lines...]

[...truncated 4986 lines...]

[...truncated 4986 lines...]

[...truncated 4968 lines...]
BUILD FAILED
/usr/home/hudson/hudson-slave/workspace/Lucene-Solr-tests-only-4.x/checkout/build.xml:29:
The following error occurred while executing this line:
/usr/home/hudson/hudson-slave/workspace/Lucene-Solr-tests-only-4.x/checkout/lucene/build.xml:503:
The following error occurred while executing this line:
/usr/home/hudson/hudson-slave/workspace/Lucene-Solr-tests-only-4.x/checkout/lucene/common-build.xml:1497:
The following error occurred while executing this line:
/usr/home/hudson/hudson-slave/workspace/Lucene-Solr-tests-only-4.x/checkout/lucene/analysis/build.xml:101:
The following error occurred while executing this line:
/usr/home/hudson/hudson-slave/workspace/Lucene-Solr-tests-only-4.x/checkout/lucene/analysis/build.xml:38:
The following error occurred while executing this line:
/usr/home/hudson/hudson-slave/workspace/Lucene-Solr-tests-only-4.x/checkout/lucene/module-build.xml:62:
The following error occurred while executing this line:
/usr/home/hudson/hudson-slave/workspace/Lucene-Solr-tests-only-4.x/checkout/lucene/common-build.xml:1095:
The following error occurred while executing this line:
/usr/home/hudson/hudson-slave/workspace/Lucene-Solr-tests-only-4.x/checkout/lucene/common-build.xml:790:
There were test failures: 223 suites, 1148 tests, 1 error, 1 ignored

Total time: 7 minutes 47 seconds
Build step 'Execute shell' marked build as failure
Archiving artifacts
Recording test results
Publishing Clover coverage report...
No Clover report will be published due to a Build Failure
Email was triggered for: Failure
Sending email for trigger: Failure



Mime
View raw message