lucene-dev mailing list archives

Site index · List index
Message view « Date » · « Thread »
Top « Date » · « Thread »
From Policeman Jenkins Server <jenk...@sd-datasolutions.de>
Subject [JENKINS] Lucene-Solr-trunk-Linux-Java8-64 - Build # 26 - Still Failing!
Date Tue, 24 Jul 2012 20:47:15 GMT
Build: http://jenkins.sd-datasolutions.de/job/Lucene-Solr-trunk-Linux-Java8-64/26/

1 tests failed.
FAILED:  org.apache.solr.handler.component.DistributedQueryElevationComponentTest.testDistribSearch

Error Message:
.responseHeader.params.qt:/elevate!=false

Stack Trace:
junit.framework.AssertionFailedError: .responseHeader.params.qt:/elevate!=false
	at __randomizedtesting.SeedInfo.seed([720A596D7D1D337E:F3ECD7750A425342]:0)
	at junit.framework.Assert.fail(Assert.java:50)
	at org.apache.solr.BaseDistributedSearchTestCase.compareResponses(BaseDistributedSearchTestCase.java:670)
	at org.apache.solr.BaseDistributedSearchTestCase.query(BaseDistributedSearchTestCase.java:392)
	at org.apache.solr.handler.component.DistributedQueryElevationComponentTest.doTest(DistributedQueryElevationComponentTest.java:81)
	at org.apache.solr.BaseDistributedSearchTestCase.testDistribSearch(BaseDistributedSearchTestCase.java:679)
	at sun.reflect.NativeMethodAccessorImpl.invoke0(Native Method)
	at sun.reflect.NativeMethodAccessorImpl.invoke(NativeMethodAccessorImpl.java:57)
	at sun.reflect.DelegatingMethodAccessorImpl.invoke(DelegatingMethodAccessorImpl.java:43)
	at java.lang.reflect.Method.invoke(Method.java:474)
	at com.carrotsearch.randomizedtesting.RandomizedRunner.invoke(RandomizedRunner.java:1995)
	at com.carrotsearch.randomizedtesting.RandomizedRunner.access$1100(RandomizedRunner.java:132)
	at com.carrotsearch.randomizedtesting.RandomizedRunner$6.evaluate(RandomizedRunner.java:818)
	at com.carrotsearch.randomizedtesting.RandomizedRunner$7.evaluate(RandomizedRunner.java:877)
	at com.carrotsearch.randomizedtesting.RandomizedRunner$8.evaluate(RandomizedRunner.java:891)
	at com.carrotsearch.randomizedtesting.rules.SystemPropertiesRestoreRule$1.evaluate(SystemPropertiesRestoreRule.java:53)
	at org.apache.lucene.util.TestRuleSetupTeardownChained$1.evaluate(TestRuleSetupTeardownChained.java:50)
	at org.apache.lucene.util.TestRuleFieldCacheSanity$1.evaluate(TestRuleFieldCacheSanity.java:32)
	at org.apache.lucene.util.AbstractBeforeAfterRule$1.evaluate(AbstractBeforeAfterRule.java:45)
	at com.carrotsearch.randomizedtesting.rules.SystemPropertiesInvariantRule$1.evaluate(SystemPropertiesInvariantRule.java:55)
	at org.apache.lucene.util.TestRuleReportUncaughtExceptions$1.evaluate(TestRuleReportUncaughtExceptions.java:68)
	at org.apache.lucene.util.TestRuleThreadAndTestName$1.evaluate(TestRuleThreadAndTestName.java:48)
	at org.apache.lucene.util.TestRuleIgnoreAfterMaxFailures$1.evaluate(TestRuleIgnoreAfterMaxFailures.java:70)
	at org.apache.lucene.util.TestRuleMarkFailure$1.evaluate(TestRuleMarkFailure.java:48)
	at com.carrotsearch.randomizedtesting.RandomizedRunner.runSingleTest(RandomizedRunner.java:825)
	at com.carrotsearch.randomizedtesting.RandomizedRunner.access$700(RandomizedRunner.java:132)
	at com.carrotsearch.randomizedtesting.RandomizedRunner$3$1.run(RandomizedRunner.java:671)
	at com.carrotsearch.randomizedtesting.RandomizedRunner$3.evaluate(RandomizedRunner.java:697)
	at com.carrotsearch.randomizedtesting.RandomizedRunner$4.evaluate(RandomizedRunner.java:736)
	at com.carrotsearch.randomizedtesting.RandomizedRunner$5.evaluate(RandomizedRunner.java:747)
	at com.carrotsearch.randomizedtesting.rules.SystemPropertiesRestoreRule$1.evaluate(SystemPropertiesRestoreRule.java:53)
	at org.apache.lucene.util.AbstractBeforeAfterRule$1.evaluate(AbstractBeforeAfterRule.java:45)
	at org.apache.lucene.util.TestRuleReportUncaughtExceptions$1.evaluate(TestRuleReportUncaughtExceptions.java:68)
	at org.apache.lucene.util.TestRuleStoreClassName$1.evaluate(TestRuleStoreClassName.java:38)
	at org.apache.lucene.util.TestRuleIcuHack$1.evaluate(TestRuleIcuHack.java:51)
	at com.carrotsearch.randomizedtesting.rules.SystemPropertiesInvariantRule$1.evaluate(SystemPropertiesInvariantRule.java:55)
	at org.apache.lucene.util.TestRuleNoInstanceHooksOverrides$1.evaluate(TestRuleNoInstanceHooksOverrides.java:53)
	at org.apache.lucene.util.TestRuleNoStaticHooksShadowing$1.evaluate(TestRuleNoStaticHooksShadowing.java:52)
	at org.apache.lucene.util.TestRuleAssertionsRequired$1.evaluate(TestRuleAssertionsRequired.java:36)
	at org.apache.lucene.util.TestRuleMarkFailure$1.evaluate(TestRuleMarkFailure.java:48)
	at org.apache.lucene.util.TestRuleIgnoreAfterMaxFailures$1.evaluate(TestRuleIgnoreAfterMaxFailures.java:70)
	at org.apache.lucene.util.TestRuleIgnoreTestSuites$1.evaluate(TestRuleIgnoreTestSuites.java:55)
	at com.carrotsearch.randomizedtesting.RandomizedRunner.runSuite(RandomizedRunner.java:605)
	at com.carrotsearch.randomizedtesting.RandomizedRunner.access$400(RandomizedRunner.java:132)
	at com.carrotsearch.randomizedtesting.RandomizedRunner$2.run(RandomizedRunner.java:551)




Build Log:
[...truncated 7269 lines...]
[junit4:junit4] Suite: org.apache.solr.handler.component.DistributedQueryElevationComponentTest
[junit4:junit4] FAILURE 1.29s J1 | DistributedQueryElevationComponentTest.testDistribSearch
[junit4:junit4]    > Throwable #1: junit.framework.AssertionFailedError: .responseHeader.params.qt:/elevate!=false
[junit4:junit4]    > 	at __randomizedtesting.SeedInfo.seed([720A596D7D1D337E:F3ECD7750A425342]:0)
[junit4:junit4]    > 	at junit.framework.Assert.fail(Assert.java:50)
[junit4:junit4]    > 	at org.apache.solr.BaseDistributedSearchTestCase.compareResponses(BaseDistributedSearchTestCase.java:670)
[junit4:junit4]    > 	at org.apache.solr.BaseDistributedSearchTestCase.query(BaseDistributedSearchTestCase.java:392)
[junit4:junit4]    > 	at org.apache.solr.handler.component.DistributedQueryElevationComponentTest.doTest(DistributedQueryElevationComponentTest.java:81)
[junit4:junit4]    > 	at org.apache.solr.BaseDistributedSearchTestCase.testDistribSearch(BaseDistributedSearchTestCase.java:679)
[junit4:junit4]    > 	at sun.reflect.NativeMethodAccessorImpl.invoke0(Native Method)
[junit4:junit4]    > 	at sun.reflect.NativeMethodAccessorImpl.invoke(NativeMethodAccessorImpl.java:57)
[junit4:junit4]    > 	at sun.reflect.DelegatingMethodAccessorImpl.invoke(DelegatingMethodAccessorImpl.java:43)
[junit4:junit4]    > 	at java.lang.reflect.Method.invoke(Method.java:474)
[junit4:junit4]    > 	at com.carrotsearch.randomizedtesting.RandomizedRunner.invoke(RandomizedRunner.java:1995)
[junit4:junit4]    > 	at com.carrotsearch.randomizedtesting.RandomizedRunner.access$1100(RandomizedRunner.java:132)
[junit4:junit4]    > 	at com.carrotsearch.randomizedtesting.RandomizedRunner$6.evaluate(RandomizedRunner.java:818)
[junit4:junit4]    > 	at com.carrotsearch.randomizedtesting.RandomizedRunner$7.evaluate(RandomizedRunner.java:877)
[junit4:junit4]    > 	at com.carrotsearch.randomizedtesting.RandomizedRunner$8.evaluate(RandomizedRunner.java:891)
[junit4:junit4]    > 	at com.carrotsearch.randomizedtesting.rules.SystemPropertiesRestoreRule$1.evaluate(SystemPropertiesRestoreRule.java:53)
[junit4:junit4]    > 	at org.apache.lucene.util.TestRuleSetupTeardownChained$1.evaluate(TestRuleSetupTeardownChained.java:50)
[junit4:junit4]    > 	at org.apache.lucene.util.TestRuleFieldCacheSanity$1.evaluate(TestRuleFieldCacheSanity.java:32)
[junit4:junit4]    > 	at org.apache.lucene.util.AbstractBeforeAfterRule$1.evaluate(AbstractBeforeAfterRule.java:45)
[junit4:junit4]    > 	at com.carrotsearch.randomizedtesting.rules.SystemPropertiesInvariantRule$1.evaluate(SystemPropertiesInvariantRule.java:55)
[junit4:junit4]    > 	at org.apache.lucene.util.TestRuleReportUncaughtExceptions$1.evaluate(TestRuleReportUncaughtExceptions.java:68)
[junit4:junit4]    > 	at org.apache.lucene.util.TestRuleThreadAndTestName$1.evaluate(TestRuleThreadAndTestName.java:48)
[junit4:junit4]    > 	at org.apache.lucene.util.TestRuleIgnoreAfterMaxFailures$1.evaluate(TestRuleIgnoreAfterMaxFailures.java:70)
[junit4:junit4]    > 	at org.apache.lucene.util.TestRuleMarkFailure$1.evaluate(TestRuleMarkFailure.java:48)
[junit4:junit4]    > 	at com.carrotsearch.randomizedtesting.RandomizedRunner.runSingleTest(RandomizedRunner.java:825)
[junit4:junit4]    > 	at com.carrotsearch.randomizedtesting.RandomizedRunner.access$700(RandomizedRunner.java:132)
[junit4:junit4]    > 	at com.carrotsearch.randomizedtesting.RandomizedRunner$3$1.run(RandomizedRunner.java:671)
[junit4:junit4]    > 	at com.carrotsearch.randomizedtesting.RandomizedRunner$3.evaluate(RandomizedRunner.java:697)
[junit4:junit4]    > 	at com.carrotsearch.randomizedtesting.RandomizedRunner$4.evaluate(RandomizedRunner.java:736)
[junit4:junit4]    > 	at com.carrotsearch.randomizedtesting.RandomizedRunner$5.evaluate(RandomizedRunner.java:747)
[junit4:junit4]    > 	at com.carrotsearch.randomizedtesting.rules.SystemPropertiesRestoreRule$1.evaluate(SystemPropertiesRestoreRule.java:53)
[junit4:junit4]    > 	at org.apache.lucene.util.AbstractBeforeAfterRule$1.evaluate(AbstractBeforeAfterRule.java:45)
[junit4:junit4]    > 	at org.apache.lucene.util.TestRuleReportUncaughtExceptions$1.evaluate(TestRuleReportUncaughtExceptions.java:68)
[junit4:junit4]    > 	at org.apache.lucene.util.TestRuleStoreClassName$1.evaluate(TestRuleStoreClassName.java:38)
[junit4:junit4]    > 	at org.apache.lucene.util.TestRuleIcuHack$1.evaluate(TestRuleIcuHack.java:51)
[junit4:junit4]    > 	at com.carrotsearch.randomizedtesting.rules.SystemPropertiesInvariantRule$1.evaluate(SystemPropertiesInvariantRule.java:55)
[junit4:junit4]    > 	at org.apache.lucene.util.TestRuleNoInstanceHooksOverrides$1.evaluate(TestRuleNoInstanceHooksOverrides.java:53)
[junit4:junit4]    > 	at org.apache.lucene.util.TestRuleNoStaticHooksShadowing$1.evaluate(TestRuleNoStaticHooksShadowing.java:52)
[junit4:junit4]    > 	at org.apache.lucene.util.TestRuleAssertionsRequired$1.evaluate(TestRuleAssertionsRequired.java:36)
[junit4:junit4]    > 	at org.apache.lucene.util.TestRuleMarkFailure$1.evaluate(TestRuleMarkFailure.java:48)
[junit4:junit4]    > 	at org.apache.lucene.util.TestRuleIgnoreAfterMaxFailures$1.evaluate(TestRuleIgnoreAfterMaxFailures.java:70)
[junit4:junit4]    > 	at org.apache.lucene.util.TestRuleIgnoreTestSuites$1.evaluate(TestRuleIgnoreTestSuites.java:55)
[junit4:junit4]    > 	at com.carrotsearch.randomizedtesting.RandomizedRunner.runSuite(RandomizedRunner.java:605)
[junit4:junit4]    > 	at com.carrotsearch.randomizedtesting.RandomizedRunner.access$400(RandomizedRunner.java:132)
[junit4:junit4]    > 	at com.carrotsearch.randomizedtesting.RandomizedRunner$2.run(RandomizedRunner.java:551)
[junit4:junit4]    > 
[junit4:junit4]   2> 2 T9417 oas.SolrTestCaseJ4.setUp ###Starting testDistribSearch
[junit4:junit4]   2> 2 T9417 oejs.Server.doStart jetty-8.1.2.v20120308
[junit4:junit4]   2> 7 T9417 oejs.AbstractConnector.doStart Started SocketConnector@0.0.0.0:36456
[junit4:junit4]   2> 7 T9417 oasc.SolrResourceLoader.locateSolrHome JNDI not configured for solr (NoInitialContextEx)
[junit4:junit4]   2> 8 T9417 oasc.SolrResourceLoader.locateSolrHome using system property solr.solr.home: /mnt/ssd/jenkins/workspace/Lucene-Solr-trunk-Linux-Java8-64/checkout/solr/build/solr-core/test-files/solr
[junit4:junit4]   2> 8 T9417 oasc.SolrResourceLoader.<init> new SolrResourceLoader for deduced Solr Home: '/mnt/ssd/jenkins/workspace/Lucene-Solr-trunk-Linux-Java8-64/checkout/solr/build/solr-core/test-files/solr/'
[junit4:junit4]   2> 11 T9417 oass.SolrDispatchFilter.init SolrDispatchFilter.init()
[junit4:junit4]   2> 12 T9417 oasc.SolrResourceLoader.locateSolrHome JNDI not configured for solr (NoInitialContextEx)
[junit4:junit4]   2> 12 T9417 oasc.SolrResourceLoader.locateSolrHome using system property solr.solr.home: /mnt/ssd/jenkins/workspace/Lucene-Solr-trunk-Linux-Java8-64/checkout/solr/build/solr-core/test-files/solr
[junit4:junit4]   2> 12 T9417 oasc.CoreContainer$Initializer.initialize looking for solr.xml: /mnt/ssd/jenkins/workspace/Lucene-Solr-trunk-Linux-Java8-64/checkout/solr/build/solr-core/test-files/solr/solr.xml
[junit4:junit4]   2> 13 T9417 oasc.CoreContainer.<init> New CoreContainer 1808769822
[junit4:junit4]   2> 13 T9417 oasc.CoreContainer.load Loading CoreContainer using Solr Home: '/mnt/ssd/jenkins/workspace/Lucene-Solr-trunk-Linux-Java8-64/checkout/solr/build/solr-core/test-files/solr/'
[junit4:junit4]   2> 13 T9417 oasc.SolrResourceLoader.<init> new SolrResourceLoader for directory: '/mnt/ssd/jenkins/workspace/Lucene-Solr-trunk-Linux-Java8-64/checkout/solr/build/solr-core/test-files/solr/'
[junit4:junit4]   2> 19 T9417 oasc.CoreContainer.load Registering Log Listener
[junit4:junit4]   2> 32 T9417 oasc.CoreContainer.create Creating SolrCore 'collection1' using instanceDir: /mnt/ssd/jenkins/workspace/Lucene-Solr-trunk-Linux-Java8-64/checkout/solr/build/solr-core/test-files/solr/collection1
[junit4:junit4]   2> 32 T9417 oasc.SolrResourceLoader.<init> new SolrResourceLoader for directory: '/mnt/ssd/jenkins/workspace/Lucene-Solr-trunk-Linux-Java8-64/checkout/solr/build/solr-core/test-files/solr/collection1/'
[junit4:junit4]   2> 33 T9417 oasc.SolrResourceLoader.replaceClassLoader Adding 'file:/mnt/ssd/jenkins/workspace/Lucene-Solr-trunk-Linux-Java8-64/checkout/solr/build/solr-core/test-files/solr/collection1/lib/README' to classloader
[junit4:junit4]   2> 33 T9417 oasc.SolrResourceLoader.replaceClassLoader Adding 'file:/mnt/ssd/jenkins/workspace/Lucene-Solr-trunk-Linux-Java8-64/checkout/solr/build/solr-core/test-files/solr/collection1/lib/classes/' to classloader
[junit4:junit4]   2> 51 T9417 oasc.SolrConfig.<init> Using Lucene MatchVersion: LUCENE_50
[junit4:junit4]   2> 107 T9417 oasc.SolrConfig.<init> Loaded SolrConfig: solrconfig-elevate.xml
[junit4:junit4]   2> 108 T9417 oass.IndexSchema.readSchema Reading Solr Schema
[junit4:junit4]   2> 111 T9417 oass.IndexSchema.readSchema Schema name=example
[junit4:junit4]   2> 251 T9417 oass.IndexSchema.readSchema default search field in schema is text
[junit4:junit4]   2> 253 T9417 oass.IndexSchema.readSchema unique key field: id
[junit4:junit4]   2> 255 T9417 oasc.SolrCore.<init> [collection1] Opening new SolrCore at /mnt/ssd/jenkins/workspace/Lucene-Solr-trunk-Linux-Java8-64/checkout/solr/build/solr-core/test-files/solr/collection1/, dataDir=./org.apache.solr.handler.component.DistributedQueryElevationComponentTest-1343162789892/control/data/
[junit4:junit4]   2> 255 T9417 oasc.JmxMonitoredMap.<init> JMX monitoring is enabled. Adding Solr mbeans to JMX Server: com.sun.jmx.mbeanserver.JmxMBeanServer@1f6aa236
[junit4:junit4]   2> 256 T9417 oasc.SolrCore.getNewIndexDir WARNING New index directory detected: old=null new=./org.apache.solr.handler.component.DistributedQueryElevationComponentTest-1343162789892/control/data/index/
[junit4:junit4]   2> 256 T9417 oasc.SolrCore.initIndex WARNING [collection1] Solr index directory './org.apache.solr.handler.component.DistributedQueryElevationComponentTest-1343162789892/control/data/index' doesn't exist. Creating new index...
[junit4:junit4]   2> 257 T9417 oasc.SolrDeletionPolicy.onCommit SolrDeletionPolicy.onCommit: commits:num=1
[junit4:junit4]   2> 		commit{dir=MockDirWrapper(org.apache.lucene.store.RAMDirectory@c54af62 lockFactory=org.apache.lucene.store.SingleInstanceLockFactory@9008871),segFN=segments_1,generation=1,filenames=[segments_1]
[junit4:junit4]   2> 257 T9417 oasc.SolrDeletionPolicy.updateCommits newest commit = 1
[junit4:junit4]   2> 258 T9417 oasc.RequestHandlers.initHandlersFromConfig created /update: solr.UpdateRequestHandler
[junit4:junit4]   2> 258 T9417 oasc.RequestHandlers.initHandlersFromConfig created /elevate: org.apache.solr.handler.component.SearchHandler
[junit4:junit4]   2> 259 T9417 oasc.RequestHandlers.initHandlersFromConfig created /dataElevate: org.apache.solr.handler.component.SearchHandler
[junit4:junit4]   2> 259 T9417 oashl.XMLLoader.init xsltCacheLifetimeSeconds=60
[junit4:junit4]   2> 259 T9417 oasc.RequestHandlers.initHandlersFromConfig WARNING no default request handler is registered (either '/select' or 'standard')
[junit4:junit4]   2> 260 T9417 oasc.SolrCore.initDeprecatedSupport WARNING solrconfig.xml uses deprecated <admin/gettableFiles>, Please update your config to use the ShowFileRequestHandler.
[junit4:junit4]   2> 261 T9417 oasc.SolrCore.initDeprecatedSupport WARNING adding ShowFileRequestHandler with hidden files: [STEMDICT.TXT, SCHEMA-LUCENEMATCHVERSION.XML, SCHEMA12.XML, SOLRCONFIG-ENABLEPLUGIN.XML, BAD-SCHEMA-DUP-FIELD.XML, SCHEMA-TFIDF.XML, BAD-SCHEMA-NOT-INDEXED-BUT-POS.XML, SOLRCONFIG-UPDATE-PROCESSOR-CHAINS.XML, OPEN-EXCHANGE-RATES.JSON, SOLRCONFIG_CODEC.XML, STOPWORDS.TXT, STOPTYPES-1.TXT, SCHEMA-NOT-REQUIRED-UNIQUE-KEY.XML, SOLRCONFIG-QUERYSENDER-NOQUERY.XML, MISSING.FUNCTIONS.UPDATEPROCESSOR.JS, SCHEMA15.XML, SOLRCONFIG-ELEVATE.XML, SOLRCONFIG-LAZYWRITER.XML, SOLRCONFIG-PROPINJECT.XML, BAD-SOLRCONFIG-BOGUS-SCRIPTENGINE-NAME.XML, SOLRCONFIG-TLOG.XML, SOLRCONFIG-ALTDIRECTORY.XML, SCHEMA.XML, COMPOUNDDICTIONARY.TXT, SOLRCONFIG-NATIVELOCK.XML, SOLRCONFIG-TRANSFORMERS.XML, ELEVATE.XML, SOLRCONFIG-FUNCTIONQUERY.XML, SCHEMA-REPLICATION1.XML, SOLRCONFIG-HIGHLIGHT.XML, STOP-2.TXT, WDFTYPES.TXT, XSLT, KEEP-2.TXT, BAD-SCHEMA-UNIQUEKEY-USES-DEFAULT.XML, SCHEMA-IB.XML, SCHEMA-DFR.XML, SCHEMA-BINARYFIELD.XML, SOLRCONFIG-XINCLUDE.XML, BAD-SCHEMA-DUP-FIELDTYPE.XML, STOP-1.TXT, SCHEMA-CHARFILTERS.XML, SCHEMASURROUND.XML, SOLRCONFIG-BASIC.XML, BAD_SOLRCONFIG.XML, PROTWORDS.TXT, PHRASESUGGEST.TXT, SOLRCONFIG-MERGEPOLICY.XML, BAD-SCHEMA-CODEC-GLOBAL-VS-FT-MISMATCH.XML, KEEP-1.TXT, SCHEMA-FOLDING.XML, SOLRCONFIG-REQHANDLER.INCL, SOLRCONFIG-SPELLCHECKER.XML, SCHEMA-COLLATE.XML, SCHEMA-REPLICATION2.XML, SOLRCONFIG-QUERYSENDER.XML, SOLRCONFIG-NOCACHE.XML, SOLRCONFIG-TERMINDEX.XML, SCHEMA-LMJELINEKMERCER.XML, SCHEMA-BM25.XML, SOLRCONFIG-SLAVE.XML, BAD-SCHEMA-UNIQUEKEY-IS-COPYFIELD-DEST.XML, BAD-MP-SOLRCONFIG.XML, BAD-SCHEMA-OMIT-TF-BUT-NOT-POS.XML, SOLRCONFIG-SCRIPT-UPDATEPROCESSOR.XML, SCHEMA-TRIE.XML, SOLRCONFIG-REPEATER.XML, BAD-SCHEMA-DUP-DYNAMICFIELD.XML, SOLRCONFIG-SLAVE1.XML, ADDFIELDS.UPDATEPROCESSOR.JS, SOLRCONFIG-SOLCOREPROPERTIES.XML, SCHEMA-MINIMAL.XML, BAD-SCHEMA-SIM-GLOBAL-VS-FT-MISMATCH.XML, CONDITIONAL.UPDATEPROCESSOR.JS, SCHEMA_CODEC.XML, MISSLEADING.EXTENSION.UPDATEPROCESSOR.JS.TXT, BAD-SOLRCONFIG-INVALID-SCRIPTFILE.XML, SOLRCONFIG-MASTER1-KEEPONEBACKUP.XML, SYNONYMS.TXT, TRIVIAL.UPDATEPROCESSOR0.JS, SOLRCONFIG-SPELLCHECKCOMPONENT.XML, HYPHENATION.DTD, SCHEMA11.XML, TRIVIAL.UPDATEPROCESSOR1.JS, HUNSPELL-TEST.DIC, BAD-SOLRCONFIG-MISSING-SCRIPTFILE.XML, BAD-SCHEMA-EXTERNAL-FILEFIELD.XML, BAD-SCHEMA-NONTEXT-ANALYZER.XML, SOLRCONFIG_PERF.XML, OLD_SYNONYMS.TXT, SCHEMA-LMDIRICHLET.XML, SCHEMA-COPYFIELD-TEST.XML, SCHEMA-SIM.XML, SOLRCONFIG-PROPINJECT-INDEXDEFAULT.XML, SOLRCONFIG-DELPOLICY1.XML, SOLRCONFIG-SIMPLELOCK.XML, DA_UTF8.XML, CURRENCY.XML, STOPWORDSWRONGENCODING.TXT, SCHEMA-REQUIRED-FIELDS.XML, BAD-SCHEMA-NOT-INDEXED-BUT-NORMS.XML, DA_COMPOUNDDICTIONARY.TXT, THROW.ERROR.ON.ADD.UPDATEPROCESSOR.JS, SOLRCONFIG-MASTER1.XML, SCHEMA-REVERSED.XML, SOLRCONFIG-MASTER3.XML, FRENCHARTICLES.TXT, SCHEMA-SPELLCHECKER.XML, STOP-SNOWBALL.TXT, SOLRCONFIG-MASTER2.XML, SOLRCONFIG-MASTER.XML, HUNSPELL-TEST.AFF, STOPTYPES-2.TXT, SOLRCONFIG-DELPOLICY2.XML, SOLRCONFIG-SOLR-749.XML, SOLRCONFIG-PHRASESUGGEST.XML, SOLRCONFIG-CACHING.XML, SCHEMA-NUMERIC.XML, MAPPING-ISOLATIN1ACCENT.TXT, BAD-SCHEMA-NOT-INDEXED-BUT-TF.XML, SCHEMA-PHRASESUGGEST.XML, SCHEMA-STOP-KEEP.XML, STOPWITHBOM.TXT]
[junit4:junit4]   2> 262 T9417 oass.SolrIndexSearcher.<init> Opening Searcher@1ee01abd main
[junit4:junit4]   2> 262 T9417 oass.SolrIndexSearcher.getIndexDir WARNING WARNING: Directory impl does not support setting indexDir: org.apache.lucene.store.MockDirectoryWrapper
[junit4:junit4]   2> 263 T9417 oasu.CommitTracker.<init> Hard AutoCommit: disabled
[junit4:junit4]   2> 263 T9417 oasu.CommitTracker.<init> Soft AutoCommit: disabled
[junit4:junit4]   2> 263 T9417 oashc.QueryElevationComponent.inform Loading QueryElevation from: /mnt/ssd/jenkins/workspace/Lucene-Solr-trunk-Linux-Java8-64/checkout/solr/build/solr-core/test-files/solr/collection1/conf/elevate.xml
[junit4:junit4]   2> 268 T9417 oashc.QueryElevationComponent.inform Loading QueryElevation from: /mnt/ssd/jenkins/workspace/Lucene-Solr-trunk-Linux-Java8-64/checkout/solr/build/solr-core/test-files/solr/collection1/conf/elevate.xml
[junit4:junit4]   2> 273 T9417 oashc.HttpShardHandlerFactory.getParameter Setting socketTimeout to: 0
[junit4:junit4]   2> 273 T9417 oashc.HttpShardHandlerFactory.getParameter Setting urlScheme to: http://
[junit4:junit4]   2> 273 T9417 oashc.HttpShardHandlerFactory.getParameter Setting connTimeout to: 0
[junit4:junit4]   2> 273 T9417 oashc.HttpShardHandlerFactory.getParameter Setting maxConnectionsPerHost to: 20
[junit4:junit4]   2> 273 T9417 oashc.HttpShardHandlerFactory.getParameter Setting corePoolSize to: 0
[junit4:junit4]   2> 274 T9417 oashc.HttpShardHandlerFactory.getParameter Setting maximumPoolSize to: 2147483647
[junit4:junit4]   2> 274 T9417 oashc.HttpShardHandlerFactory.getParameter Setting maxThreadIdleTime to: 5
[junit4:junit4]   2> 274 T9417 oashc.HttpShardHandlerFactory.getParameter Setting sizeOfQueue to: -1
[junit4:junit4]   2> 274 T9417 oashc.HttpShardHandlerFactory.getParameter Setting fairnessPolicy to: false
[junit4:junit4]   2> 274 T9417 oascsi.HttpClientUtil.createClient Creating new http client, config:maxConnectionsPerHost=20&maxConnections=10000&socketTimeout=0&connTimeout=0&retry=false
[junit4:junit4]   2> 276 T9427 oasc.SolrCore.registerSearcher [collection1] Registered new searcher Searcher@1ee01abd main{StandardDirectoryReader(segments_1:1)}
[junit4:junit4]   2> 276 T9417 oasc.CoreContainer.register registering core: collection1
[junit4:junit4]   2> 277 T9417 oass.SolrDispatchFilter.init user.dir=/mnt/ssd/jenkins/workspace/Lucene-Solr-trunk-Linux-Java8-64/checkout/solr/build/solr-core/test/J1
[junit4:junit4]   2> 277 T9417 oass.SolrDispatchFilter.init SolrDispatchFilter.init() done
[junit4:junit4]   2> 277 T9417 oascsi.HttpClientUtil.createClient Creating new http client, config:maxConnections=128&maxConnectionsPerHost=32&followRedirects=false
[junit4:junit4]   2> 279 T9417 oejs.Server.doStart jetty-8.1.2.v20120308
[junit4:junit4]   2> 280 T9417 oejs.AbstractConnector.doStart Started SocketConnector@0.0.0.0:48214
[junit4:junit4]   2> 281 T9417 oasc.SolrResourceLoader.locateSolrHome JNDI not configured for solr (NoInitialContextEx)
[junit4:junit4]   2> 281 T9417 oasc.SolrResourceLoader.locateSolrHome using system property solr.solr.home: /mnt/ssd/jenkins/workspace/Lucene-Solr-trunk-Linux-Java8-64/checkout/solr/build/solr-core/test-files/solr
[junit4:junit4]   2> 281 T9417 oasc.SolrResourceLoader.<init> new SolrResourceLoader for deduced Solr Home: '/mnt/ssd/jenkins/workspace/Lucene-Solr-trunk-Linux-Java8-64/checkout/solr/build/solr-core/test-files/solr/'
[junit4:junit4]   2> 284 T9417 oass.SolrDispatchFilter.init SolrDispatchFilter.init()
[junit4:junit4]   2> 284 T9417 oasc.SolrResourceLoader.locateSolrHome JNDI not configured for solr (NoInitialContextEx)
[junit4:junit4]   2> 284 T9417 oasc.SolrResourceLoader.locateSolrHome using system property solr.solr.home: /mnt/ssd/jenkins/workspace/Lucene-Solr-trunk-Linux-Java8-64/checkout/solr/build/solr-core/test-files/solr
[junit4:junit4]   2> 284 T9417 oasc.CoreContainer$Initializer.initialize looking for solr.xml: /mnt/ssd/jenkins/workspace/Lucene-Solr-trunk-Linux-Java8-64/checkout/solr/build/solr-core/test-files/solr/solr.xml
[junit4:junit4]   2> 285 T9417 oasc.CoreContainer.<init> New CoreContainer 1440164252
[junit4:junit4]   2> 285 T9417 oasc.CoreContainer.load Loading CoreContainer using Solr Home: '/mnt/ssd/jenkins/workspace/Lucene-Solr-trunk-Linux-Java8-64/checkout/solr/build/solr-core/test-files/solr/'
[junit4:junit4]   2> 285 T9417 oasc.SolrResourceLoader.<init> new SolrResourceLoader for directory: '/mnt/ssd/jenkins/workspace/Lucene-Solr-trunk-Linux-Java8-64/checkout/solr/build/solr-core/test-files/solr/'
[junit4:junit4]   2> 289 T9417 oasc.CoreContainer.load Registering Log Listener
[junit4:junit4]   2> 297 T9417 oasc.CoreContainer.create Creating SolrCore 'collection1' using instanceDir: /mnt/ssd/jenkins/workspace/Lucene-Solr-trunk-Linux-Java8-64/checkout/solr/build/solr-core/test-files/solr/collection1
[junit4:junit4]   2> 297 T9417 oasc.SolrResourceLoader.<init> new SolrResourceLoader for directory: '/mnt/ssd/jenkins/workspace/Lucene-Solr-trunk-Linux-Java8-64/checkout/solr/build/solr-core/test-files/solr/collection1/'
[junit4:junit4]   2> 298 T9417 oasc.SolrResourceLoader.replaceClassLoader Adding 'file:/mnt/ssd/jenkins/workspace/Lucene-Solr-trunk-Linux-Java8-64/checkout/solr/build/solr-core/test-files/solr/collection1/lib/README' to classloader
[junit4:junit4]   2> 298 T9417 oasc.SolrResourceLoader.replaceClassLoader Adding 'file:/mnt/ssd/jenkins/workspace/Lucene-Solr-trunk-Linux-Java8-64/checkout/solr/build/solr-core/test-files/solr/collection1/lib/classes/' to classloader
[junit4:junit4]   2> 310 T9417 oasc.SolrConfig.<init> Using Lucene MatchVersion: LUCENE_50
[junit4:junit4]   2> 335 T9417 oasc.SolrConfig.<init> Loaded SolrConfig: solrconfig-elevate.xml
[junit4:junit4]   2> 335 T9417 oass.IndexSchema.readSchema Reading Solr Schema
[junit4:junit4]   2> 337 T9417 oass.IndexSchema.readSchema Schema name=example
[junit4:junit4]   2> 444 T9417 oass.IndexSchema.readSchema default search field in schema is text
[junit4:junit4]   2> 445 T9417 oass.IndexSchema.readSchema unique key field: id
[junit4:junit4]   2> 447 T9417 oasc.SolrCore.<init> [collection1] Opening new SolrCore at /mnt/ssd/jenkins/workspace/Lucene-Solr-trunk-Linux-Java8-64/checkout/solr/build/solr-core/test-files/solr/collection1/, dataDir=./org.apache.solr.handler.component.DistributedQueryElevationComponentTest-1343162789892/shard0/data/
[junit4:junit4]   2> 447 T9417 oasc.JmxMonitoredMap.<init> JMX monitoring is enabled. Adding Solr mbeans to JMX Server: com.sun.jmx.mbeanserver.JmxMBeanServer@1f6aa236
[junit4:junit4]   2> 448 T9417 oasc.SolrCore.getNewIndexDir WARNING New index directory detected: old=null new=./org.apache.solr.handler.component.DistributedQueryElevationComponentTest-1343162789892/shard0/data/index/
[junit4:junit4]   2> 448 T9417 oasc.SolrCore.initIndex WARNING [collection1] Solr index directory './org.apache.solr.handler.component.DistributedQueryElevationComponentTest-1343162789892/shard0/data/index' doesn't exist. Creating new index...
[junit4:junit4]   2> 449 T9417 oasc.SolrDeletionPolicy.onCommit SolrDeletionPolicy.onCommit: commits:num=1
[junit4:junit4]   2> 		commit{dir=MockDirWrapper(org.apache.lucene.store.RAMDirectory@15eb0cdc lockFactory=org.apache.lucene.store.SingleInstanceLockFactory@65fb03c8),segFN=segments_1,generation=1,filenames=[segments_1]
[junit4:junit4]   2> 450 T9417 oasc.SolrDeletionPolicy.updateCommits newest commit = 1
[junit4:junit4]   2> 451 T9417 oasc.RequestHandlers.initHandlersFromConfig created /update: solr.UpdateRequestHandler
[junit4:junit4]   2> 451 T9417 oasc.RequestHandlers.initHandlersFromConfig created /elevate: org.apache.solr.handler.component.SearchHandler
[junit4:junit4]   2> 451 T9417 oasc.RequestHandlers.initHandlersFromConfig created /dataElevate: org.apache.solr.handler.component.SearchHandler
[junit4:junit4]   2> 452 T9417 oashl.XMLLoader.init xsltCacheLifetimeSeconds=60
[junit4:junit4]   2> 452 T9417 oasc.RequestHandlers.initHandlersFromConfig WARNING no default request handler is registered (either '/select' or 'standard')
[junit4:junit4]   2> 453 T9417 oasc.SolrCore.initDeprecatedSupport WARNING solrconfig.xml uses deprecated <admin/gettableFiles>, Please update your config to use the ShowFileRequestHandler.
[junit4:junit4]   2> 454 T9417 oasc.SolrCore.initDeprecatedSupport WARNING adding ShowFileRequestHandler with hidden files: [STEMDICT.TXT, SCHEMA-LUCENEMATCHVERSION.XML, SCHEMA12.XML, SOLRCONFIG-ENABLEPLUGIN.XML, BAD-SCHEMA-DUP-FIELD.XML, SCHEMA-TFIDF.XML, BAD-SCHEMA-NOT-INDEXED-BUT-POS.XML, SOLRCONFIG-UPDATE-PROCESSOR-CHAINS.XML, OPEN-EXCHANGE-RATES.JSON, SOLRCONFIG_CODEC.XML, STOPWORDS.TXT, STOPTYPES-1.TXT, SCHEMA-NOT-REQUIRED-UNIQUE-KEY.XML, SOLRCONFIG-QUERYSENDER-NOQUERY.XML, MISSING.FUNCTIONS.UPDATEPROCESSOR.JS, SCHEMA15.XML, SOLRCONFIG-ELEVATE.XML, SOLRCONFIG-LAZYWRITER.XML, SOLRCONFIG-PROPINJECT.XML, BAD-SOLRCONFIG-BOGUS-SCRIPTENGINE-NAME.XML, SOLRCONFIG-TLOG.XML, SOLRCONFIG-ALTDIRECTORY.XML, SCHEMA.XML, COMPOUNDDICTIONARY.TXT, SOLRCONFIG-NATIVELOCK.XML, SOLRCONFIG-TRANSFORMERS.XML, ELEVATE.XML, SOLRCONFIG-FUNCTIONQUERY.XML, SCHEMA-REPLICATION1.XML, SOLRCONFIG-HIGHLIGHT.XML, STOP-2.TXT, WDFTYPES.TXT, XSLT, KEEP-2.TXT, BAD-SCHEMA-UNIQUEKEY-USES-DEFAULT.XML, SCHEMA-IB.XML, SCHEMA-DFR.XML, SCHEMA-BINARYFIELD.XML, SOLRCONFIG-XINCLUDE.XML, BAD-SCHEMA-DUP-FIELDTYPE.XML, STOP-1.TXT, SCHEMA-CHARFILTERS.XML, SCHEMASURROUND.XML, SOLRCONFIG-BASIC.XML, BAD_SOLRCONFIG.XML, PROTWORDS.TXT, PHRASESUGGEST.TXT, SOLRCONFIG-MERGEPOLICY.XML, BAD-SCHEMA-CODEC-GLOBAL-VS-FT-MISMATCH.XML, KEEP-1.TXT, SCHEMA-FOLDING.XML, SOLRCONFIG-REQHANDLER.INCL, SOLRCONFIG-SPELLCHECKER.XML, SCHEMA-COLLATE.XML, SCHEMA-REPLICATION2.XML, SOLRCONFIG-QUERYSENDER.XML, SOLRCONFIG-NOCACHE.XML, SOLRCONFIG-TERMINDEX.XML, SCHEMA-LMJELINEKMERCER.XML, SCHEMA-BM25.XML, SOLRCONFIG-SLAVE.XML, BAD-SCHEMA-UNIQUEKEY-IS-COPYFIELD-DEST.XML, BAD-MP-SOLRCONFIG.XML, BAD-SCHEMA-OMIT-TF-BUT-NOT-POS.XML, SOLRCONFIG-SCRIPT-UPDATEPROCESSOR.XML, SCHEMA-TRIE.XML, SOLRCONFIG-REPEATER.XML, BAD-SCHEMA-DUP-DYNAMICFIELD.XML, SOLRCONFIG-SLAVE1.XML, ADDFIELDS.UPDATEPROCESSOR.JS, SOLRCONFIG-SOLCOREPROPERTIES.XML, SCHEMA-MINIMAL.XML, BAD-SCHEMA-SIM-GLOBAL-VS-FT-MISMATCH.XML, CONDITIONAL.UPDATEPROCESSOR.JS, SCHEMA_CODEC.XML, MISSLEADING.EXTENSION.UPDATEPROCESSOR.JS.TXT, BAD-SOLRCONFIG-INVALID-SCRIPTFILE.XML, SOLRCONFIG-MASTER1-KEEPONEBACKUP.XML, SYNONYMS.TXT, TRIVIAL.UPDATEPROCESSOR0.JS, SOLRCONFIG-SPELLCHECKCOMPONENT.XML, HYPHENATION.DTD, SCHEMA11.XML, TRIVIAL.UPDATEPROCESSOR1.JS, HUNSPELL-TEST.DIC, BAD-SOLRCONFIG-MISSING-SCRIPTFILE.XML, BAD-SCHEMA-EXTERNAL-FILEFIELD.XML, BAD-SCHEMA-NONTEXT-ANALYZER.XML, SOLRCONFIG_PERF.XML, OLD_SYNONYMS.TXT, SCHEMA-LMDIRICHLET.XML, SCHEMA-COPYFIELD-TEST.XML, SCHEMA-SIM.XML, SOLRCONFIG-PROPINJECT-INDEXDEFAULT.XML, SOLRCONFIG-DELPOLICY1.XML, SOLRCONFIG-SIMPLELOCK.XML, DA_UTF8.XML, CURRENCY.XML, STOPWORDSWRONGENCODING.TXT, SCHEMA-REQUIRED-FIELDS.XML, BAD-SCHEMA-NOT-INDEXED-BUT-NORMS.XML, DA_COMPOUNDDICTIONARY.TXT, THROW.ERROR.ON.ADD.UPDATEPROCESSOR.JS, SOLRCONFIG-MASTER1.XML, SCHEMA-REVERSED.XML, SOLRCONFIG-MASTER3.XML, FRENCHARTICLES.TXT, SCHEMA-SPELLCHECKER.XML, STOP-SNOWBALL.TXT, SOLRCONFIG-MASTER2.XML, SOLRCONFIG-MASTER.XML, HUNSPELL-TEST.AFF, STOPTYPES-2.TXT, SOLRCONFIG-DELPOLICY2.XML, SOLRCONFIG-SOLR-749.XML, SOLRCONFIG-PHRASESUGGEST.XML, SOLRCONFIG-CACHING.XML, SCHEMA-NUMERIC.XML, MAPPING-ISOLATIN1ACCENT.TXT, BAD-SCHEMA-NOT-INDEXED-BUT-TF.XML, SCHEMA-PHRASESUGGEST.XML, SCHEMA-STOP-KEEP.XML, STOPWITHBOM.TXT]
[junit4:junit4]   2> 456 T9417 oass.SolrIndexSearcher.<init> Opening Searcher@1010fe1c main
[junit4:junit4]   2> 457 T9417 oass.SolrIndexSearcher.getIndexDir WARNING WARNING: Directory impl does not support setting indexDir: org.apache.lucene.store.MockDirectoryWrapper
[junit4:junit4]   2> 457 T9417 oasu.CommitTracker.<init> Hard AutoCommit: disabled
[junit4:junit4]   2> 457 T9417 oasu.CommitTracker.<init> Soft AutoCommit: disabled
[junit4:junit4]   2> 458 T9417 oashc.QueryElevationComponent.inform Loading QueryElevation from: /mnt/ssd/jenkins/workspace/Lucene-Solr-trunk-Linux-Java8-64/checkout/solr/build/solr-core/test-files/solr/collection1/conf/elevate.xml
[junit4:junit4]   2> 465 T9417 oashc.QueryElevationComponent.inform Loading QueryElevation from: /mnt/ssd/jenkins/workspace/Lucene-Solr-trunk-Linux-Java8-64/checkout/solr/build/solr-core/test-files/solr/collection1/conf/elevate.xml
[junit4:junit4]   2> 473 T9417 oashc.HttpShardHandlerFactory.getParameter Setting socketTimeout to: 0
[junit4:junit4]   2> 473 T9417 oashc.HttpShardHandlerFactory.getParameter Setting urlScheme to: http://
[junit4:junit4]   2> 473 T9417 oashc.HttpShardHandlerFactory.getParameter Setting connTimeout to: 0
[junit4:junit4]   2> 474 T9417 oashc.HttpShardHandlerFactory.getParameter Setting maxConnectionsPerHost to: 20
[junit4:junit4]   2> 474 T9417 oashc.HttpShardHandlerFactory.getParameter Setting corePoolSize to: 0
[junit4:junit4]   2> 474 T9417 oashc.HttpShardHandlerFactory.getParameter Setting maximumPoolSize to: 2147483647
[junit4:junit4]   2> 474 T9417 oashc.HttpShardHandlerFactory.getParameter Setting maxThreadIdleTime to: 5
[junit4:junit4]   2> 475 T9417 oashc.HttpShardHandlerFactory.getParameter Setting sizeOfQueue to: -1
[junit4:junit4]   2> 475 T9417 oashc.HttpShardHandlerFactory.getParameter Setting fairnessPolicy to: false
[junit4:junit4]   2> 475 T9417 oascsi.HttpClientUtil.createClient Creating new http client, config:maxConnectionsPerHost=20&maxConnections=10000&socketTimeout=0&connTimeout=0&retry=false
[junit4:junit4]   2> 478 T9437 oasc.SolrCore.registerSearcher [collection1] Registered new searcher Searcher@1010fe1c main{StandardDirectoryReader(segments_1:1)}
[junit4:junit4]   2> 478 T9417 oasc.CoreContainer.register registering core: collection1
[junit4:junit4]   2> 479 T9417 oass.SolrDispatchFilter.init user.dir=/mnt/ssd/jenkins/workspace/Lucene-Solr-trunk-Linux-Java8-64/checkout/solr/build/solr-core/test/J1
[junit4:junit4]   2> 479 T9417 oass.SolrDispatchFilter.init SolrDispatchFilter.init() done
[junit4:junit4]   2> 479 T9417 oascsi.HttpClientUtil.createClient Creating new http client, config:maxConnections=128&maxConnectionsPerHost=32&followRedirects=false
[junit4:junit4]   2> 482 T9417 oejs.Server.doStart jetty-8.1.2.v20120308
[junit4:junit4]   2> 511 T9417 oejs.AbstractConnector.doStart Started SocketConnector@0.0.0.0:57984
[junit4:junit4]   2> 511 T9417 oasc.SolrResourceLoader.locateSolrHome JNDI not configured for solr (NoInitialContextEx)
[junit4:junit4]   2> 511 T9417 oasc.SolrResourceLoader.locateSolrHome using system property solr.solr.home: /mnt/ssd/jenkins/workspace/Lucene-Solr-trunk-Linux-Java8-64/checkout/solr/build/solr-core/test-files/solr
[junit4:junit4]   2> 512 T9417 oasc.SolrResourceLoader.<init> new SolrResourceLoader for deduced Solr Home: '/mnt/ssd/jenkins/workspace/Lucene-Solr-trunk-Linux-Java8-64/checkout/solr/build/solr-core/test-files/solr/'
[junit4:junit4]   2> 515 T9417 oass.SolrDispatchFilter.init SolrDispatchFilter.init()
[junit4:junit4]   2> 516 T9417 oasc.SolrResourceLoader.locateSolrHome JNDI not configured for solr (NoInitialContextEx)
[junit4:junit4]   2> 516 T9417 oasc.SolrResourceLoader.locateSolrHome using system property solr.solr.home: /mnt/ssd/jenkins/workspace/Lucene-Solr-trunk-Linux-Java8-64/checkout/solr/build/solr-core/test-files/solr
[junit4:junit4]   2> 516 T9417 oasc.CoreContainer$Initializer.initialize looking for solr.xml: /mnt/ssd/jenkins/workspace/Lucene-Solr-trunk-Linux-Java8-64/checkout/solr/build/solr-core/test-files/solr/solr.xml
[junit4:junit4]   2> 516 T9417 oasc.CoreContainer.<init> New CoreContainer 1253639029
[junit4:junit4]   2> 517 T9417 oasc.CoreContainer.load Loading CoreContainer using Solr Home: '/mnt/ssd/jenkins/workspace/Lucene-Solr-trunk-Linux-Java8-64/checkout/solr/build/solr-core/test-files/solr/'
[junit4:junit4]   2> 517 T9417 oasc.SolrResourceLoader.<init> new SolrResourceLoader for directory: '/mnt/ssd/jenkins/workspace/Lucene-Solr-trunk-Linux-Java8-64/checkout/solr/build/solr-core/test-files/solr/'
[junit4:junit4]   2> 521 T9417 oasc.CoreContainer.load Registering Log Listener
[junit4:junit4]   2> 531 T9417 oasc.CoreContainer.create Creating SolrCore 'collection1' using instanceDir: /mnt/ssd/jenkins/workspace/Lucene-Solr-trunk-Linux-Java8-64/checkout/solr/build/solr-core/test-files/solr/collection1
[junit4:junit4]   2> 531 T9417 oasc.SolrResourceLoader.<init> new SolrResourceLoader for directory: '/mnt/ssd/jenkins/workspace/Lucene-Solr-trunk-Linux-Java8-64/checkout/solr/build/solr-core/test-files/solr/collection1/'
[junit4:junit4]   2> 532 T9417 oasc.SolrResourceLoader.replaceClassLoader Adding 'file:/mnt/ssd/jenkins/workspace/Lucene-Solr-trunk-Linux-Java8-64/checkout/solr/build/solr-core/test-files/solr/collection1/lib/README' to classloader
[junit4:junit4]   2> 532 T9417 oasc.SolrResourceLoader.replaceClassLoader Adding 'file:/mnt/ssd/jenkins/workspace/Lucene-Solr-trunk-Linux-Java8-64/checkout/solr/build/solr-core/test-files/solr/collection1/lib/classes/' to classloader
[junit4:junit4]   2> 544 T9417 oasc.SolrConfig.<init> Using Lucene MatchVersion: LUCENE_50
[junit4:junit4]   2> 567 T9417 oasc.SolrConfig.<init> Loaded SolrConfig: solrconfig-elevate.xml
[junit4:junit4]   2> 568 T9417 oass.IndexSchema.readSchema Reading Solr Schema
[junit4:junit4]   2> 585 T9417 oass.IndexSchema.readSchema Schema name=example
[junit4:junit4]   2> 705 T9417 oass.IndexSchema.readSchema default search field in schema is text
[junit4:junit4]   2> 706 T9417 oass.IndexSchema.readSchema unique key field: id
[junit4:junit4]   2> 708 T9417 oasc.SolrCore.<init> [collection1] Opening new SolrCore at /mnt/ssd/jenkins/workspace/Lucene-Solr-trunk-Linux-Java8-64/checkout/solr/build/solr-core/test-files/solr/collection1/, dataDir=./org.apache.solr.handler.component.DistributedQueryElevationComponentTest-1343162789892/shard1/data/
[junit4:junit4]   2> 708 T9417 oasc.JmxMonitoredMap.<init> JMX monitoring is enabled. Adding Solr mbeans to JMX Server: com.sun.jmx.mbeanserver.JmxMBeanServer@1f6aa236
[junit4:junit4]   2> 709 T9417 oasc.SolrCore.getNewIndexDir WARNING New index directory detected: old=null new=./org.apache.solr.handler.component.DistributedQueryElevationComponentTest-1343162789892/shard1/data/index/
[junit4:junit4]   2> 709 T9417 oasc.SolrCore.initIndex WARNING [collection1] Solr index directory './org.apache.solr.handler.component.DistributedQueryElevationComponentTest-1343162789892/shard1/data/index' doesn't exist. Creating new index...
[junit4:junit4]   2> 710 T9417 oasc.SolrDeletionPolicy.onCommit SolrDeletionPolicy.onCommit: commits:num=1
[junit4:junit4]   2> 		commit{dir=MockDirWrapper(org.apache.lucene.store.RAMDirectory@18a0b434 lockFactory=org.apache.lucene.store.SingleInstanceLockFactory@7ed2bb7e),segFN=segments_1,generation=1,filenames=[segments_1]
[junit4:junit4]   2> 710 T9417 oasc.SolrDeletionPolicy.updateCommits newest commit = 1
[junit4:junit4]   2> 711 T9417 oasc.RequestHandlers.initHandlersFromConfig created /update: solr.UpdateRequestHandler
[junit4:junit4]   2> 711 T9417 oasc.RequestHandlers.initHandlersFromConfig created /elevate: org.apache.solr.handler.component.SearchHandler
[junit4:junit4]   2> 711 T9417 oasc.RequestHandlers.initHandlersFromConfig created /dataElevate: org.apache.solr.handler.component.SearchHandler
[junit4:junit4]   2> 711 T9417 oashl.XMLLoader.init xsltCacheLifetimeSeconds=60
[junit4:junit4]   2> 712 T9417 oasc.RequestHandlers.initHandlersFromConfig WARNING no default request handler is registered (either '/select' or 'standard')
[junit4:junit4]   2> 712 T9417 oasc.SolrCore.initDeprecatedSupport WARNING solrconfig.xml uses deprecated <admin/gettableFiles>, Please update your config to use the ShowFileRequestHandler.
[junit4:junit4]   2> 713 T9417 oasc.SolrCore.initDeprecatedSupport WARNING adding ShowFileRequestHandler with hidden files: [STEMDICT.TXT, SCHEMA-LUCENEMATCHVERSION.XML, SCHEMA12.XML, SOLRCONFIG-ENABLEPLUGIN.XML, BAD-SCHEMA-DUP-FIELD.XML, SCHEMA-TFIDF.XML, BAD-SCHEMA-NOT-INDEXED-BUT-POS.XML, SOLRCONFIG-UPDATE-PROCESSOR-CHAINS.XML, OPEN-EXCHANGE-RATES.JSON, SOLRCONFIG_CODEC.XML, STOPWORDS.TXT, STOPTYPES-1.TXT, SCHEMA-NOT-REQUIRED-UNIQUE-KEY.XML, SOLRCONFIG-QUERYSENDER-NOQUERY.XML, MISSING.FUNCTIONS.UPDATEPROCESSOR.JS, SCHEMA15.XML, SOLRCONFIG-ELEVATE.XML, SOLRCONFIG-LAZYWRITER.XML, SOLRCONFIG-PROPINJECT.XML, BAD-SOLRCONFIG-BOGUS-SCRIPTENGINE-NAME.XML, SOLRCONFIG-TLOG.XML, SOLRCONFIG-ALTDIRECTORY.XML, SCHEMA.XML, COMPOUNDDICTIONARY.TXT, SOLRCONFIG-NATIVELOCK.XML, SOLRCONFIG-TRANSFORMERS.XML, ELEVATE.XML, SOLRCONFIG-FUNCTIONQUERY.XML, SCHEMA-REPLICATION1.XML, SOLRCONFIG-HIGHLIGHT.XML, STOP-2.TXT, WDFTYPES.TXT, XSLT, KEEP-2.TXT, BAD-SCHEMA-UNIQUEKEY-USES-DEFAULT.XML, SCHEMA-IB.XML, SCHEMA-DFR.XML, SCHEMA-BINARYFIELD.XML, SOLRCONFIG-XINCLUDE.XML, BAD-SCHEMA-DUP-FIELDTYPE.XML, STOP-1.TXT, SCHEMA-CHARFILTERS.XML, SCHEMASURROUND.XML, SOLRCONFIG-BASIC.XML, BAD_SOLRCONFIG.XML, PROTWORDS.TXT, PHRASESUGGEST.TXT, SOLRCONFIG-MERGEPOLICY.XML, BAD-SCHEMA-CODEC-GLOBAL-VS-FT-MISMATCH.XML, KEEP-1.TXT, SCHEMA-FOLDING.XML, SOLRCONFIG-REQHANDLER.INCL, SOLRCONFIG-SPELLCHECKER.XML, SCHEMA-COLLATE.XML, SCHEMA-REPLICATION2.XML, SOLRCONFIG-QUERYSENDER.XML, SOLRCONFIG-NOCACHE.XML, SOLRCONFIG-TERMINDEX.XML, SCHEMA-LMJELINEKMERCER.XML, SCHEMA-BM25.XML, SOLRCONFIG-SLAVE.XML, BAD-SCHEMA-UNIQUEKEY-IS-COPYFIELD-DEST.XML, BAD-MP-SOLRCONFIG.XML, BAD-SCHEMA-OMIT-TF-BUT-NOT-POS.XML, SOLRCONFIG-SCRIPT-UPDATEPROCESSOR.XML, SCHEMA-TRIE.XML, SOLRCONFIG-REPEATER.XML, BAD-SCHEMA-DUP-DYNAMICFIELD.XML, SOLRCONFIG-SLAVE1.XML, ADDFIELDS.UPDATEPROCESSOR.JS, SOLRCONFIG-SOLCOREPROPERTIES.XML, SCHEMA-MINIMAL.XML, BAD-SCHEMA-SIM-GLOBAL-VS-FT-MISMATCH.XML, CONDITIONAL.UPDATEPROCESSOR.JS, SCHEMA_CODEC.XML, MISSLEADING.EXTENSION.UPDATEPROCESSOR.JS.TXT, BAD-SOLRCONFIG-INVALID-SCRIPTFILE.XML, SOLRCONFIG-MASTER1-KEEPONEBACKUP.XML, SYNONYMS.TXT, TRIVIAL.UPDATEPROCESSOR0.JS, SOLRCONFIG-SPELLCHECKCOMPONENT.XML, HYPHENATION.DTD, SCHEMA11.XML, TRIVIAL.UPDATEPROCESSOR1.JS, HUNSPELL-TEST.DIC, BAD-SOLRCONFIG-MISSING-SCRIPTFILE.XML, BAD-SCHEMA-EXTERNAL-FILEFIELD.XML, BAD-SCHEMA-NONTEXT-ANALYZER.XML, SOLRCONFIG_PERF.XML, OLD_SYNONYMS.TXT, SCHEMA-LMDIRICHLET.XML, SCHEMA-COPYFIELD-TEST.XML, SCHEMA-SIM.XML, SOLRCONFIG-PROPINJECT-INDEXDEFAULT.XML, SOLRCONFIG-DELPOLICY1.XML, SOLRCONFIG-SIMPLELOCK.XML, DA_UTF8.XML, CURRENCY.XML, STOPWORDSWRONGENCODING.TXT, SCHEMA-REQUIRED-FIELDS.XML, BAD-SCHEMA-NOT-INDEXED-BUT-NORMS.XML, DA_COMPOUNDDICTIONARY.TXT, THROW.ERROR.ON.ADD.UPDATEPROCESSOR.JS, SOLRCONFIG-MASTER1.XML, SCHEMA-REVERSED.XML, SOLRCONFIG-MASTER3.XML, FRENCHARTICLES.TXT, SCHEMA-SPELLCHECKER.XML, STOP-SNOWBALL.TXT, SOLRCONFIG-MASTER2.XML, SOLRCONFIG-MASTER.XML, HUNSPELL-TEST.AFF, STOPTYPES-2.TXT, SOLRCONFIG-DELPOLICY2.XML, SOLRCONFIG-SOLR-749.XML, SOLRCONFIG-PHRASESUGGEST.XML, SOLRCONFIG-CACHING.XML, SCHEMA-NUMERIC.XML, MAPPING-ISOLATIN1ACCENT.TXT, BAD-SCHEMA-NOT-INDEXED-BUT-TF.XML, SCHEMA-PHRASESUGGEST.XML, SCHEMA-STOP-KEEP.XML, STOPWITHBOM.TXT]
[junit4:junit4]   2> 714 T9417 oass.SolrIndexSearcher.<init> Opening Searcher@22372a99 main
[junit4:junit4]   2> 715 T9417 oass.SolrIndexSearcher.getIndexDir WARNING WARNING: Directory impl does not support setting indexDir: org.apache.lucene.store.MockDirectoryWrapper
[junit4:junit4]   2> 715 T9417 oasu.CommitTracker.<init> Hard AutoCommit: disabled
[junit4:junit4]   2> 715 T9417 oasu.CommitTracker.<init> Soft AutoCommit: disabled
[junit4:junit4]   2> 715 T9417 oashc.QueryElevationComponent.inform Loading QueryElevation from: /mnt/ssd/jenkins/workspace/Lucene-Solr-trunk-Linux-Java8-64/checkout/solr/build/solr-core/test-files/solr/collection1/conf/elevate.xml
[junit4:junit4]   2> 720 T9417 oashc.QueryElevationComponent.inform Loading QueryElevation from: /mnt/ssd/jenkins/workspace/Lucene-Solr-trunk-Linux-Java8-64/checkout/solr/build/solr-core/test-files/solr/collection1/conf/elevate.xml
[junit4:junit4]   2> 725 T9417 oashc.HttpShardHandlerFactory.getParameter Setting socketTimeout to: 0
[junit4:junit4]   2> 725 T9417 oashc.HttpShardHandlerFactory.getParameter Setting urlScheme to: http://
[junit4:junit4]   2> 725 T9417 oashc.HttpShardHandlerFactory.getParameter Setting connTimeout to: 0
[junit4:junit4]   2> 725 T9417 oashc.HttpShardHandlerFactory.getParameter Setting maxConnectionsPerHost to: 20
[junit4:junit4]   2> 726 T9417 oashc.HttpShardHandlerFactory.getParameter Setting corePoolSize to: 0
[junit4:junit4]   2> 726 T9417 oashc.HttpShardHandlerFactory.getParameter Setting maximumPoolSize to: 2147483647
[junit4:junit4]   2> 726 T9417 oashc.HttpShardHandlerFactory.getParameter Setting maxThreadIdleTime to: 5
[junit4:junit4]   2> 726 T9417 oashc.HttpShardHandlerFactory.getParameter Setting sizeOfQueue to: -1
[junit4:junit4]   2> 726 T9417 oashc.HttpShardHandlerFactory.getParameter Setting fairnessPolicy to: false
[junit4:junit4]   2> 726 T9417 oascsi.HttpClientUtil.createClient Creating new http client, config:maxConnectionsPerHost=20&maxConnections=10000&socketTimeout=0&connTimeout=0&retry=false
[junit4:junit4]   2> 728 T9447 oasc.SolrCore.registerSearcher [collection1] Registered new searcher Searcher@22372a99 main{StandardDirectoryReader(segments_1:1)}
[junit4:junit4]   2> 728 T9417 oasc.CoreContainer.register registering core: collection1
[junit4:junit4]   2> 729 T9417 oass.SolrDispatchFilter.init user.dir=/mnt/ssd/jenkins/workspace/Lucene-Solr-trunk-Linux-Java8-64/checkout/solr/build/solr-core/test/J1
[junit4:junit4]   2> 729 T9417 oass.SolrDispatchFilter.init SolrDispatchFilter.init() done
[junit4:junit4]   2> 729 T9417 oascsi.HttpClientUtil.createClient Creating new http client, config:maxConnections=128&maxConnectionsPerHost=32&followRedirects=false
[junit4:junit4]   2> 731 T9417 oejs.Server.doStart jetty-8.1.2.v20120308
[junit4:junit4]   2> 732 T9417 oejs.AbstractConnector.doStart Started SocketConnector@0.0.0.0:41022
[junit4:junit4]   2> 733 T9417 oasc.SolrResourceLoader.locateSolrHome JNDI not configured for solr (NoInitialContextEx)
[junit4:junit4]   2> 733 T9417 oasc.SolrResourceLoader.locateSolrHome using system property solr.solr.home: /mnt/ssd/jenkins/workspace/Lucene-Solr-trunk-Linux-Java8-64/checkout/solr/build/solr-core/test-files/solr
[junit4:junit4]   2> 733 T9417 oasc.SolrResourceLoader.<init> new SolrResourceLoader for deduced Solr Home: '/mnt/ssd/jenkins/workspace/Lucene-Solr-trunk-Linux-Java8-64/checkout/solr/build/solr-core/test-files/solr/'
[junit4:junit4]   2> 736 T9417 oass.SolrDispatchFilter.init SolrDispatchFilter.init()
[junit4:junit4]   2> 736 T9417 oasc.SolrResourceLoader.locateSolrHome JNDI not configured for solr (NoInitialContextEx)
[junit4:junit4]   2> 736 T9417 oasc.SolrResourceLoader.locateSolrHome using system property solr.solr.home: /mnt/ssd/jenkins/workspace/Lucene-Solr-trunk-Linux-Java8-64/checkout/solr/build/solr-core/test-files/solr
[junit4:junit4]   2> 736 T9417 oasc.CoreContainer$Initializer.initialize looking for solr.xml: /mnt/ssd/jenkins/workspace/Lucene-Solr-trunk-Linux-Java8-64/checkout/solr/build/solr-core/test-files/solr/solr.xml
[junit4:junit4]   2> 736 T9417 oasc.CoreContainer.<init> New CoreContainer 150900486
[junit4:junit4]   2> 737 T9417 oasc.CoreContainer.load Loading CoreContainer using Solr Home: '/mnt/ssd/jenkins/workspace/Lucene-Solr-trunk-Linux-Java8-64/checkout/solr/build/solr-core/test-files/solr/'
[junit4:junit4]   2> 737 T9417 oasc.SolrResourceLoader.<init> new SolrResourceLoader for directory: '/mnt/ssd/jenkins/workspace/Lucene-Solr-trunk-Linux-Java8-64/checkout/solr/build/solr-core/test-files/solr/'
[junit4:junit4]   2> 741 T9417 oasc.CoreContainer.load Registering Log Listener
[junit4:junit4]   2> 749 T9417 oasc.CoreContainer.create Creating SolrCore 'collection1' using instanceDir: /mnt/ssd/jenkins/workspace/Lucene-Solr-trunk-Linux-Java8-64/checkout/solr/build/solr-core/test-files/solr/collection1
[junit4:junit4]   2> 749 T9417 oasc.SolrResourceLoader.<init> new SolrResourceLoader for directory: '/mnt/ssd/jenkins/workspace/Lucene-Solr-trunk-Linux-Java8-64/checkout/solr/build/solr-core/test-files/solr/collection1/'
[junit4:junit4]   2> 749 T9417 oasc.SolrResourceLoader.replaceClassLoader Adding 'file:/mnt/ssd/jenkins/workspace/Lucene-Solr-trunk-Linux-Java8-64/checkout/solr/build/solr-core/test-files/solr/collection1/lib/README' to classloader
[junit4:junit4]   2> 750 T9417 oasc.SolrResourceLoader.replaceClassLoader Adding 'file:/mnt/ssd/jenkins/workspace/Lucene-Solr-trunk-Linux-Java8-64/checkout/solr/build/solr-core/test-files/solr/collection1/lib/classes/' to classloader
[junit4:junit4]   2> 763 T9417 oasc.SolrConfig.<init> Using Lucene MatchVersion: LUCENE_50
[junit4:junit4]   2> 791 T9417 oasc.SolrConfig.<init> Loaded SolrConfig: solrconfig-elevate.xml
[junit4:junit4]   2> 791 T9417 oass.IndexSchema.readSchema Reading Solr Schema
[junit4:junit4]   2> 794 T9417 oass.IndexSchema.readSchema Schema name=example
[junit4:junit4]   2> 893 T9417 oass.IndexSchema.readSchema default search field in schema is text
[junit4:junit4]   2> 895 T9417 oass.IndexSchema.readSchema unique key field: id
[junit4:junit4]   2> 896 T9417 oasc.SolrCore.<init> [collection1] Opening new SolrCore at /mnt/ssd/jenkins/workspace/Lucene-Solr-trunk-Linux-Java8-64/checkout/solr/build/solr-core/test-files/solr/collection1/, dataDir=./org.apache.solr.handler.component.DistributedQueryElevationComponentTest-1343162789892/shard2/data/
[junit4:junit4]   2> 897 T9417 oasc.JmxMonitoredMap.<init> JMX monitoring is enabled. Adding Solr mbeans to JMX Server: com.sun.jmx.mbeanserver.JmxMBeanServer@1f6aa236
[junit4:junit4]   2> 897 T9417 oasc.SolrCore.getNewIndexDir WARNING New index directory detected: old=null new=./org.apache.solr.handler.component.DistributedQueryElevationComponentTest-1343162789892/shard2/data/index/
[junit4:junit4]   2> 897 T9417 oasc.SolrCore.initIndex WARNING [collection1] Solr index directory './org.apache.solr.handler.component.DistributedQueryElevationComponentTest-1343162789892/shard2/data/index' doesn't exist. Creating new index...
[junit4:junit4]   2> 898 T9417 oasc.SolrDeletionPolicy.onCommit SolrDeletionPolicy.onCommit: commits:num=1
[junit4:junit4]   2> 		commit{dir=BaseDirectoryWrapper(org.apache.lucene.store.RAMDirectory@672a55f lockFactory=org.apache.lucene.store.SingleInstanceLockFactory@50c70347),segFN=segments_1,generation=1,filenames=[segments_1]
[junit4:junit4]   2> 898 T9417 oasc.SolrDeletionPolicy.updateCommits newest commit = 1
[junit4:junit4]   2> 899 T9417 oasc.RequestHandlers.initHandlersFromConfig created /update: solr.UpdateRequestHandler
[junit4:junit4]   2> 899 T9417 oasc.RequestHandlers.initHandlersFromConfig created /elevate: org.apache.solr.handler.component.SearchHandler
[junit4:junit4]   2> 899 T9417 oasc.RequestHandlers.initHandlersFromConfig created /dataElevate: org.apache.solr.handler.component.SearchHandler
[junit4:junit4]   2> 900 T9417 oashl.XMLLoader.init xsltCacheLifetimeSeconds=60
[junit4:junit4]   2> 900 T9417 oasc.RequestHandlers.initHandlersFromConfig WARNING no default request handler is registered (either '/select' or 'standard')
[junit4:junit4]   2> 901 T9417 oasc.SolrCore.initDeprecatedSupport WARNING solrconfig.xml uses deprecated <admin/gettableFiles>, Please update your config to use the ShowFileRequestHandler.
[junit4:junit4]   2> 901 T9417 oasc.SolrCore.initDeprecatedSupport WARNING adding ShowFileRequestHandler with hidden files: [STEMDICT.TXT, SCHEMA-LUCENEMATCHVERSION.XML, SCHEMA12.XML, SOLRCONFIG-ENABLEPLUGIN.XML, BAD-SCHEMA-DUP-FIELD.XML, SCHEMA-TFIDF.XML, BAD-SCHEMA-NOT-INDEXED-BUT-POS.XML, SOLRCONFIG-UPDATE-PROCESSOR-CHAINS.XML, OPEN-EXCHANGE-RATES.JSON, SOLRCONFIG_CODEC.XML, STOPWORDS.TXT, STOPTYPES-1.TXT, SCHEMA-NOT-REQUIRED-UNIQUE-KEY.XML, SOLRCONFIG-QUERYSENDER-NOQUERY.XML, MISSING.FUNCTIONS.UPDATEPROCESSOR.JS, SCHEMA15.XML, SOLRCONFIG-ELEVATE.XML, SOLRCONFIG-LAZYWRITER.XML, SOLRCONFIG-PROPINJECT.XML, BAD-SOLRCONFIG-BOGUS-SCRIPTENGINE-NAME.XML, SOLRCONFIG-TLOG.XML, SOLRCONFIG-ALTDIRECTORY.XML, SCHEMA.XML, COMPOUNDDICTIONARY.TXT, SOLRCONFIG-NATIVELOCK.XML, SOLRCONFIG-TRANSFORMERS.XML, ELEVATE.XML, SOLRCONFIG-FUNCTIONQUERY.XML, SCHEMA-REPLICATION1.XML, SOLRCONFIG-HIGHLIGHT.XML, STOP-2.TXT, WDFTYPES.TXT, XSLT, KEEP-2.TXT, BAD-SCHEMA-UNIQUEKEY-USES-DEFAULT.XML, SCHEMA-IB.XML, SCHEMA-DFR.XML, SCHEMA-BINARYFIELD.XML, SOLRCONFIG-XINCLUDE.XML, BAD-SCHEMA-DUP-FIELDTYPE.XML, STOP-1.TXT, SCHEMA-CHARFILTERS.XML, SCHEMASURROUND.XML, SOLRCONFIG-BASIC.XML, BAD_SOLRCONFIG.XML, PROTWORDS.TXT, PHRASESUGGEST.TXT, SOLRCONFIG-MERGEPOLICY.XML, BAD-SCHEMA-CODEC-GLOBAL-VS-FT-MISMATCH.XML, KEEP-1.TXT, SCHEMA-FOLDING.XML, SOLRCONFIG-REQHANDLER.INCL, SOLRCONFIG-SPELLCHECKER.XML, SCHEMA-COLLATE.XML, SCHEMA-REPLICATION2.XML, SOLRCONFIG-QUERYSENDER.XML, SOLRCONFIG-NOCACHE.XML, SOLRCONFIG-TERMINDEX.XML, SCHEMA-LMJELINEKMERCER.XML, SCHEMA-BM25.XML, SOLRCONFIG-SLAVE.XML, BAD-SCHEMA-UNIQUEKEY-IS-COPYFIELD-DEST.XML, BAD-MP-SOLRCONFIG.XML, BAD-SCHEMA-OMIT-TF-BUT-NOT-POS.XML, SOLRCONFIG-SCRIPT-UPDATEPROCESSOR.XML, SCHEMA-TRIE.XML, SOLRCONFIG-REPEATER.XML, BAD-SCHEMA-DUP-DYNAMICFIELD.XML, SOLRCONFIG-SLAVE1.XML, ADDFIELDS.UPDATEPROCESSOR.JS, SOLRCONFIG-SOLCOREPROPERTIES.XML, SCHEMA-MINIMAL.XML, BAD-SCHEMA-SIM-GLOBAL-VS-FT-MISMATCH.XML, CONDITIONAL.UPDATEPROCESSOR.JS, SCHEMA_CODEC.XML, MISSLEADING.EXTENSION.UPDATEPROCESSOR.JS.TXT, BAD-SOLRCONFIG-INVALID-SCRIPTFILE.XML, SOLRCONFIG-MASTER1-KEEPONEBACKUP.XML, SYNONYMS.TXT, TRIVIAL.UPDATEPROCESSOR0.JS, SOLRCONFIG-SPELLCHECKCOMPONENT.XML, HYPHENATION.DTD, SCHEMA11.XML, TRIVIAL.UPDATEPROCESSOR1.JS, HUNSPELL-TEST.DIC, BAD-SOLRCONFIG-MISSING-SCRIPTFILE.XML, BAD-SCHEMA-EXTERNAL-FILEFIELD.XML, BAD-SCHEMA-NONTEXT-ANALYZER.XML, SOLRCONFIG_PERF.XML, OLD_SYNONYMS.TXT, SCHEMA-LMDIRICHLET.XML, SCHEMA-COPYFIELD-TEST.XML, SCHEMA-SIM.XML, SOLRCONFIG-PROPINJECT-INDEXDEFAULT.XML, SOLRCONFIG-DELPOLICY1.XML, SOLRCONFIG-SIMPLELOCK.XML, DA_UTF8.XML, CURRENCY.XML, STOPWORDSWRONGENCODING.TXT, SCHEMA-REQUIRED-FIELDS.XML, BAD-SCHEMA-NOT-INDEXED-BUT-NORMS.XML, DA_COMPOUNDDICTIONARY.TXT, THROW.ERROR.ON.ADD.UPDATEPROCESSOR.JS, SOLRCONFIG-MASTER1.XML, SCHEMA-REVERSED.XML, SOLRCONFIG-MASTER3.XML, FRENCHARTICLES.TXT, SCHEMA-SPELLCHECKER.XML, STOP-SNOWBALL.TXT, SOLRCONFIG-MASTER2.XML, SOLRCONFIG-MASTER.XML, HUNSPELL-TEST.AFF, STOPTYPES-2.TXT, SOLRCONFIG-DELPOLICY2.XML, SOLRCONFIG-SOLR-749.XML, SOLRCONFIG-PHRASESUGGEST.XML, SOLRCONFIG-CACHING.XML, SCHEMA-NUMERIC.XML, MAPPING-ISOLATIN1ACCENT.TXT, BAD-SCHEMA-NOT-INDEXED-BUT-TF.XML, SCHEMA-PHRASESUGGEST.XML, SCHEMA-STOP-KEEP.XML, STOPWITHBOM.TXT]
[junit4:junit4]   2> 903 T9417 oass.SolrIndexSearcher.<init> Opening Searcher@1e308bea main
[junit4:junit4]   2> 903 T9417 oass.SolrIndexSearcher.getIndexDir WARNING WARNING: Directory impl does not support setting indexDir: org.apache.lucene.store.BaseDirectoryWrapper
[junit4:junit4]   2> 903 T9417 oasu.CommitTracker.<init> Hard AutoCommit: disabled
[junit4:junit4]   2> 903 T9417 oasu.CommitTracker.<init> Soft AutoCommit: disabled
[junit4:junit4]   2> 904 T9417 oashc.QueryElevationComponent.inform Loading QueryElevation from: /mnt/ssd/jenkins/workspace/Lucene-Solr-trunk-Linux-Java8-64/checkout/solr/build/solr-core/test-files/solr/collection1/conf/elevate.xml
[junit4:junit4]   2> 908 T9417 oashc.QueryElevationComponent.inform Loading QueryElevation from: /mnt/ssd/jenkins/workspace/Lucene-Solr-trunk-Linux-Java8-64/checkout/solr/build/solr-core/test-files/solr/collection1/conf/elevate.xml
[junit4:junit4]   2> 913 T9417 oashc.HttpShardHandlerFactory.getParameter Setting socketTimeout to: 0
[junit4:junit4]   2> 914 T9417 oashc.HttpShardHandlerFactory.getParameter Setting urlScheme to: http://
[junit4:junit4]   2> 914 T9417 oashc.HttpShardHandlerFactory.getParameter Setting connTimeout to: 0
[junit4:junit4]   2> 914 T9417 oashc.HttpShardHandlerFactory.getParameter Setting maxConnectionsPerHost to: 20
[junit4:junit4]   2> 914 T9417 oashc.HttpShardHandlerFactory.getParameter Setting corePoolSize to: 0
[junit4:junit4]   2> 914 T9417 oashc.HttpShardHandlerFactory.getParameter Setting maximumPoolSize to: 2147483647
[junit4:junit4]   2> 914 T9417 oashc.HttpShardHandlerFactory.getParameter Setting maxThreadIdleTime to: 5
[junit4:junit4]   2> 915 T9417 oashc.HttpShardHandlerFactory.getParameter Setting sizeOfQueue to: -1
[junit4:junit4]   2> 915 T9417 oashc.HttpShardHandlerFactory.getParameter Setting fairnessPolicy to: false
[junit4:junit4]   2> 915 T9417 oascsi.HttpClientUtil.createClient Creating new http client, config:maxConnectionsPerHost=20&maxConnections=10000&socketTimeout=0&connTimeout=0&retry=false
[junit4:junit4]   2> 917 T9457 oasc.SolrCore.registerSearcher [collection1] Registered new searcher Searcher@1e308bea main{StandardDirectoryReader(segments_1:1)}
[junit4:junit4]   2> 917 T9417 oasc.CoreContainer.register registering core: collection1
[junit4:junit4]   2> 918 T9417 oass.SolrDispatchFilter.init user.dir=/mnt/ssd/jenkins/workspace/Lucene-Solr-trunk-Linux-Java8-64/checkout/solr/build/solr-core/test/J1
[junit4:junit4]   2> 918 T9417 oass.SolrDispatchFilter.init SolrDispatchFilter.init() done
[junit4:junit4]   2> 918 T9417 oascsi.HttpClientUtil.createClient Creating new http client, config:maxConnections=128&maxConnectionsPerHost=32&followRedirects=false
[junit4:junit4]   2> ASYNC  NEW_CORE C98 name=collection1 org.apache.solr.core.SolrCore@3d6e2d20
[junit4:junit4]   2> 927 T9421 C98 oasu.DirectUpdateHandler2.deleteAll [collection1] REMOVING ALL DOCUMENTS FROM INDEX
[junit4:junit4]   2> 928 T9421 C98 oasc.SolrDeletionPolicy.onInit SolrDeletionPolicy.onInit: commits:num=1
[junit4:junit4]   2> 		commit{dir=MockDirWrapper(org.apache.lucene.store.RAMDirectory@c54af62 lockFactory=org.apache.lucene.store.SingleInstanceLockFactory@9008871),segFN=segments_1,generation=1,filenames=[segments_1]
[junit4:junit4]   2> 928 T9421 C98 oasc.SolrDeletionPolicy.updateCommits newest commit = 1
[junit4:junit4]   2> 929 T9421 C98 UPDATE [collection1] webapp=/solr path=/update params={wt=javabin&version=2} {deleteByQuery=*:*} 0 3
[junit4:junit4]   2> ASYNC  NEW_CORE C99 name=collection1 org.apache.solr.core.SolrCore@52b7a1f9
[junit4:junit4]   2> 934 T9430 C99 oasu.DirectUpdateHandler2.deleteAll [collection1] REMOVING ALL DOCUMENTS FROM INDEX
[junit4:junit4]   2> 935 T9430 C99 oasc.SolrDeletionPolicy.onInit SolrDeletionPolicy.onInit: commits:num=1
[junit4:junit4]   2> 		commit{dir=MockDirWrapper(org.apache.lucene.store.RAMDirectory@15eb0cdc lockFactory=org.apache.lucene.store.SingleInstanceLockFactory@65fb03c8),segFN=segments_1,generation=1,filenames=[segments_1]
[junit4:junit4]   2> 936 T9430 C99 oasc.SolrDeletionPolicy.updateCommits newest commit = 1
[junit4:junit4]   2> 936 T9430 C99 UPDATE [collection1] webapp=/solr path=/update params={wt=javabin&version=2} {deleteByQuery=*:*} 0 2
[junit4:junit4]   2> ASYNC  NEW_CORE C100 name=collection1 org.apache.solr.core.SolrCore@482937c
[junit4:junit4]   2> 940 T9441 C100 oasu.DirectUpdateHandler2.deleteAll [collection1] REMOVING ALL DOCUMENTS FROM INDEX
[junit4:junit4]   2> 942 T9441 C100 oasc.SolrDeletionPolicy.onInit SolrDeletionPolicy.onInit: commits:num=1
[junit4:junit4]   2> 		commit{dir=MockDirWrapper(org.apache.lucene.store.RAMDirectory@18a0b434 lockFactory=org.apache.lucene.store.SingleInstanceLockFactory@7ed2bb7e),segFN=segments_1,generation=1,filenames=[segments_1]
[junit4:junit4]   2> 943 T9441 C100 oasc.SolrDeletionPolicy.updateCommits newest commit = 1
[junit4:junit4]   2> 943 T9441 C100 UPDATE [collection1] webapp=/solr path=/update params={wt=javabin&version=2} {deleteByQuery=*:*} 0 3
[junit4:junit4]   2> ASYNC  NEW_CORE C101 name=collection1 org.apache.solr.core.SolrCore@67d5d09b
[junit4:junit4]   2> 947 T9450 C101 oasu.DirectUpdateHandler2.deleteAll [collection1] REMOVING ALL DOCUMENTS FROM INDEX
[junit4:junit4]   2> 948 T9450 C101 oasc.SolrDeletionPolicy.onInit SolrDeletionPolicy.onInit: commits:num=1
[junit4:junit4]   2> 		commit{dir=BaseDirectoryWrapper(org.apache.lucene.store.RAMDirectory@672a55f lockFactory=org.apache.lucene.store.SingleInstanceLockFactory@50c70347),segFN=segments_1,generation=1,filenames=[segments_1]
[junit4:junit4]   2> 949 T9450 C101 oasc.SolrDeletionPolicy.updateCommits newest commit = 1
[junit4:junit4]   2> 949 T9450 C101 UPDATE [collection1] webapp=/solr path=/update params={wt=javabin&version=2} {deleteByQuery=*:*} 0 2
[junit4:junit4]   2> 955 T9421 C98 UPDATE [collection1] webapp=/solr path=/update params={wt=javabin&version=2} {add=[1]} 0 4
[junit4:junit4]   2> 957 T9430 C99 UPDATE [collection1] webapp=/solr path=/update params={wt=javabin&version=2} {add=[1]} 0 0
[junit4:junit4]   2> 959 T9421 C98 UPDATE [collection1] webapp=/solr path=/update params={wt=javabin&version=2} {add=[2]} 0 0
[junit4:junit4]   2> 961 T9441 C100 UPDATE [collection1] webapp=/solr path=/update params={wt=javabin&version=2} {add=[2]} 0 0
[junit4:junit4]   2> 963 T9421 C98 UPDATE [collection1] webapp=/solr path=/update params={wt=javabin&version=2} {add=[3]} 0 0
[junit4:junit4]   2> 965 T9450 C101 UPDATE [collection1] webapp=/solr path=/update params={wt=javabin&version=2} {add=[3]} 0 0
[junit4:junit4]   2> 967 T9421 C98 UPDATE [collection1] webapp=/solr path=/update params={wt=javabin&version=2} {add=[4]} 0 0
[junit4:junit4]   2> 969 T9430 C99 UPDATE [collection1] webapp=/solr path=/update params={wt=javabin&version=2} {add=[4]} 0 0
[junit4:junit4]   2> 971 T9421 C98 UPDATE [collection1] webapp=/solr path=/update params={wt=javabin&version=2} {add=[5]} 0 0
[junit4:junit4]   2> 972 T9441 C100 UPDATE [collection1] webapp=/solr path=/update params={wt=javabin&version=2} {add=[5]} 0 0
[junit4:junit4]   2> 974 T9421 C98 UPDATE [collection1] webapp=/solr path=/update params={wt=javabin&version=2} {add=[6]} 0 0
[junit4:junit4]   2> 976 T9450 C101 UPDATE [collection1] webapp=/solr path=/update params={wt=javabin&version=2} {add=[6]} 0 0
[junit4:junit4]   2> 978 T9421 C98 UPDATE [collection1] webapp=/solr path=/update params={wt=javabin&version=2} {add=[7]} 0 0
[junit4:junit4]   2> 980 T9450 C101 UPDATE [collection1] webapp=/solr path=/update params={wt=javabin&version=2} {add=[7]} 0 0
[junit4:junit4]   2> 988 T9421 C98 oasu.DirectUpdateHandler2.commit start commit{flags=0,_version_=0,optimize=false,openSearcher=true,waitSearcher=true,expungeDeletes=false,softCommit=false}
[junit4:junit4]   2> 989 T9421 C98 oasc.SolrDeletionPolicy.onCommit SolrDeletionPolicy.onCommit: commits:num=2
[junit4:junit4]   2> 		commit{dir=MockDirWrapper(org.apache.lucene.store.RAMDirectory@c54af62 lockFactory=org.apache.lucene.store.SingleInstanceLockFactory@9008871),segFN=segments_1,generation=1,filenames=[segments_1]
[junit4:junit4]   2> 		commit{dir=MockDirWrapper(org.apache.lucene.store.RAMDirectory@c54af62 lockFactory=org.apache.lucene.store.SingleInstanceLockFactory@9008871),segFN=segments_2,generation=2,filenames=[_0.prx, _0.fdt, _0.fdx, _0_nrm.cfe, _0.si, _0.fnm, segments_2, _0.tip, _0.tim, _0_nrm.cfs, _0.frq]
[junit4:junit4]   2> 989 T9421 C98 oasc.SolrDeletionPolicy.updateCommits newest commit = 2
[junit4:junit4]   2> 990 T9421 C98 oass.SolrIndexSearcher.<init> Opening Searcher@66653478 main
[junit4:junit4]   2> 990 T9421 C98 oass.SolrIndexSearcher.getIndexDir WARNING WARNING: Directory impl does not support setting indexDir: org.apache.lucene.store.MockDirectoryWrapper
[junit4:junit4]   2> 992 T9427 oasc.SolrCore.registerSearcher [collection1] Registered new searcher Searcher@66653478 main{StandardDirectoryReader(segments_2:4 _0(5.0):C7)}
[junit4:junit4]   2> 993 T9421 C98 oasu.DirectUpdateHandler2.commit end_commit_flush
[junit4:junit4]   2> 993 T9421 C98 UPDATE [collection1] webapp=/solr path=/update params={version=2&waitSearcher=true&commit=true&softCommit=false&wt=javabin} {commit=} 0 11
[junit4:junit4]   2> 995 T9430 C99 oasu.DirectUpdateHandler2.commit start commit{flags=0,_version_=0,optimize=false,openSearcher=true,waitSearcher=true,expungeDeletes=false,softCommit=false}
[junit4:junit4]   2> 996 T9430 C99 oasc.SolrDeletionPolicy.onCommit SolrDeletionPolicy.onCommit: commits:num=2
[junit4:junit4]   2> 		commit{dir=MockDirWrapper(org.apache.lucene.store.RAMDirectory@15eb0cdc lockFactory=org.apache.lucene.store.SingleInstanceLockFactory@65fb03c8),segFN=segments_1,generation=1,filenames=[segments_1]
[junit4:junit4]   2> 		commit{dir=MockDirWrapper(org.apache.lucene.store.RAMDirectory@15eb0cdc lockFactory=org.apache.lucene.store.SingleInstanceLockFactory@65fb03c8),segFN=segments_2,generation=2,filenames=[_0.prx, _0.fdt, _0.fdx, _0_nrm.cfe, _0.si, _0.fnm, segments_2, _0.tip, _0.tim, _0_nrm.cfs, _0.frq]
[junit4:junit4]   2> 996 T9430 C99 oasc.SolrDeletionPolicy.updateCommits newest commit = 2
[junit4:junit4]   2> 997 T9430 C99 oass.SolrIndexSearcher.<init> Opening Searcher@4f527942 main
[junit4:junit4]   2> 997 T9430 C99 oass.SolrIndexSearcher.getIndexDir WARNING WARNING: Directory impl does not support setting indexDir: org.apache.lucene.store.MockDirectoryWrapper
[junit4:junit4]   2> 997 T9430 C99 oasu.DirectUpdateHandler2.commit end_commit_flush
[junit4:junit4]   2> 998 T9437 oasc.SolrCore.registerSearcher [collection1] Registered new searcher Searcher@4f527942 main{StandardDirectoryReader(segments_2:4 _0(5.0):C2)}
[junit4:junit4]   2> 998 T9430 C99 UPDATE [collection1] webapp=/solr path=/update params={version=2&waitSearcher=true&commit=true&softCommit=false&wt=javabin} {commit=} 0 3
[junit4:junit4]   2> 1000 T9441 C100 oasu.DirectUpdateHandler2.commit start commit{flags=0,_version_=0,optimize=false,openSearcher=true,waitSearcher=true,expungeDeletes=false,softCommit=false}
[junit4:junit4]   2> 1001 T9441 C100 oasc.SolrDeletionPolicy.onCommit SolrDeletionPolicy.onCommit: commits:num=2
[junit4:junit4]   2> 		commit{dir=MockDirWrapper(org.apache.lucene.store.RAMDirectory@18a0b434 lockFactory=org.apache.lucene.store.SingleInstanceLockFactory@7ed2bb7e),segFN=segments_1,generation=1,filenames=[segments_1]
[junit4:junit4]   2> 		commit{dir=MockDirWrapper(org.apache.lucene.store.RAMDirectory@18a0b434 lockFactory=org.apache.lucene.store.SingleInstanceLockFactory@7ed2bb7e),segFN=segments_2,generation=2,filenames=[_0.prx, _0.fdt, _0.fdx, _0_nrm.cfe, _0.si, _0.fnm, segments_2, _0.tip, _0.tim, _0_nrm.cfs, _0.frq]
[junit4:junit4]   2> 1001 T9441 C100 oasc.SolrDeletionPolicy.updateCommits newest commit = 2
[junit4:junit4]   2> 1002 T9441 C100 oass.SolrIndexSearcher.<init> Opening Searcher@3eb5a34 main
[junit4:junit4]   2> 1002 T9441 C100 oass.SolrIndexSearcher.getIndexDir WARNING WARNING: Directory impl does not support setting indexDir: org.apache.lucene.store.MockDirectoryWrapper
[junit4:junit4]   2> 1002 T9441 C100 oasu.DirectUpdateHandler2.commit end_commit_flush
[junit4:junit4]   2> 1002 T9447 oasc.SolrCore.registerSearcher [collection1] Registered new searcher Searcher@3eb5a34 main{StandardDirectoryReader(segments_2:4 _0(5.0):C2)}
[junit4:junit4]   2> 1003 T9441 C100 UPDATE [collection1] webapp=/solr path=/update params={version=2&waitSearcher=true&commit=true&softCommit=false&wt=javabin} {commit=} 0 3
[junit4:junit4]   2> 1004 T9450 C101 oasu.DirectUpdateHandler2.commit start commit{flags=0,_version_=0,optimize=false,openSearcher=true,waitSearcher=true,expungeDeletes=false,softCommit=false}
[junit4:junit4]   2> 1005 T9450 C101 oasc.SolrDeletionPolicy.onCommit SolrDeletionPolicy.onCommit: commits:num=2
[junit4:junit4]   2> 		commit{dir=BaseDirectoryWrapper(org.apache.lucene.store.RAMDirectory@672a55f lockFactory=org.apache.lucene.store.SingleInstanceLockFactory@50c70347),segFN=segments_1,generation=1,filenames=[segments_1]
[junit4:junit4]   2> 		commit{dir=BaseDirectoryWrapper(org.apache.lucene.store.RAMDirectory@672a55f lockFactory=org.apache.lucene.store.SingleInstanceLockFactory@50c70347),segFN=segments_2,generation=2,filenames=[_0.prx, _0.fdt, _0.fdx, _0_nrm.cfe, _0.si, _0.fnm, segments_2, _0.tip, _0.tim, _0_nrm.cfs, _0.frq]
[junit4:junit4]   2> 1006 T9450 C101 oasc.SolrDeletionPolicy.updateCommits newest commit = 2
[junit4:junit4]   2> 1006 T9450 C101 oass.SolrIndexSearcher.<init> Opening Searcher@54dc7790 main
[junit4:junit4]   2> 1006 T9450 C101 oass.SolrIndexSearcher.getIndexDir WARNING WARNING: Directory impl does not support setting indexDir: org.apache.lucene.store.BaseDirectoryWrapper
[junit4:junit4]   2> 1007 T9450 C101 oasu.DirectUpdateHandler2.commit end_commit_flush
[junit4:junit4]   2> 1007 T9457 oasc.SolrCore.registerSearcher [collection1] Registered new searcher Searcher@54dc7790 main{StandardDirectoryReader(segments_2:4 _0(5.0):C3)}
[junit4:junit4]   2> 1007 T9450 C101 UPDATE [collection1] webapp=/solr path=/update params={version=2&waitSearcher=true&commit=true&softCommit=false&wt=javabin} {commit=} 0 3
[junit4:junit4]   2> 1010 T9421 C98 REQ [collection1] webapp=/solr path=/elevate params={sort=id+desc&q=*:*&shards.qt=/elevate&wt=javabin&fl=id,+score,+[elevated]&rows=500&version=2&qt=/elevate&distrib=false} hits=7 status=0 QTime=1 
[junit4:junit4]   2> 1023 T9431 C99 REQ [collection1] webapp=/solr path=/elevate params={sort=id+desc&NOW=1343162790904&wt=javabin&fl=id,score&isShard=true&rows=500&qt=/elevate&distrib=false&shard.url=localhost:48214/solr|[::1]:33332/solr&q=*:*&shards.qt=/elevate&version=2&fsv=true&start=0} hits=2 status=0 QTime=0 
[junit4:junit4]   2> 1024 T9442 C100 REQ [collection1] webapp=/solr path=/elevate params={sort=id+desc&NOW=1343162790904&wt=javabin&fl=id,score&isShard=true&rows=500&qt=/elevate&distrib=false&shard.url=localhost:57984/solr&q=*:*&shards.qt=/elevate&version=2&fsv=true&start=0} hits=2 status=0 QTime=0 
[junit4:junit4]   2> 1025 T9451 C101 REQ [collection1] webapp=/solr path=/elevate params={sort=id+desc&NOW=1343162790904&wt=javabin&fl=id,score&isShard=true&rows=500&qt=/elevate&distrib=false&shard.url=localhost:41022/solr&q=*:*&shards.qt=/elevate&version=2&fsv=true&start=0} hits=3 status=0 QTime=1 
[junit4:junit4]   2> 1027 T9442 C100 REQ [collection1] webapp=/solr path=/elevate params={ids=2.0,5.0&NOW=1343162790904&wt=javabin&fl=id,+score,+[elevated]&rows=500&isShard=true&qt=/elevate&distrib=false&shard.url=localhost:57984/solr&q=*:*&shards.qt=/elevate&version=2} status=0 QTime=0 
[junit4:junit4]   2> 1027 T9431 C99 REQ [collection1] webapp=/solr path=/elevate params={ids=4.0,1.0&NOW=1343162790904&wt=javabin&fl=id,+score,+[elevated]&rows=500&isShard=true&qt=/elevate&distrib=false&shard.url=localhost:48214/solr|[::1]:33332/solr&q=*:*&shards.qt=/elevate&version=2} status=0 QTime=0 
[junit4:junit4]   2> 1027 T9451 C101 REQ [collection1] webapp=/solr path=/elevate params={ids=7.0,6.0,3.0&NOW=1343162790904&wt=javabin&fl=id,+score,+[elevated]&rows=500&isShard=true&qt=/elevate&distrib=false&shard.url=localhost:41022/solr&q=*:*&shards.qt=/elevate&version=2} status=0 QTime=0 
[junit4:junit4]   2> 1028 T9441 C100 REQ [collection1] webapp=/solr path=/elevate params={sort=id+desc&q=*:*&shards.qt=/elevate&shards=localhost:48214/solr|[::1]:33332/solr,localhost:57984/solr,localhost:41022/solr&wt=javabin&fl=id,+score,+[elevated]&rows=500&version=2&qt=/elevate} status=0 QTime=14 
[junit4:junit4]   2> 1029 T9417 oas.BaseDistributedSearchTestCase.compareResponses SEVERE Mismatched responses:
[junit4:junit4]   2> 	{responseHeader={status=0,QTime=14,params={sort=id desc,q=*:*,shards.qt=/elevate,shards=localhost:48214/solr|[::1]:33332/solr,localhost:57984/solr,localhost:41022/solr,wt=javabin,fl=id, score, [elevated],rows=500,version=2,qt=/elevate}},response={numFound=7,start=0,maxScore=1.0,docs=[SolrDocument{id=7.0, [elevated]=false, score=1.0}, SolrDocument{id=6.0, [elevated]=false, score=1.0}, SolrDocument{id=5.0, [elevated]=false, score=1.0}, SolrDocument{id=4.0, [elevated]=false, score=1.0}, SolrDocument{id=3.0, [elevated]=false, score=1.0}, SolrDocument{id=2.0, [elevated]=false, score=1.0}, SolrDocument{id=1.0, [elevated]=false, score=1.0}]}}
[junit4:junit4]   2> 	{responseHeader={status=0,QTime=1,params={sort=id desc,q=*:*,shards.qt=/elevate,wt=javabin,fl=id, score, [elevated],rows=500,version=2,qt=/elevate,distrib=false}},response={numFound=7,start=0,maxScore=1.0,docs=[SolrDocument{id=7.0, score=1.0, [elevated]=false}, SolrDocument{id=6.0, score=1.0, [elevated]=false}, SolrDocument{id=5.0, score=1.0, [elevated]=false}, SolrDocument{id=4.0, score=1.0, [elevated]=false}, SolrDocument{id=3.0, score=1.0, [elevated]=false}, SolrDocument{id=2.0, score=1.0, [elevated]=false}, SolrDocument{id=1.0, score=1.0, [elevated]=false}]}}
[junit4:junit4]   2> 1030 T9417 oasc.CoreContainer.shutdown Shutting down CoreContainer instance=1808769822
[junit4:junit4]   2> 1031 T9417 oasc.SolrCore.close [collection1]  CLOSING SolrCore org.apache.solr.core.SolrCore@3d6e2d20
[junit4:junit4]   2> 1032 T9417 oasc.SolrCore.closeSearcher [collection1] Closing main searcher on request.
[junit4:junit4]   2> 1032 T9417 oasu.DirectUpdateHandler2.close closing DirectUpdateHandler2{commits=1,autocommits=0,soft autocommits=0,optimizes=0,rollbacks=0,expungeDeletes=0,docsPending=0,adds=0,deletesById=0,deletesByQuery=0,errors=0,cumulative_adds=7,cumulative_deletesById=0,cumulative_deletesByQuery=1,cumulative_errors=0}
[junit4:junit4]   2> 1034 T9417 oejsh.ContextHandler.doStop stopped o.e.j.s.ServletContextHandler{/solr,null}
[junit4:junit4]   2> 1087 T9417 oasc.CoreContainer.shutdown Shutting down CoreContainer instance=1440164252
[junit4:junit4]   2> 1088 T9417 oasc.SolrCore.close [collection1]  CLOSING SolrCore org.apache.solr.core.SolrCore@52b7a1f9
[junit4:junit4]   2> 1088 T9417 oasc.SolrCore.closeSearcher [collection1] Closing main searcher on request.
[junit4:junit4]   2> 1088 T9417 oasu.DirectUpdateHandler2.close closing DirectUpdateHandler2{commits=1,autocommits=0,soft autocommits=0,optimizes=0,rollbacks=0,expungeDeletes=0,docsPending=0,adds=0,deletesById=0,deletesByQuery=0,errors=0,cumulative_adds=2,cumulative_deletesById=0,cumulative_deletesByQuery=1,cumulative_errors=0}
[junit4:junit4]   2> 1091 T9417 oejsh.ContextHandler.doStop stopped o.e.j.s.ServletContextHandler{/solr,null}
[junit4:junit4]   2> 1143 T9417 oasc.CoreContainer.shutdown Shutting down CoreContainer instance=1253639029
[junit4:junit4]   2> 1143 T9417 oasc.SolrCore.close [collection1]  CLOSING SolrCore org.apache.solr.core.SolrCore@482937c
[junit4:junit4]   2> 1144 T9417 oasc.SolrCore.closeSearcher [collection1] Closing main searcher on request.
[junit4:junit4]   2> 1144 T9417 oasu.DirectUpdateHandler2.close closing DirectUpdateHandler2{commits=1,autocommits=0,soft autocommits=0,optimizes=0,rollbacks=0,expungeDeletes=0,docsPending=0,adds=0,deletesById=0,deletesByQuery=0,errors=0,cumulative_adds=2,cumulative_deletesById=0,cumulative_deletesByQuery=1,cumulative_errors=0}
[junit4:junit4]   2> 1146 T9417 oejsh.ContextHandler.doStop stopped o.e.j.s.ServletContextHandler{/solr,null}
[junit4:junit4]   2> 1199 T9417 oasc.CoreContainer.shutdown Shutting down CoreContainer instance=150900486
[junit4:junit4]   2> 1200 T9417 oasc.SolrCore.close [collection1]  CLOSING SolrCore org.apache.solr.core.SolrCore@67d5d09b
[junit4:junit4]   2> 1201 T9417 oasc.SolrCore.closeSearcher [collection1] Closing main searcher on request.
[junit4:junit4]   2> 1201 T9417 oasu.DirectUpdateHandler2.close closing DirectUpdateHandler2{commits=1,autocommits=0,soft autocommits=0,optimizes=0,rollbacks=0,expungeDeletes=0,docsPending=0,adds=0,deletesById=0,deletesByQuery=0,errors=0,cumulative_adds=3,cumulative_deletesById=0,cumulative_deletesByQuery=1,cumulative_errors=0}
[junit4:junit4]   2> 1203 T9417 oejsh.ContextHandler.doStop stopped o.e.j.s.ServletContextHandler{/solr,null}
[junit4:junit4]   2> 1255 T9417 oas.SolrTestCaseJ4.tearDown ###Ending testDistribSearch
[junit4:junit4]   2> NOTE: reproduce with: ant test  -Dtestcase=DistributedQueryElevationComponentTest -Dtests.method=testDistribSearch -Dtests.seed=720A596D7D1D337E -Dtests.multiplier=3 -Dtests.slow=true -Dtests.locale=fi -Dtests.timezone=Antarctica/Syowa -Dtests.file.encoding=ISO-8859-1
[junit4:junit4]   2>
[junit4:junit4]    > (@AfterClass output)
[junit4:junit4]   2> 1290 T9417 oas.SolrTestCaseJ4.deleteCore ###deleteCore
[junit4:junit4]   2> NOTE: test params are: codec=Appending, sim=DefaultSimilarity, locale=fi, timezone=Antarctica/Syowa
[junit4:junit4]   2> NOTE: Linux 3.2.0-26-generic amd64/Oracle Corporation 1.8.0-ea (64-bit)/cpus=8,threads=1,free=114842352,total=323813376
[junit4:junit4]   2> NOTE: All tests run in this JVM: [TestDocSet, QueryParsingTest, LeaderElectionTest, TestOmitPositions, TestUAX29URLEmailTokenizerFactory, SortByFunctionTest, ZkSolrClientTest, TestRemoteStreaming, TestJapaneseReadingFormFilterFactory, NotRequiredUniqueKeyTest, TestPropInjectDefaults, SpellCheckCollatorTest, LengthFilterTest, DistanceFunctionTest, TestTrie, PeerSyncTest, TestRangeQuery, TestCoreContainer, StandardRequestHandlerTest, TestShingleFilterFactory, DocumentBuilderTest, SpellPossibilityIteratorTest, IndexSchemaTest, TestIBSimilarityFactory, SampleTest, TestCollationField, TestRealTimeGet, TestJapaneseTokenizerFactory, TestReplicationHandler, SoftAutoCommitTest, JsonLoaderTest, TestGermanNormalizationFilterFactory, TestStressLucene, TestFastLRUCache, TestGreekStemFilterFactory, TestElisionFilterFactory, TestSolrDeletionPolicy1, ResourceLoaderTest, BasicZkTest, TestValueSourceCache, TestRussianLightStemFilterFactory, TermVectorComponentTest, TimeZoneUtilsTest, TestUtils, FullSolrCloudTest, TestSort, SpellCheckComponentTest, TestJapaneseIterationMarkCharFilterFactory, TestCzechStemFilterFactory, CommonGramsFilterFactoryTest, SearchHandlerTest, CircularListTest, CSVRequestHandlerTest, DirectSolrConnectionTest, PrimUtilsTest, IndexReaderFactoryTest, AlternateDirectoryTest, CloudStateTest, UUIDFieldTest, TestConfig, SuggesterFSTTest, UpdateParamsTest, TestQueryTypes, TestQuerySenderNoQuery, TestIndonesianStemFilterFactory, TestPortugueseLightStemFilterFactory, DebugComponentTest, NoCacheHeaderTest, TestPorterStemFilterFactory, TestSuggestSpellingConverter, TestSolrDeletionPolicy2, OverseerTest, RecoveryZkTest, DistributedSpellCheckComponentTest, TestRandomFaceting, DistributedTermsComponentTest, TestJoin, FileBasedSpellCheckerTest, ConvertedLegacyTest, QueryElevationComponentTest, SignatureUpdateProcessorFactoryTest, HighlighterTest, TestFunctionQuery, TestWordDelimiterFilterFactory, PolyFieldTest, MoreLikeThisHandlerTest, DistributedQueryElevationComponentTest]
[junit4:junit4]   2> 
[junit4:junit4] Completed on J1 in 1.30s, 1 test, 1 failure <<< FAILURES!

[...truncated 342 lines...]
BUILD FAILED
/mnt/ssd/jenkins/workspace/Lucene-Solr-trunk-Linux-Java8-64/checkout/build.xml:29: The following error occurred while executing this line:
/mnt/ssd/jenkins/workspace/Lucene-Solr-trunk-Linux-Java8-64/checkout/solr/build.xml:144: The following error occurred while executing this line:
/mnt/ssd/jenkins/workspace/Lucene-Solr-trunk-Linux-Java8-64/checkout/lucene/module-build.xml:62: The following error occurred while executing this line:
/mnt/ssd/jenkins/workspace/Lucene-Solr-trunk-Linux-Java8-64/checkout/lucene/common-build.xml:1094: The following error occurred while executing this line:
/mnt/ssd/jenkins/workspace/Lucene-Solr-trunk-Linux-Java8-64/checkout/lucene/common-build.xml:789: There were test failures: 297 suites, 1054 tests, 1 failure, 6 ignored (1 assumption)

Total time: 19 minutes 35 seconds
Build step 'Execute shell' marked build as failure
Archiving artifacts
Recording test results
Email was triggered for: Failure
Sending email for trigger: Failure




Mime
View raw message