lucene-dev mailing list archives

Site index · List index
Message view « Date » · « Thread »
Top « Date » · « Thread »
From Policeman Jenkins Server <jenk...@sd-datasolutions.de>
Subject [JENKINS] Lucene-Solr-4.x-Windows-Java7-64 - Build # 286 - Failure!
Date Fri, 13 Jul 2012 17:42:13 GMT
Build: http://jenkins.sd-datasolutions.de/job/Lucene-Solr-4.x-Windows-Java7-64/286/

1 tests failed.
REGRESSION:  org.apache.lucene.index.TestIndexWriterWithThreads.testOpenTwoIndexWritersOnDifferentThreads

Error Message:
Failed due to: org.apache.lucene.store.LockObtainFailedException: Lock obtain timed out: org.apache.lucene.store.MockLockFactoryWrapper$MockLock@141e6ff5

Stack Trace:
java.lang.AssertionError: Failed due to: org.apache.lucene.store.LockObtainFailedException:
Lock obtain timed out: org.apache.lucene.store.MockLockFactoryWrapper$MockLock@141e6ff5
	at __randomizedtesting.SeedInfo.seed([30A889F97C2EDA66:3D1D94A1EF180487]:0)
	at org.junit.Assert.fail(Assert.java:93)
	at org.junit.Assert.assertTrue(Assert.java:43)
	at org.junit.Assert.assertFalse(Assert.java:68)
	at org.apache.lucene.index.TestIndexWriterWithThreads.testOpenTwoIndexWritersOnDifferentThreads(TestIndexWriterWithThreads.java:457)
	at sun.reflect.NativeMethodAccessorImpl.invoke0(Native Method)
	at sun.reflect.NativeMethodAccessorImpl.invoke(NativeMethodAccessorImpl.java:57)
	at sun.reflect.DelegatingMethodAccessorImpl.invoke(DelegatingMethodAccessorImpl.java:43)
	at java.lang.reflect.Method.invoke(Method.java:601)
	at com.carrotsearch.randomizedtesting.RandomizedRunner.invoke(RandomizedRunner.java:1995)
	at com.carrotsearch.randomizedtesting.RandomizedRunner.access$1100(RandomizedRunner.java:132)
	at com.carrotsearch.randomizedtesting.RandomizedRunner$6.evaluate(RandomizedRunner.java:818)
	at com.carrotsearch.randomizedtesting.RandomizedRunner$7.evaluate(RandomizedRunner.java:877)
	at com.carrotsearch.randomizedtesting.RandomizedRunner$8.evaluate(RandomizedRunner.java:891)
	at org.apache.lucene.util.TestRuleSetupTeardownChained$1.evaluate(TestRuleSetupTeardownChained.java:50)
	at org.apache.lucene.util.TestRuleFieldCacheSanity$1.evaluate(TestRuleFieldCacheSanity.java:32)
	at org.apache.lucene.util.AbstractBeforeAfterRule$1.evaluate(AbstractBeforeAfterRule.java:45)
	at com.carrotsearch.randomizedtesting.rules.SystemPropertiesInvariantRule$1.evaluate(SystemPropertiesInvariantRule.java:55)
	at org.apache.lucene.util.TestRuleReportUncaughtExceptions$1.evaluate(TestRuleReportUncaughtExceptions.java:68)
	at org.apache.lucene.util.TestRuleThreadAndTestName$1.evaluate(TestRuleThreadAndTestName.java:48)
	at org.apache.lucene.util.TestRuleIgnoreAfterMaxFailures$1.evaluate(TestRuleIgnoreAfterMaxFailures.java:70)
	at org.apache.lucene.util.TestRuleMarkFailure$1.evaluate(TestRuleMarkFailure.java:48)
	at com.carrotsearch.randomizedtesting.RandomizedRunner.runSingleTest(RandomizedRunner.java:825)
	at com.carrotsearch.randomizedtesting.RandomizedRunner.access$700(RandomizedRunner.java:132)
	at com.carrotsearch.randomizedtesting.RandomizedRunner$3$1.run(RandomizedRunner.java:671)
	at com.carrotsearch.randomizedtesting.RandomizedRunner$3.evaluate(RandomizedRunner.java:697)
	at com.carrotsearch.randomizedtesting.RandomizedRunner$4.evaluate(RandomizedRunner.java:736)
	at com.carrotsearch.randomizedtesting.RandomizedRunner$5.evaluate(RandomizedRunner.java:747)
	at org.apache.lucene.util.AbstractBeforeAfterRule$1.evaluate(AbstractBeforeAfterRule.java:45)
	at org.apache.lucene.util.TestRuleReportUncaughtExceptions$1.evaluate(TestRuleReportUncaughtExceptions.java:68)
	at org.apache.lucene.util.TestRuleStoreClassName$1.evaluate(TestRuleStoreClassName.java:38)
	at org.apache.lucene.util.TestRuleIcuHack$1.evaluate(TestRuleIcuHack.java:51)
	at com.carrotsearch.randomizedtesting.rules.SystemPropertiesInvariantRule$1.evaluate(SystemPropertiesInvariantRule.java:55)
	at org.apache.lucene.util.TestRuleNoInstanceHooksOverrides$1.evaluate(TestRuleNoInstanceHooksOverrides.java:53)
	at org.apache.lucene.util.TestRuleNoStaticHooksShadowing$1.evaluate(TestRuleNoStaticHooksShadowing.java:52)
	at org.apache.lucene.util.TestRuleAssertionsRequired$1.evaluate(TestRuleAssertionsRequired.java:36)
	at org.apache.lucene.util.TestRuleMarkFailure$1.evaluate(TestRuleMarkFailure.java:48)
	at org.apache.lucene.util.TestRuleIgnoreAfterMaxFailures$1.evaluate(TestRuleIgnoreAfterMaxFailures.java:70)
	at org.apache.lucene.util.TestRuleIgnoreTestSuites$1.evaluate(TestRuleIgnoreTestSuites.java:55)
	at com.carrotsearch.randomizedtesting.RandomizedRunner.runSuite(RandomizedRunner.java:605)
	at com.carrotsearch.randomizedtesting.RandomizedRunner.access$400(RandomizedRunner.java:132)
	at com.carrotsearch.randomizedtesting.RandomizedRunner$2.run(RandomizedRunner.java:551)




Build Log:
[...truncated 11584 lines...]
[junit4:junit4] Suite: org.apache.lucene.index.TestIndexWriterWithThreads
[junit4:junit4] FAILURE 1.40s | TestIndexWriterWithThreads.testOpenTwoIndexWritersOnDifferentThreads
[junit4:junit4]    > Throwable #1: java.lang.AssertionError: Failed due to: org.apache.lucene.store.LockObtainFailedException:
Lock obtain timed out: org.apache.lucene.store.MockLockFactoryWrapper$MockLock@141e6ff5
[junit4:junit4]    > 	at __randomizedtesting.SeedInfo.seed([30A889F97C2EDA66:3D1D94A1EF180487]:0)
[junit4:junit4]    > 	at org.junit.Assert.fail(Assert.java:93)
[junit4:junit4]    > 	at org.junit.Assert.assertTrue(Assert.java:43)
[junit4:junit4]    > 	at org.junit.Assert.assertFalse(Assert.java:68)
[junit4:junit4]    > 	at org.apache.lucene.index.TestIndexWriterWithThreads.testOpenTwoIndexWritersOnDifferentThreads(TestIndexWriterWithThreads.java:457)
[junit4:junit4]    > 	at sun.reflect.NativeMethodAccessorImpl.invoke0(Native Method)
[junit4:junit4]    > 	at sun.reflect.NativeMethodAccessorImpl.invoke(NativeMethodAccessorImpl.java:57)
[junit4:junit4]    > 	at sun.reflect.DelegatingMethodAccessorImpl.invoke(DelegatingMethodAccessorImpl.java:43)
[junit4:junit4]    > 	at java.lang.reflect.Method.invoke(Method.java:601)
[junit4:junit4]    > 	at com.carrotsearch.randomizedtesting.RandomizedRunner.invoke(RandomizedRunner.java:1995)
[junit4:junit4]    > 	at com.carrotsearch.randomizedtesting.RandomizedRunner.access$1100(RandomizedRunner.java:132)
[junit4:junit4]    > 	at com.carrotsearch.randomizedtesting.RandomizedRunner$6.evaluate(RandomizedRunner.java:818)
[junit4:junit4]    > 	at com.carrotsearch.randomizedtesting.RandomizedRunner$7.evaluate(RandomizedRunner.java:877)
[junit4:junit4]    > 	at com.carrotsearch.randomizedtesting.RandomizedRunner$8.evaluate(RandomizedRunner.java:891)
[junit4:junit4]    > 	at org.apache.lucene.util.TestRuleSetupTeardownChained$1.evaluate(TestRuleSetupTeardownChained.java:50)
[junit4:junit4]    > 	at org.apache.lucene.util.TestRuleFieldCacheSanity$1.evaluate(TestRuleFieldCacheSanity.java:32)
[junit4:junit4]    > 	at org.apache.lucene.util.AbstractBeforeAfterRule$1.evaluate(AbstractBeforeAfterRule.java:45)
[junit4:junit4]    > 	at com.carrotsearch.randomizedtesting.rules.SystemPropertiesInvariantRule$1.evaluate(SystemPropertiesInvariantRule.java:55)
[junit4:junit4]    > 	at org.apache.lucene.util.TestRuleReportUncaughtExceptions$1.evaluate(TestRuleReportUncaughtExceptions.java:68)
[junit4:junit4]    > 	at org.apache.lucene.util.TestRuleThreadAndTestName$1.evaluate(TestRuleThreadAndTestName.java:48)
[junit4:junit4]    > 	at org.apache.lucene.util.TestRuleIgnoreAfterMaxFailures$1.evaluate(TestRuleIgnoreAfterMaxFailures.java:70)
[junit4:junit4]    > 	at org.apache.lucene.util.TestRuleMarkFailure$1.evaluate(TestRuleMarkFailure.java:48)
[junit4:junit4]    > 	at com.carrotsearch.randomizedtesting.RandomizedRunner.runSingleTest(RandomizedRunner.java:825)
[junit4:junit4]    > 	at com.carrotsearch.randomizedtesting.RandomizedRunner.access$700(RandomizedRunner.java:132)
[junit4:junit4]    > 	at com.carrotsearch.randomizedtesting.RandomizedRunner$3$1.run(RandomizedRunner.java:671)
[junit4:junit4]    > 	at com.carrotsearch.randomizedtesting.RandomizedRunner$3.evaluate(RandomizedRunner.java:697)
[junit4:junit4]    > 	at com.carrotsearch.randomizedtesting.RandomizedRunner$4.evaluate(RandomizedRunner.java:736)
[junit4:junit4]    > 	at com.carrotsearch.randomizedtesting.RandomizedRunner$5.evaluate(RandomizedRunner.java:747)
[junit4:junit4]    > 	at org.apache.lucene.util.AbstractBeforeAfterRule$1.evaluate(AbstractBeforeAfterRule.java:45)
[junit4:junit4]    > 	at org.apache.lucene.util.TestRuleReportUncaughtExceptions$1.evaluate(TestRuleReportUncaughtExceptions.java:68)
[junit4:junit4]    > 	at org.apache.lucene.util.TestRuleStoreClassName$1.evaluate(TestRuleStoreClassName.java:38)
[junit4:junit4]    > 	at org.apache.lucene.util.TestRuleIcuHack$1.evaluate(TestRuleIcuHack.java:51)
[junit4:junit4]    > 	at com.carrotsearch.randomizedtesting.rules.SystemPropertiesInvariantRule$1.evaluate(SystemPropertiesInvariantRule.java:55)
[junit4:junit4]    > 	at org.apache.lucene.util.TestRuleNoInstanceHooksOverrides$1.evaluate(TestRuleNoInstanceHooksOverrides.java:53)
[junit4:junit4]    > 	at org.apache.lucene.util.TestRuleNoStaticHooksShadowing$1.evaluate(TestRuleNoStaticHooksShadowing.java:52)
[junit4:junit4]    > 	at org.apache.lucene.util.TestRuleAssertionsRequired$1.evaluate(TestRuleAssertionsRequired.java:36)
[junit4:junit4]    > 	at org.apache.lucene.util.TestRuleMarkFailure$1.evaluate(TestRuleMarkFailure.java:48)
[junit4:junit4]    > 	at org.apache.lucene.util.TestRuleIgnoreAfterMaxFailures$1.evaluate(TestRuleIgnoreAfterMaxFailures.java:70)
[junit4:junit4]    > 	at org.apache.lucene.util.TestRuleIgnoreTestSuites$1.evaluate(TestRuleIgnoreTestSuites.java:55)
[junit4:junit4]    > 	at com.carrotsearch.randomizedtesting.RandomizedRunner.runSuite(RandomizedRunner.java:605)
[junit4:junit4]    > 	at com.carrotsearch.randomizedtesting.RandomizedRunner.access$400(RandomizedRunner.java:132)
[junit4:junit4]    > 	at com.carrotsearch.randomizedtesting.RandomizedRunner$2.run(RandomizedRunner.java:551)
[junit4:junit4]    > 
[junit4:junit4]   1> org.apache.lucene.store.LockObtainFailedException: Lock obtain timed
out: org.apache.lucene.store.MockLockFactoryWrapper$MockLock@141e6ff5
[junit4:junit4]   1> 	at org.apache.lucene.store.Lock.obtain(Lock.java:84)
[junit4:junit4]   1> 	at org.apache.lucene.index.IndexWriter.<init>(IndexWriter.java:597)
[junit4:junit4]   1> 	at org.apache.lucene.index.TestIndexWriterWithThreads$DelayedIndexAndCloseRunnable.run(TestIndexWriterWithThreads.java:491)
[junit4:junit4]   2> NOTE: reproduce with: ant test  -Dtestcase=TestIndexWriterWithThreads
-Dtests.method=testOpenTwoIndexWritersOnDifferentThreads -Dtests.seed=30A889F97C2EDA66 -Dtests.slow=true
-Dtests.locale=es_PA -Dtests.timezone=America/La_Paz -Dtests.file.encoding=Cp1252
[junit4:junit4]   1> 
[junit4:junit4]   2>
[junit4:junit4]    > (@AfterClass output)
[junit4:junit4]   2> NOTE: test params are: codec=Appending, sim=RandomSimilarityProvider(queryNorm=true,coord=true):
{field=DFR I(F)L3(800.0), body=DFR I(n)2, titleTokenized=DFR GL2}, locale=es_PA, timezone=America/La_Paz
[junit4:junit4]   2> NOTE: Windows 7 6.1 amd64/Oracle Corporation 1.7.0_04 (64-bit)/cpus=2,threads=1,free=346402784,total=494796800
[junit4:junit4]   2> NOTE: All tests run in this JVM: [TestSmallFloat, TestFilterAtomicReader,
TestCachingTokenFilter, TestParallelTermEnum, TestLucene40PostingsReader, TestIndexWriterLockRelease,
TestSpecialOperations, TestParallelAtomicReader, TestTransactionRollback, TestPrefixCodedTerms,
TestHugeRamFile, TestArrayUtil, TestIndexWriterForceMerge, TestWindowsMMap, TestAtomicUpdate,
TestPayloadSpans, TestFSTs, TestIsCurrent, TestFieldCacheTermsFilter, TestRecyclingByteBlockAllocator,
TestRegexpQuery, TestFilteredQuery, TestBitUtil, TestTermsEnum, TestMultiPhraseQuery, TestDocValuesTypeCompatibility,
TestTwoPhaseCommitTool, TestDateTools, TestPhrasePrefixQuery, TestSearchForDuplicates, TestCopyBytes,
TestIndexWriterCommit, TestSnapshotDeletionPolicy, TestBooleanQuery, TestMultiValuedNumericRangeQuery,
TestCharTermAttributeImpl, TestCachingCollector, TestDateFilter, TestCheckIndex, TestSearch,
TestDocBoost, TestByteArrayDataInput, TestNewestSegment, TestMaxTermFrequency, TestOmitNorms,
TestDocIdSet, TestPackedInts, TestThreadedForceMerge, TestLock, TestBooleanScorer, TestPrefixRandom,
TestDirectory, TestAutomatonQuery, TestUniqueTermCount, TestIndexWriterDelete, TestSizeBoundedForceMerge,
Before3, Before3, TestNoMergePolicy, TestIndexWriterOnJRECrash, TestPriorityQueue, TestSegmentReader,
TestSimilarity, TestFieldCacheRewriteMethod, TestPrefixInBooleanQuery, TestMixedCodecs, TestComplexExplanations,
TestTypePromotion, TestIndexInput, TestNGramPhraseQuery, TestAutomatonQueryUnicode, TestFixedBitSet,
TestNamedSPILoader, TestTermVectors, TestNRTManager, TestMatchAllDocsQuery, TestFieldCacheSanityChecker,
Nested, TestConcurrentMergeScheduler, TestByteSlices, TestTopScoreDocCollector, TestUnicodeUtil,
TestDocValuesScoring, TestSimilarityProvider, TestDocTermOrds, TestRegexpRandom, TestRamUsageEstimator,
TestGraphTokenizers, TestIndexWriterConfig, TestWeakIdentityMap, TestMultiThreadTermVectors,
TestAddIndexes, TestIndexWriterUnicode, TestIdentityHashSet, TestTermRangeQuery, TestPayloadTermQuery,
TestUTF32ToUTF8, TestNumericRangeQuery32, TestLookaheadTokenFilter, TestSpansAdvanced, TestDeletionPolicy,
TestSpans, TestSentinelIntSet, TestPulsingReuse, TestDocCount, TestPositiveScoresOnlyCollector,
TestTopDocsMerge, TestDeterminizeLexicon, TestBinaryDocument, TestIndexableField, TestIndexWriterMerging,
TestNRTThreads, TestStressIndexing2, TestPhraseQuery, TestDocValues, TestSpanExplanationsOfNonMatches,
TestConstantScoreQuery, TestQueryWrapperFilter, TestVirtualMethod, TestTermInfosReaderIndex,
TestRollingCharBuffer, TestScorerPerf, TestForTooMuchCloning, TestAllFilesHaveCodecHeader,
TestCloseableThreadLocal, TestIndexFileDeleter, TestDateSort, TestReuseDocsEnum, TestParallelReaderEmptyIndex,
TestDemo, TestSurrogates, TestRollback, TestMockCharFilter, TestCharsRef, TestComplexExplanationsOfNonMatches,
TestNearSpansOrdered, TestStressIndexing, TestIndexCommit, TestFileSwitchDirectory, TestSimpleSearchEquivalence,
TestTermVectorsWriter, MultiCollectorTest, TestWildcard, TestTopDocsCollector, TestBasicOperations,
TestSumDocFreq, TestAssertions, TestBytesRefHash, TestDisjunctionMaxQuery, TestSpanSearchEquivalence,
TestDocument, TestNeverDelete, TestVersion, TestFieldValueFilter, TestIndexWriterWithThreads]
[junit4:junit4]   2> 
[junit4:junit4] Completed in 23.49s, 12 tests, 1 failure <<< FAILURES!

[...truncated 473 lines...]
BUILD FAILED
C:\Jenkins\workspace\Lucene-Solr-4.x-Windows-Java7-64\build.xml:29: The following error occurred
while executing this line:
C:\Jenkins\workspace\Lucene-Solr-4.x-Windows-Java7-64\lucene\build.xml:50: The following error
occurred while executing this line:
C:\Jenkins\workspace\Lucene-Solr-4.x-Windows-Java7-64\lucene\common-build.xml:1095: The following
error occurred while executing this line:
C:\Jenkins\workspace\Lucene-Solr-4.x-Windows-Java7-64\lucene\common-build.xml:792: There were
test failures: 305 suites, 1722 tests, 1 failure, 12 ignored (10 assumptions)

Total time: 7 minutes 42 seconds
Build step 'Invoke Ant' marked build as failure
Recording test results
Email was triggered for: Failure
Sending email for trigger: Failure




Mime
View raw message