lucene-dev mailing list archives

Site index · List index
Message view « Date » · « Thread »
Top « Date » · « Thread »
From Policeman Jenkins Server <jenk...@sd-datasolutions.de>
Subject [JENKINS] Lucene-Solr-trunk-Linux (64bit/jdk1.8.0-ea-b49) - Build # 58 - Failure!
Date Tue, 31 Jul 2012 16:32:15 GMT
Build: http://jenkins.sd-datasolutions.de/job/Lucene-Solr-trunk-Linux/58/
Java: 64bit/jdk1.8.0-ea-b49 -XX:+UseSerialGC

1 tests failed.
REGRESSION:  org.apache.solr.handler.component.DistributedQueryElevationComponentTest.testDistribSearch

Error Message:
.responseHeader.params.size()==9,9skipped=5,4

Stack Trace:
junit.framework.AssertionFailedError: .responseHeader.params.size()==9,9skipped=5,4
	at __randomizedtesting.SeedInfo.seed([C821212695C5CD24:49C7AF3EE29AAD18]:0)
	at junit.framework.Assert.fail(Assert.java:50)
	at org.apache.solr.BaseDistributedSearchTestCase.compareResponses(BaseDistributedSearchTestCase.java:670)
	at org.apache.solr.BaseDistributedSearchTestCase.query(BaseDistributedSearchTestCase.java:392)
	at org.apache.solr.handler.component.DistributedQueryElevationComponentTest.doTest(DistributedQueryElevationComponentTest.java:81)
	at org.apache.solr.BaseDistributedSearchTestCase.testDistribSearch(BaseDistributedSearchTestCase.java:679)
	at sun.reflect.NativeMethodAccessorImpl.invoke0(Native Method)
	at sun.reflect.NativeMethodAccessorImpl.invoke(NativeMethodAccessorImpl.java:57)
	at sun.reflect.DelegatingMethodAccessorImpl.invoke(DelegatingMethodAccessorImpl.java:43)
	at java.lang.reflect.Method.invoke(Method.java:474)
	at com.carrotsearch.randomizedtesting.RandomizedRunner.invoke(RandomizedRunner.java:1995)
	at com.carrotsearch.randomizedtesting.RandomizedRunner.access$1100(RandomizedRunner.java:132)
	at com.carrotsearch.randomizedtesting.RandomizedRunner$6.evaluate(RandomizedRunner.java:818)
	at com.carrotsearch.randomizedtesting.RandomizedRunner$7.evaluate(RandomizedRunner.java:877)
	at com.carrotsearch.randomizedtesting.RandomizedRunner$8.evaluate(RandomizedRunner.java:891)
	at com.carrotsearch.randomizedtesting.rules.SystemPropertiesRestoreRule$1.evaluate(SystemPropertiesRestoreRule.java:53)
	at org.apache.lucene.util.TestRuleSetupTeardownChained$1.evaluate(TestRuleSetupTeardownChained.java:50)
	at org.apache.lucene.util.TestRuleFieldCacheSanity$1.evaluate(TestRuleFieldCacheSanity.java:32)
	at org.apache.lucene.util.AbstractBeforeAfterRule$1.evaluate(AbstractBeforeAfterRule.java:45)
	at com.carrotsearch.randomizedtesting.rules.SystemPropertiesInvariantRule$1.evaluate(SystemPropertiesInvariantRule.java:55)
	at org.apache.lucene.util.TestRuleReportUncaughtExceptions$1.evaluate(TestRuleReportUncaughtExceptions.java:68)
	at org.apache.lucene.util.TestRuleThreadAndTestName$1.evaluate(TestRuleThreadAndTestName.java:48)
	at org.apache.lucene.util.TestRuleIgnoreAfterMaxFailures$1.evaluate(TestRuleIgnoreAfterMaxFailures.java:70)
	at org.apache.lucene.util.TestRuleMarkFailure$1.evaluate(TestRuleMarkFailure.java:48)
	at com.carrotsearch.randomizedtesting.RandomizedRunner.runSingleTest(RandomizedRunner.java:825)
	at com.carrotsearch.randomizedtesting.RandomizedRunner.access$700(RandomizedRunner.java:132)
	at com.carrotsearch.randomizedtesting.RandomizedRunner$3$1.run(RandomizedRunner.java:671)
	at com.carrotsearch.randomizedtesting.RandomizedRunner$3.evaluate(RandomizedRunner.java:697)
	at com.carrotsearch.randomizedtesting.RandomizedRunner$4.evaluate(RandomizedRunner.java:736)
	at com.carrotsearch.randomizedtesting.RandomizedRunner$5.evaluate(RandomizedRunner.java:747)
	at com.carrotsearch.randomizedtesting.rules.SystemPropertiesRestoreRule$1.evaluate(SystemPropertiesRestoreRule.java:53)
	at org.apache.lucene.util.AbstractBeforeAfterRule$1.evaluate(AbstractBeforeAfterRule.java:45)
	at org.apache.lucene.util.TestRuleReportUncaughtExceptions$1.evaluate(TestRuleReportUncaughtExceptions.java:68)
	at org.apache.lucene.util.TestRuleStoreClassName$1.evaluate(TestRuleStoreClassName.java:38)
	at com.carrotsearch.randomizedtesting.rules.SystemPropertiesInvariantRule$1.evaluate(SystemPropertiesInvariantRule.java:55)
	at org.apache.lucene.util.TestRuleNoInstanceHooksOverrides$1.evaluate(TestRuleNoInstanceHooksOverrides.java:53)
	at org.apache.lucene.util.TestRuleNoStaticHooksShadowing$1.evaluate(TestRuleNoStaticHooksShadowing.java:52)
	at org.apache.lucene.util.TestRuleAssertionsRequired$1.evaluate(TestRuleAssertionsRequired.java:36)
	at org.apache.lucene.util.TestRuleMarkFailure$1.evaluate(TestRuleMarkFailure.java:48)
	at org.apache.lucene.util.TestRuleIgnoreAfterMaxFailures$1.evaluate(TestRuleIgnoreAfterMaxFailures.java:70)
	at org.apache.lucene.util.TestRuleIgnoreTestSuites$1.evaluate(TestRuleIgnoreTestSuites.java:55)
	at com.carrotsearch.randomizedtesting.RandomizedRunner.runSuite(RandomizedRunner.java:605)
	at com.carrotsearch.randomizedtesting.RandomizedRunner.access$400(RandomizedRunner.java:132)
	at com.carrotsearch.randomizedtesting.RandomizedRunner$2.run(RandomizedRunner.java:551)




Build Log:
[...truncated 7603 lines...]
[junit4:junit4] Suite: org.apache.solr.handler.component.DistributedQueryElevationComponentTest
[junit4:junit4] FAILURE 1.32s J0 | DistributedQueryElevationComponentTest.testDistribSearch
[junit4:junit4]    > Throwable #1: junit.framework.AssertionFailedError: .responseHeader.params.size()==9,9skipped=5,4
[junit4:junit4]    > 	at __randomizedtesting.SeedInfo.seed([C821212695C5CD24:49C7AF3EE29AAD18]:0)
[junit4:junit4]    > 	at junit.framework.Assert.fail(Assert.java:50)
[junit4:junit4]    > 	at org.apache.solr.BaseDistributedSearchTestCase.compareResponses(BaseDistributedSearchTestCase.java:670)
[junit4:junit4]    > 	at org.apache.solr.BaseDistributedSearchTestCase.query(BaseDistributedSearchTestCase.java:392)
[junit4:junit4]    > 	at org.apache.solr.handler.component.DistributedQueryElevationComponentTest.doTest(DistributedQueryElevationComponentTest.java:81)
[junit4:junit4]    > 	at org.apache.solr.BaseDistributedSearchTestCase.testDistribSearch(BaseDistributedSearchTestCase.java:679)
[junit4:junit4]    > 	at sun.reflect.NativeMethodAccessorImpl.invoke0(Native Method)
[junit4:junit4]    > 	at sun.reflect.NativeMethodAccessorImpl.invoke(NativeMethodAccessorImpl.java:57)
[junit4:junit4]    > 	at sun.reflect.DelegatingMethodAccessorImpl.invoke(DelegatingMethodAccessorImpl.java:43)
[junit4:junit4]    > 	at java.lang.reflect.Method.invoke(Method.java:474)
[junit4:junit4]    > 	at com.carrotsearch.randomizedtesting.RandomizedRunner.invoke(RandomizedRunner.java:1995)
[junit4:junit4]    > 	at com.carrotsearch.randomizedtesting.RandomizedRunner.access$1100(RandomizedRunner.java:132)
[junit4:junit4]    > 	at com.carrotsearch.randomizedtesting.RandomizedRunner$6.evaluate(RandomizedRunner.java:818)
[junit4:junit4]    > 	at com.carrotsearch.randomizedtesting.RandomizedRunner$7.evaluate(RandomizedRunner.java:877)
[junit4:junit4]    > 	at com.carrotsearch.randomizedtesting.RandomizedRunner$8.evaluate(RandomizedRunner.java:891)
[junit4:junit4]    > 	at com.carrotsearch.randomizedtesting.rules.SystemPropertiesRestoreRule$1.evaluate(SystemPropertiesRestoreRule.java:53)
[junit4:junit4]    > 	at org.apache.lucene.util.TestRuleSetupTeardownChained$1.evaluate(TestRuleSetupTeardownChained.java:50)
[junit4:junit4]    > 	at org.apache.lucene.util.TestRuleFieldCacheSanity$1.evaluate(TestRuleFieldCacheSanity.java:32)
[junit4:junit4]    > 	at org.apache.lucene.util.AbstractBeforeAfterRule$1.evaluate(AbstractBeforeAfterRule.java:45)
[junit4:junit4]    > 	at com.carrotsearch.randomizedtesting.rules.SystemPropertiesInvariantRule$1.evaluate(SystemPropertiesInvariantRule.java:55)
[junit4:junit4]    > 	at org.apache.lucene.util.TestRuleReportUncaughtExceptions$1.evaluate(TestRuleReportUncaughtExceptions.java:68)
[junit4:junit4]    > 	at org.apache.lucene.util.TestRuleThreadAndTestName$1.evaluate(TestRuleThreadAndTestName.java:48)
[junit4:junit4]    > 	at org.apache.lucene.util.TestRuleIgnoreAfterMaxFailures$1.evaluate(TestRuleIgnoreAfterMaxFailures.java:70)
[junit4:junit4]    > 	at org.apache.lucene.util.TestRuleMarkFailure$1.evaluate(TestRuleMarkFailure.java:48)
[junit4:junit4]    > 	at com.carrotsearch.randomizedtesting.RandomizedRunner.runSingleTest(RandomizedRunner.java:825)
[junit4:junit4]    > 	at com.carrotsearch.randomizedtesting.RandomizedRunner.access$700(RandomizedRunner.java:132)
[junit4:junit4]    > 	at com.carrotsearch.randomizedtesting.RandomizedRunner$3$1.run(RandomizedRunner.java:671)
[junit4:junit4]    > 	at com.carrotsearch.randomizedtesting.RandomizedRunner$3.evaluate(RandomizedRunner.java:697)
[junit4:junit4]    > 	at com.carrotsearch.randomizedtesting.RandomizedRunner$4.evaluate(RandomizedRunner.java:736)
[junit4:junit4]    > 	at com.carrotsearch.randomizedtesting.RandomizedRunner$5.evaluate(RandomizedRunner.java:747)
[junit4:junit4]    > 	at com.carrotsearch.randomizedtesting.rules.SystemPropertiesRestoreRule$1.evaluate(SystemPropertiesRestoreRule.java:53)
[junit4:junit4]    > 	at org.apache.lucene.util.AbstractBeforeAfterRule$1.evaluate(AbstractBeforeAfterRule.java:45)
[junit4:junit4]    > 	at org.apache.lucene.util.TestRuleReportUncaughtExceptions$1.evaluate(TestRuleReportUncaughtExceptions.java:68)
[junit4:junit4]    > 	at org.apache.lucene.util.TestRuleStoreClassName$1.evaluate(TestRuleStoreClassName.java:38)
[junit4:junit4]    > 	at com.carrotsearch.randomizedtesting.rules.SystemPropertiesInvariantRule$1.evaluate(SystemPropertiesInvariantRule.java:55)
[junit4:junit4]    > 	at org.apache.lucene.util.TestRuleNoInstanceHooksOverrides$1.evaluate(TestRuleNoInstanceHooksOverrides.java:53)
[junit4:junit4]    > 	at org.apache.lucene.util.TestRuleNoStaticHooksShadowing$1.evaluate(TestRuleNoStaticHooksShadowing.java:52)
[junit4:junit4]    > 	at org.apache.lucene.util.TestRuleAssertionsRequired$1.evaluate(TestRuleAssertionsRequired.java:36)
[junit4:junit4]    > 	at org.apache.lucene.util.TestRuleMarkFailure$1.evaluate(TestRuleMarkFailure.java:48)
[junit4:junit4]    > 	at org.apache.lucene.util.TestRuleIgnoreAfterMaxFailures$1.evaluate(TestRuleIgnoreAfterMaxFailures.java:70)
[junit4:junit4]    > 	at org.apache.lucene.util.TestRuleIgnoreTestSuites$1.evaluate(TestRuleIgnoreTestSuites.java:55)
[junit4:junit4]    > 	at com.carrotsearch.randomizedtesting.RandomizedRunner.runSuite(RandomizedRunner.java:605)
[junit4:junit4]    > 	at com.carrotsearch.randomizedtesting.RandomizedRunner.access$400(RandomizedRunner.java:132)
[junit4:junit4]    > 	at com.carrotsearch.randomizedtesting.RandomizedRunner$2.run(RandomizedRunner.java:551)
[junit4:junit4]    > 
[junit4:junit4]   2> 2 T2920 oas.SolrTestCaseJ4.setUp ###Starting testDistribSearch
[junit4:junit4]   2> 3 T2920 oejs.Server.doStart jetty-8.1.2.v20120308
[junit4:junit4]   2> 18 T2920 oejs.AbstractConnector.doStart Started SocketConnector@0.0.0.0:33740
[junit4:junit4]   2> 19 T2920 oasc.SolrResourceLoader.locateSolrHome JNDI not configured for solr (NoInitialContextEx)
[junit4:junit4]   2> 19 T2920 oasc.SolrResourceLoader.locateSolrHome using system property solr.solr.home: /mnt/ssd/jenkins/workspace/Lucene-Solr-trunk-Linux/checkout/solr/build/solr-core/test-files/solr
[junit4:junit4]   2> 19 T2920 oasc.SolrResourceLoader.<init> new SolrResourceLoader for deduced Solr Home: '/mnt/ssd/jenkins/workspace/Lucene-Solr-trunk-Linux/checkout/solr/build/solr-core/test-files/solr/'
[junit4:junit4]   2> 28 T2920 oass.SolrDispatchFilter.init SolrDispatchFilter.init()
[junit4:junit4]   2> 29 T2920 oasc.SolrResourceLoader.locateSolrHome JNDI not configured for solr (NoInitialContextEx)
[junit4:junit4]   2> 29 T2920 oasc.SolrResourceLoader.locateSolrHome using system property solr.solr.home: /mnt/ssd/jenkins/workspace/Lucene-Solr-trunk-Linux/checkout/solr/build/solr-core/test-files/solr
[junit4:junit4]   2> 29 T2920 oasc.CoreContainer$Initializer.initialize looking for solr.xml: /mnt/ssd/jenkins/workspace/Lucene-Solr-trunk-Linux/checkout/solr/build/solr-core/test-files/solr/solr.xml
[junit4:junit4]   2> 29 T2920 oasc.CoreContainer.<init> New CoreContainer 1867676750
[junit4:junit4]   2> 30 T2920 oasc.CoreContainer.load Loading CoreContainer using Solr Home: '/mnt/ssd/jenkins/workspace/Lucene-Solr-trunk-Linux/checkout/solr/build/solr-core/test-files/solr/'
[junit4:junit4]   2> 30 T2920 oasc.SolrResourceLoader.<init> new SolrResourceLoader for directory: '/mnt/ssd/jenkins/workspace/Lucene-Solr-trunk-Linux/checkout/solr/build/solr-core/test-files/solr/'
[junit4:junit4]   2> 41 T2920 oasc.CoreContainer.load Registering Log Listener
[junit4:junit4]   2> 53 T2920 oasc.CoreContainer.create Creating SolrCore 'collection1' using instanceDir: /mnt/ssd/jenkins/workspace/Lucene-Solr-trunk-Linux/checkout/solr/build/solr-core/test-files/solr/collection1
[junit4:junit4]   2> 54 T2920 oasc.SolrResourceLoader.<init> new SolrResourceLoader for directory: '/mnt/ssd/jenkins/workspace/Lucene-Solr-trunk-Linux/checkout/solr/build/solr-core/test-files/solr/collection1/'
[junit4:junit4]   2> 54 T2920 oasc.SolrResourceLoader.replaceClassLoader Adding 'file:/mnt/ssd/jenkins/workspace/Lucene-Solr-trunk-Linux/checkout/solr/build/solr-core/test-files/solr/collection1/lib/README' to classloader
[junit4:junit4]   2> 55 T2920 oasc.SolrResourceLoader.replaceClassLoader Adding 'file:/mnt/ssd/jenkins/workspace/Lucene-Solr-trunk-Linux/checkout/solr/build/solr-core/test-files/solr/collection1/lib/classes/' to classloader
[junit4:junit4]   2> 79 T2920 oasc.SolrConfig.<init> Using Lucene MatchVersion: LUCENE_50
[junit4:junit4]   2> 112 T2920 oasc.SolrConfig.<init> Loaded SolrConfig: solrconfig-elevate.xml
[junit4:junit4]   2> 113 T2920 oass.IndexSchema.readSchema Reading Solr Schema
[junit4:junit4]   2> 115 T2920 oass.IndexSchema.readSchema Schema name=example
[junit4:junit4]   2> 216 T2920 oass.IndexSchema.readSchema default search field in schema is text
[junit4:junit4]   2> 217 T2920 oass.IndexSchema.readSchema unique key field: id
[junit4:junit4]   2> 219 T2920 oasc.SolrCore.<init> [collection1] Opening new SolrCore at /mnt/ssd/jenkins/workspace/Lucene-Solr-trunk-Linux/checkout/solr/build/solr-core/test-files/solr/collection1/, dataDir=./org.apache.solr.handler.component.DistributedQueryElevationComponentTest-1343752254379/control/data/
[junit4:junit4]   2> 225 T2920 oasc.JmxMonitoredMap.<init> JMX monitoring is enabled. Adding Solr mbeans to JMX Server: com.sun.jmx.mbeanserver.JmxMBeanServer@5e1dbd0
[junit4:junit4]   2> 226 T2920 oasc.SolrCore.getNewIndexDir WARNING New index directory detected: old=null new=./org.apache.solr.handler.component.DistributedQueryElevationComponentTest-1343752254379/control/data/index/
[junit4:junit4]   2> 226 T2920 oasc.SolrCore.initIndex WARNING [collection1] Solr index directory './org.apache.solr.handler.component.DistributedQueryElevationComponentTest-1343752254379/control/data/index' doesn't exist. Creating new index...
[junit4:junit4]   2> 227 T2920 oasc.SolrDeletionPolicy.onCommit SolrDeletionPolicy.onCommit: commits:num=1
[junit4:junit4]   2> 		commit{dir=BaseDirectoryWrapper(org.apache.lucene.store.RAMDirectory@32cc63c2 lockFactory=org.apache.lucene.store.SingleInstanceLockFactory@8a96f9c),segFN=segments_1,generation=1,filenames=[segments_1]
[junit4:junit4]   2> 227 T2920 oasc.SolrDeletionPolicy.updateCommits newest commit = 1
[junit4:junit4]   2> 228 T2920 oasc.RequestHandlers.initHandlersFromConfig created /update: solr.UpdateRequestHandler
[junit4:junit4]   2> 228 T2920 oasc.RequestHandlers.initHandlersFromConfig created /elevate: org.apache.solr.handler.component.SearchHandler
[junit4:junit4]   2> 229 T2920 oasc.RequestHandlers.initHandlersFromConfig created /dataElevate: org.apache.solr.handler.component.SearchHandler
[junit4:junit4]   2> 229 T2920 oashl.XMLLoader.init xsltCacheLifetimeSeconds=60
[junit4:junit4]   2> 229 T2920 oasc.RequestHandlers.initHandlersFromConfig WARNING no default request handler is registered (either '/select' or 'standard')
[junit4:junit4]   2> 230 T2920 oasc.SolrCore.initDeprecatedSupport WARNING solrconfig.xml uses deprecated <admin/gettableFiles>, Please update your config to use the ShowFileRequestHandler.
[junit4:junit4]   2> 231 T2920 oasc.SolrCore.initDeprecatedSupport WARNING adding ShowFileRequestHandler with hidden files: [SOLRCONFIG-QUERYSENDER.XML, SOLRCONFIG-SLAVE1.XML, SOLRCONFIG-REQHANDLER.INCL, MISSLEADING.EXTENSION.UPDATEPROCESSOR.JS.TXT, BAD_SOLRCONFIG.XML, SOLRCONFIG-UPDATE-PROCESSOR-CHAINS.XML, SCHEMA12.XML, PROTWORDS.TXT, SOLRCONFIG-TERMINDEX.XML, STOP-1.TXT, BAD-SCHEMA-DUP-DYNAMICFIELD.XML, SCHEMA-DFR.XML, SOLRCONFIG-SPELLCHECKCOMPONENT.XML, SCHEMA.XML, DA_COMPOUNDDICTIONARY.TXT, SOLRCONFIG-MERGEPOLICY.XML, BAD-SCHEMA-NOT-INDEXED-BUT-POS.XML, STEMDICT.TXT, SYNONYMS.TXT, BAD-MP-SOLRCONFIG.XML, TRIVIAL.UPDATEPROCESSOR0.JS, STOPWITHBOM.TXT, SCHEMA-SIM.XML, CONDITIONAL.UPDATEPROCESSOR.JS, SCHEMA-COLLATE.XML, BAD-SCHEMA-NONTEXT-ANALYZER.XML, BAD-SOLRCONFIG-INVALID-SCRIPTFILE.XML, SOLRCONFIG-FUNCTIONQUERY.XML, SCHEMA-NOT-REQUIRED-UNIQUE-KEY.XML, BAD-SCHEMA-UNIQUEKEY-MULTIVALUED.XML, SCHEMA-PHRASESUGGEST.XML, HYPHENATION.DTD, BAD-SCHEMA-OMIT-TF-BUT-NOT-POS.XML, SOLRCONFIG-HIGHLIGHT.XML, SCHEMA15.XML, SOLRCONFIG-NOCACHE.XML, SOLRCONFIG-ELEVATE.XML, SCHEMA-TFIDF.XML, SOLRCONFIG-BASIC.XML, SCHEMA11.XML, SOLRCONFIG-LAZYWRITER.XML, SCHEMASURROUND.XML, MAPPING-ISOLATIN1ACCENT.TXT, BAD-SCHEMA-DUP-FIELDTYPE.XML, SCHEMA-NUMERIC.XML, MISSING.FUNCTIONS.UPDATEPROCESSOR.JS, SOLRCONFIG-REPEATER.XML, BAD-SCHEMA-ANALYZER-CLASS-AND-NESTED.XML, BAD-SOLRCONFIG-MISSING-SCRIPTFILE.XML, STOPWORDS.TXT, BAD-SCHEMA-CODEC-GLOBAL-VS-FT-MISMATCH.XML, SCHEMA_CODEC.XML, SOLRCONFIG-PROPINJECT-INDEXDEFAULT.XML, HUNSPELL-TEST.AFF, KEEP-1.TXT, CURRENCY.XML, SCHEMA-REVERSED.XML, ELEVATE.XML, SOLRCONFIG-SLAVE.XML, BAD-SCHEMA-NOT-INDEXED-BUT-TF.XML, ADDFIELDS.UPDATEPROCESSOR.JS, WDFTYPES.TXT, HUNSPELL-TEST.DIC, STOP-SNOWBALL.TXT, SOLRCONFIG-TRANSFORMERS.XML, SCHEMA-REPLICATION1.XML, SOLRCONFIG-SIMPLELOCK.XML, SOLRCONFIG-MASTER2.XML, SOLRCONFIG-SOLCOREPROPERTIES.XML, SOLRCONFIG-PHRASESUGGEST.XML, SOLRCONFIG-ENABLEPLUGIN.XML, KEEP-2.TXT, BAD-SCHEMA-UNIQUEKEY-IS-COPYFIELD-DEST.XML, SOLRCONFIG-ALTDIRECTORY.XML, STOPTYPES-2.TXT, DA_UTF8.XML, SCHEMA-REQUIRED-FIELDS.XML, STOP-2.TXT, THROW.ERROR.ON.ADD.UPDATEPROCESSOR.JS, BAD-SCHEMA-EXTERNAL-FILEFIELD.XML, SOLRCONFIG-SPELLCHECKER.XML, SOLRCONFIG-PROPINJECT.XML, SCHEMA-MINIMAL.XML, BAD-SCHEMA-UNIQUEKEY-USES-DEFAULT.XML, OLD_SYNONYMS.TXT, TRIVIAL.UPDATEPROCESSOR1.JS, SOLRCONFIG-MASTER3.XML, SOLRCONFIG-TLOG.XML, SCHEMA-IB.XML, PHRASESUGGEST.TXT, OPEN-EXCHANGE-RATES.JSON, SCHEMA-BINARYFIELD.XML, FRENCHARTICLES.TXT, SCHEMA-CHARFILTERS.XML, SCHEMA-SPELLCHECKER.XML, SOLRCONFIG-MASTER.XML, COMPOUNDDICTIONARY.TXT, SCHEMA-TRIE.XML, SCHEMA-LUCENEMATCHVERSION.XML, SOLRCONFIG-SCRIPT-UPDATEPROCESSOR.XML, SCHEMA-LMDIRICHLET.XML, SOLRCONFIG_PERF.XML, BAD-SOLRCONFIG-BOGUS-SCRIPTENGINE-NAME.XML, SCHEMA-STOP-KEEP.XML, SOLRCONFIG-SOLR-749.XML, SOLRCONFIG-QUERYSENDER-NOQUERY.XML, SOLRCONFIG-NATIVELOCK.XML, SOLRCONFIG-MASTER1-KEEPONEBACKUP.XML, XSLT, SCHEMA-LMJELINEKMERCER.XML, SCHEMA-BM25.XML, SOLRCONFIG-MASTER1.XML, SOLRCONFIG-DELPOLICY2.XML, SOLRCONFIG_CODEC.XML, SOLRCONFIG-XINCLUDE.XML, BAD-SCHEMA-SIM-GLOBAL-VS-FT-MISMATCH.XML, SCHEMA-REPLICATION2.XML, SOLRCONFIG-DELPOLICY1.XML, STOPWORDSWRONGENCODING.TXT, STOPTYPES-1.TXT, BAD-SCHEMA-NOT-INDEXED-BUT-NORMS.XML, SCHEMA-COPYFIELD-TEST.XML, SOLRCONFIG-CACHING.XML, BAD-SCHEMA-DUP-FIELD.XML, SCHEMA-FOLDING.XML]
[junit4:junit4]   2> 232 T2920 oass.SolrIndexSearcher.<init> Opening Searcher@359948cc main
[junit4:junit4]   2> 232 T2920 oass.SolrIndexSearcher.getIndexDir WARNING WARNING: Directory impl does not support setting indexDir: org.apache.lucene.store.BaseDirectoryWrapper
[junit4:junit4]   2> 232 T2920 oasu.CommitTracker.<init> Hard AutoCommit: disabled
[junit4:junit4]   2> 233 T2920 oasu.CommitTracker.<init> Soft AutoCommit: disabled
[junit4:junit4]   2> 233 T2920 oashc.QueryElevationComponent.inform Loading QueryElevation from: /mnt/ssd/jenkins/workspace/Lucene-Solr-trunk-Linux/checkout/solr/build/solr-core/test-files/solr/collection1/conf/elevate.xml
[junit4:junit4]   2> 238 T2920 oashc.QueryElevationComponent.inform Loading QueryElevation from: /mnt/ssd/jenkins/workspace/Lucene-Solr-trunk-Linux/checkout/solr/build/solr-core/test-files/solr/collection1/conf/elevate.xml
[junit4:junit4]   2> 242 T2920 oashc.HttpShardHandlerFactory.getParameter Setting socketTimeout to: 0
[junit4:junit4]   2> 243 T2920 oashc.HttpShardHandlerFactory.getParameter Setting urlScheme to: http://
[junit4:junit4]   2> 243 T2920 oashc.HttpShardHandlerFactory.getParameter Setting connTimeout to: 0
[junit4:junit4]   2> 243 T2920 oashc.HttpShardHandlerFactory.getParameter Setting maxConnectionsPerHost to: 20
[junit4:junit4]   2> 243 T2920 oashc.HttpShardHandlerFactory.getParameter Setting corePoolSize to: 0
[junit4:junit4]   2> 243 T2920 oashc.HttpShardHandlerFactory.getParameter Setting maximumPoolSize to: 2147483647
[junit4:junit4]   2> 244 T2920 oashc.HttpShardHandlerFactory.getParameter Setting maxThreadIdleTime to: 5
[junit4:junit4]   2> 244 T2920 oashc.HttpShardHandlerFactory.getParameter Setting sizeOfQueue to: -1
[junit4:junit4]   2> 244 T2920 oashc.HttpShardHandlerFactory.getParameter Setting fairnessPolicy to: false
[junit4:junit4]   2> 245 T2920 oascsi.HttpClientUtil.createClient Creating new http client, config:maxConnectionsPerHost=20&maxConnections=10000&socketTimeout=0&connTimeout=0&retry=false
[junit4:junit4]   2> 247 T2930 oasc.SolrCore.registerSearcher [collection1] Registered new searcher Searcher@359948cc main{StandardDirectoryReader(segments_1:1)}
[junit4:junit4]   2> 247 T2920 oasc.CoreContainer.register registering core: collection1
[junit4:junit4]   2> 247 T2920 oass.SolrDispatchFilter.init user.dir=/mnt/ssd/jenkins/workspace/Lucene-Solr-trunk-Linux/checkout/solr/build/solr-core/test/J0
[junit4:junit4]   2> 248 T2920 oass.SolrDispatchFilter.init SolrDispatchFilter.init() done
[junit4:junit4]   2> 248 T2920 oascsi.HttpClientUtil.createClient Creating new http client, config:maxConnections=128&maxConnectionsPerHost=32&followRedirects=false
[junit4:junit4]   2> 250 T2920 oejs.Server.doStart jetty-8.1.2.v20120308
[junit4:junit4]   2> 252 T2920 oejs.AbstractConnector.doStart Started SocketConnector@0.0.0.0:46272
[junit4:junit4]   2> 255 T2920 oasc.SolrResourceLoader.locateSolrHome JNDI not configured for solr (NoInitialContextEx)
[junit4:junit4]   2> 255 T2920 oasc.SolrResourceLoader.locateSolrHome using system property solr.solr.home: /mnt/ssd/jenkins/workspace/Lucene-Solr-trunk-Linux/checkout/solr/build/solr-core/test-files/solr
[junit4:junit4]   2> 255 T2920 oasc.SolrResourceLoader.<init> new SolrResourceLoader for deduced Solr Home: '/mnt/ssd/jenkins/workspace/Lucene-Solr-trunk-Linux/checkout/solr/build/solr-core/test-files/solr/'
[junit4:junit4]   2> 263 T2920 oass.SolrDispatchFilter.init SolrDispatchFilter.init()
[junit4:junit4]   2> 264 T2920 oasc.SolrResourceLoader.locateSolrHome JNDI not configured for solr (NoInitialContextEx)
[junit4:junit4]   2> 264 T2920 oasc.SolrResourceLoader.locateSolrHome using system property solr.solr.home: /mnt/ssd/jenkins/workspace/Lucene-Solr-trunk-Linux/checkout/solr/build/solr-core/test-files/solr
[junit4:junit4]   2> 264 T2920 oasc.CoreContainer$Initializer.initialize looking for solr.xml: /mnt/ssd/jenkins/workspace/Lucene-Solr-trunk-Linux/checkout/solr/build/solr-core/test-files/solr/solr.xml
[junit4:junit4]   2> 264 T2920 oasc.CoreContainer.<init> New CoreContainer 2055953083
[junit4:junit4]   2> 265 T2920 oasc.CoreContainer.load Loading CoreContainer using Solr Home: '/mnt/ssd/jenkins/workspace/Lucene-Solr-trunk-Linux/checkout/solr/build/solr-core/test-files/solr/'
[junit4:junit4]   2> 265 T2920 oasc.SolrResourceLoader.<init> new SolrResourceLoader for directory: '/mnt/ssd/jenkins/workspace/Lucene-Solr-trunk-Linux/checkout/solr/build/solr-core/test-files/solr/'
[junit4:junit4]   2> 275 T2920 oasc.CoreContainer.load Registering Log Listener
[junit4:junit4]   2> 287 T2920 oasc.CoreContainer.create Creating SolrCore 'collection1' using instanceDir: /mnt/ssd/jenkins/workspace/Lucene-Solr-trunk-Linux/checkout/solr/build/solr-core/test-files/solr/collection1
[junit4:junit4]   2> 287 T2920 oasc.SolrResourceLoader.<init> new SolrResourceLoader for directory: '/mnt/ssd/jenkins/workspace/Lucene-Solr-trunk-Linux/checkout/solr/build/solr-core/test-files/solr/collection1/'
[junit4:junit4]   2> 288 T2920 oasc.SolrResourceLoader.replaceClassLoader Adding 'file:/mnt/ssd/jenkins/workspace/Lucene-Solr-trunk-Linux/checkout/solr/build/solr-core/test-files/solr/collection1/lib/README' to classloader
[junit4:junit4]   2> 288 T2920 oasc.SolrResourceLoader.replaceClassLoader Adding 'file:/mnt/ssd/jenkins/workspace/Lucene-Solr-trunk-Linux/checkout/solr/build/solr-core/test-files/solr/collection1/lib/classes/' to classloader
[junit4:junit4]   2> 311 T2920 oasc.SolrConfig.<init> Using Lucene MatchVersion: LUCENE_50
[junit4:junit4]   2> 354 T2920 oasc.SolrConfig.<init> Loaded SolrConfig: solrconfig-elevate.xml
[junit4:junit4]   2> 355 T2920 oass.IndexSchema.readSchema Reading Solr Schema
[junit4:junit4]   2> 357 T2920 oass.IndexSchema.readSchema Schema name=example
[junit4:junit4]   2> 470 T2920 oass.IndexSchema.readSchema default search field in schema is text
[junit4:junit4]   2> 472 T2920 oass.IndexSchema.readSchema unique key field: id
[junit4:junit4]   2> 473 T2920 oasc.SolrCore.<init> [collection1] Opening new SolrCore at /mnt/ssd/jenkins/workspace/Lucene-Solr-trunk-Linux/checkout/solr/build/solr-core/test-files/solr/collection1/, dataDir=./org.apache.solr.handler.component.DistributedQueryElevationComponentTest-1343752254379/shard0/data/
[junit4:junit4]   2> 474 T2920 oasc.JmxMonitoredMap.<init> JMX monitoring is enabled. Adding Solr mbeans to JMX Server: com.sun.jmx.mbeanserver.JmxMBeanServer@5e1dbd0
[junit4:junit4]   2> 474 T2920 oasc.SolrCore.getNewIndexDir WARNING New index directory detected: old=null new=./org.apache.solr.handler.component.DistributedQueryElevationComponentTest-1343752254379/shard0/data/index/
[junit4:junit4]   2> 474 T2920 oasc.SolrCore.initIndex WARNING [collection1] Solr index directory './org.apache.solr.handler.component.DistributedQueryElevationComponentTest-1343752254379/shard0/data/index' doesn't exist. Creating new index...
[junit4:junit4]   2> 475 T2920 oasc.SolrDeletionPolicy.onCommit SolrDeletionPolicy.onCommit: commits:num=1
[junit4:junit4]   2> 		commit{dir=MockDirWrapper(org.apache.lucene.store.RAMDirectory@7a137851 lockFactory=org.apache.lucene.store.SingleInstanceLockFactory@95b5e0f),segFN=segments_1,generation=1,filenames=[segments_1]
[junit4:junit4]   2> 475 T2920 oasc.SolrDeletionPolicy.updateCommits newest commit = 1
[junit4:junit4]   2> 476 T2920 oasc.RequestHandlers.initHandlersFromConfig created /update: solr.UpdateRequestHandler
[junit4:junit4]   2> 477 T2920 oasc.RequestHandlers.initHandlersFromConfig created /elevate: org.apache.solr.handler.component.SearchHandler
[junit4:junit4]   2> 477 T2920 oasc.RequestHandlers.initHandlersFromConfig created /dataElevate: org.apache.solr.handler.component.SearchHandler
[junit4:junit4]   2> 477 T2920 oashl.XMLLoader.init xsltCacheLifetimeSeconds=60
[junit4:junit4]   2> 477 T2920 oasc.RequestHandlers.initHandlersFromConfig WARNING no default request handler is registered (either '/select' or 'standard')
[junit4:junit4]   2> 478 T2920 oasc.SolrCore.initDeprecatedSupport WARNING solrconfig.xml uses deprecated <admin/gettableFiles>, Please update your config to use the ShowFileRequestHandler.
[junit4:junit4]   2> 479 T2920 oasc.SolrCore.initDeprecatedSupport WARNING adding ShowFileRequestHandler with hidden files: [SOLRCONFIG-QUERYSENDER.XML, SOLRCONFIG-SLAVE1.XML, SOLRCONFIG-REQHANDLER.INCL, MISSLEADING.EXTENSION.UPDATEPROCESSOR.JS.TXT, BAD_SOLRCONFIG.XML, SOLRCONFIG-UPDATE-PROCESSOR-CHAINS.XML, SCHEMA12.XML, PROTWORDS.TXT, SOLRCONFIG-TERMINDEX.XML, STOP-1.TXT, BAD-SCHEMA-DUP-DYNAMICFIELD.XML, SCHEMA-DFR.XML, SOLRCONFIG-SPELLCHECKCOMPONENT.XML, SCHEMA.XML, DA_COMPOUNDDICTIONARY.TXT, SOLRCONFIG-MERGEPOLICY.XML, BAD-SCHEMA-NOT-INDEXED-BUT-POS.XML, STEMDICT.TXT, SYNONYMS.TXT, BAD-MP-SOLRCONFIG.XML, TRIVIAL.UPDATEPROCESSOR0.JS, STOPWITHBOM.TXT, SCHEMA-SIM.XML, CONDITIONAL.UPDATEPROCESSOR.JS, SCHEMA-COLLATE.XML, BAD-SCHEMA-NONTEXT-ANALYZER.XML, BAD-SOLRCONFIG-INVALID-SCRIPTFILE.XML, SOLRCONFIG-FUNCTIONQUERY.XML, SCHEMA-NOT-REQUIRED-UNIQUE-KEY.XML, BAD-SCHEMA-UNIQUEKEY-MULTIVALUED.XML, SCHEMA-PHRASESUGGEST.XML, HYPHENATION.DTD, BAD-SCHEMA-OMIT-TF-BUT-NOT-POS.XML, SOLRCONFIG-HIGHLIGHT.XML, SCHEMA15.XML, SOLRCONFIG-NOCACHE.XML, SOLRCONFIG-ELEVATE.XML, SCHEMA-TFIDF.XML, SOLRCONFIG-BASIC.XML, SCHEMA11.XML, SOLRCONFIG-LAZYWRITER.XML, SCHEMASURROUND.XML, MAPPING-ISOLATIN1ACCENT.TXT, BAD-SCHEMA-DUP-FIELDTYPE.XML, SCHEMA-NUMERIC.XML, MISSING.FUNCTIONS.UPDATEPROCESSOR.JS, SOLRCONFIG-REPEATER.XML, BAD-SCHEMA-ANALYZER-CLASS-AND-NESTED.XML, BAD-SOLRCONFIG-MISSING-SCRIPTFILE.XML, STOPWORDS.TXT, BAD-SCHEMA-CODEC-GLOBAL-VS-FT-MISMATCH.XML, SCHEMA_CODEC.XML, SOLRCONFIG-PROPINJECT-INDEXDEFAULT.XML, HUNSPELL-TEST.AFF, KEEP-1.TXT, CURRENCY.XML, SCHEMA-REVERSED.XML, ELEVATE.XML, SOLRCONFIG-SLAVE.XML, BAD-SCHEMA-NOT-INDEXED-BUT-TF.XML, ADDFIELDS.UPDATEPROCESSOR.JS, WDFTYPES.TXT, HUNSPELL-TEST.DIC, STOP-SNOWBALL.TXT, SOLRCONFIG-TRANSFORMERS.XML, SCHEMA-REPLICATION1.XML, SOLRCONFIG-SIMPLELOCK.XML, SOLRCONFIG-MASTER2.XML, SOLRCONFIG-SOLCOREPROPERTIES.XML, SOLRCONFIG-PHRASESUGGEST.XML, SOLRCONFIG-ENABLEPLUGIN.XML, KEEP-2.TXT, BAD-SCHEMA-UNIQUEKEY-IS-COPYFIELD-DEST.XML, SOLRCONFIG-ALTDIRECTORY.XML, STOPTYPES-2.TXT, DA_UTF8.XML, SCHEMA-REQUIRED-FIELDS.XML, STOP-2.TXT, THROW.ERROR.ON.ADD.UPDATEPROCESSOR.JS, BAD-SCHEMA-EXTERNAL-FILEFIELD.XML, SOLRCONFIG-SPELLCHECKER.XML, SOLRCONFIG-PROPINJECT.XML, SCHEMA-MINIMAL.XML, BAD-SCHEMA-UNIQUEKEY-USES-DEFAULT.XML, OLD_SYNONYMS.TXT, TRIVIAL.UPDATEPROCESSOR1.JS, SOLRCONFIG-MASTER3.XML, SOLRCONFIG-TLOG.XML, SCHEMA-IB.XML, PHRASESUGGEST.TXT, OPEN-EXCHANGE-RATES.JSON, SCHEMA-BINARYFIELD.XML, FRENCHARTICLES.TXT, SCHEMA-CHARFILTERS.XML, SCHEMA-SPELLCHECKER.XML, SOLRCONFIG-MASTER.XML, COMPOUNDDICTIONARY.TXT, SCHEMA-TRIE.XML, SCHEMA-LUCENEMATCHVERSION.XML, SOLRCONFIG-SCRIPT-UPDATEPROCESSOR.XML, SCHEMA-LMDIRICHLET.XML, SOLRCONFIG_PERF.XML, BAD-SOLRCONFIG-BOGUS-SCRIPTENGINE-NAME.XML, SCHEMA-STOP-KEEP.XML, SOLRCONFIG-SOLR-749.XML, SOLRCONFIG-QUERYSENDER-NOQUERY.XML, SOLRCONFIG-NATIVELOCK.XML, SOLRCONFIG-MASTER1-KEEPONEBACKUP.XML, XSLT, SCHEMA-LMJELINEKMERCER.XML, SCHEMA-BM25.XML, SOLRCONFIG-MASTER1.XML, SOLRCONFIG-DELPOLICY2.XML, SOLRCONFIG_CODEC.XML, SOLRCONFIG-XINCLUDE.XML, BAD-SCHEMA-SIM-GLOBAL-VS-FT-MISMATCH.XML, SCHEMA-REPLICATION2.XML, SOLRCONFIG-DELPOLICY1.XML, STOPWORDSWRONGENCODING.TXT, STOPTYPES-1.TXT, BAD-SCHEMA-NOT-INDEXED-BUT-NORMS.XML, SCHEMA-COPYFIELD-TEST.XML, SOLRCONFIG-CACHING.XML, BAD-SCHEMA-DUP-FIELD.XML, SCHEMA-FOLDING.XML]
[junit4:junit4]   2> 480 T2920 oass.SolrIndexSearcher.<init> Opening Searcher@de03fea main
[junit4:junit4]   2> 480 T2920 oass.SolrIndexSearcher.getIndexDir WARNING WARNING: Directory impl does not support setting indexDir: org.apache.lucene.store.MockDirectoryWrapper
[junit4:junit4]   2> 481 T2920 oasu.CommitTracker.<init> Hard AutoCommit: disabled
[junit4:junit4]   2> 481 T2920 oasu.CommitTracker.<init> Soft AutoCommit: disabled
[junit4:junit4]   2> 481 T2920 oashc.QueryElevationComponent.inform Loading QueryElevation from: /mnt/ssd/jenkins/workspace/Lucene-Solr-trunk-Linux/checkout/solr/build/solr-core/test-files/solr/collection1/conf/elevate.xml
[junit4:junit4]   2> 487 T2920 oashc.QueryElevationComponent.inform Loading QueryElevation from: /mnt/ssd/jenkins/workspace/Lucene-Solr-trunk-Linux/checkout/solr/build/solr-core/test-files/solr/collection1/conf/elevate.xml
[junit4:junit4]   2> 492 T2920 oashc.HttpShardHandlerFactory.getParameter Setting socketTimeout to: 0
[junit4:junit4]   2> 492 T2920 oashc.HttpShardHandlerFactory.getParameter Setting urlScheme to: http://
[junit4:junit4]   2> 492 T2920 oashc.HttpShardHandlerFactory.getParameter Setting connTimeout to: 0
[junit4:junit4]   2> 493 T2920 oashc.HttpShardHandlerFactory.getParameter Setting maxConnectionsPerHost to: 20
[junit4:junit4]   2> 493 T2920 oashc.HttpShardHandlerFactory.getParameter Setting corePoolSize to: 0
[junit4:junit4]   2> 493 T2920 oashc.HttpShardHandlerFactory.getParameter Setting maximumPoolSize to: 2147483647
[junit4:junit4]   2> 493 T2920 oashc.HttpShardHandlerFactory.getParameter Setting maxThreadIdleTime to: 5
[junit4:junit4]   2> 493 T2920 oashc.HttpShardHandlerFactory.getParameter Setting sizeOfQueue to: -1
[junit4:junit4]   2> 494 T2920 oashc.HttpShardHandlerFactory.getParameter Setting fairnessPolicy to: false
[junit4:junit4]   2> 494 T2920 oascsi.HttpClientUtil.createClient Creating new http client, config:maxConnectionsPerHost=20&maxConnections=10000&socketTimeout=0&connTimeout=0&retry=false
[junit4:junit4]   2> 496 T2940 oasc.SolrCore.registerSearcher [collection1] Registered new searcher Searcher@de03fea main{StandardDirectoryReader(segments_1:1)}
[junit4:junit4]   2> 496 T2920 oasc.CoreContainer.register registering core: collection1
[junit4:junit4]   2> 496 T2920 oass.SolrDispatchFilter.init user.dir=/mnt/ssd/jenkins/workspace/Lucene-Solr-trunk-Linux/checkout/solr/build/solr-core/test/J0
[junit4:junit4]   2> 496 T2920 oass.SolrDispatchFilter.init SolrDispatchFilter.init() done
[junit4:junit4]   2> 496 T2920 oascsi.HttpClientUtil.createClient Creating new http client, config:maxConnections=128&maxConnectionsPerHost=32&followRedirects=false
[junit4:junit4]   2> 499 T2920 oejs.Server.doStart jetty-8.1.2.v20120308
[junit4:junit4]   2> 500 T2920 oejs.AbstractConnector.doStart Started SocketConnector@0.0.0.0:53361
[junit4:junit4]   2> 501 T2920 oasc.SolrResourceLoader.locateSolrHome JNDI not configured for solr (NoInitialContextEx)
[junit4:junit4]   2> 501 T2920 oasc.SolrResourceLoader.locateSolrHome using system property solr.solr.home: /mnt/ssd/jenkins/workspace/Lucene-Solr-trunk-Linux/checkout/solr/build/solr-core/test-files/solr
[junit4:junit4]   2> 501 T2920 oasc.SolrResourceLoader.<init> new SolrResourceLoader for deduced Solr Home: '/mnt/ssd/jenkins/workspace/Lucene-Solr-trunk-Linux/checkout/solr/build/solr-core/test-files/solr/'
[junit4:junit4]   2> 508 T2920 oass.SolrDispatchFilter.init SolrDispatchFilter.init()
[junit4:junit4]   2> 508 T2920 oasc.SolrResourceLoader.locateSolrHome JNDI not configured for solr (NoInitialContextEx)
[junit4:junit4]   2> 508 T2920 oasc.SolrResourceLoader.locateSolrHome using system property solr.solr.home: /mnt/ssd/jenkins/workspace/Lucene-Solr-trunk-Linux/checkout/solr/build/solr-core/test-files/solr
[junit4:junit4]   2> 508 T2920 oasc.CoreContainer$Initializer.initialize looking for solr.xml: /mnt/ssd/jenkins/workspace/Lucene-Solr-trunk-Linux/checkout/solr/build/solr-core/test-files/solr/solr.xml
[junit4:junit4]   2> 509 T2920 oasc.CoreContainer.<init> New CoreContainer 865620992
[junit4:junit4]   2> 509 T2920 oasc.CoreContainer.load Loading CoreContainer using Solr Home: '/mnt/ssd/jenkins/workspace/Lucene-Solr-trunk-Linux/checkout/solr/build/solr-core/test-files/solr/'
[junit4:junit4]   2> 509 T2920 oasc.SolrResourceLoader.<init> new SolrResourceLoader for directory: '/mnt/ssd/jenkins/workspace/Lucene-Solr-trunk-Linux/checkout/solr/build/solr-core/test-files/solr/'
[junit4:junit4]   2> 519 T2920 oasc.CoreContainer.load Registering Log Listener
[junit4:junit4]   2> 529 T2920 oasc.CoreContainer.create Creating SolrCore 'collection1' using instanceDir: /mnt/ssd/jenkins/workspace/Lucene-Solr-trunk-Linux/checkout/solr/build/solr-core/test-files/solr/collection1
[junit4:junit4]   2> 530 T2920 oasc.SolrResourceLoader.<init> new SolrResourceLoader for directory: '/mnt/ssd/jenkins/workspace/Lucene-Solr-trunk-Linux/checkout/solr/build/solr-core/test-files/solr/collection1/'
[junit4:junit4]   2> 530 T2920 oasc.SolrResourceLoader.replaceClassLoader Adding 'file:/mnt/ssd/jenkins/workspace/Lucene-Solr-trunk-Linux/checkout/solr/build/solr-core/test-files/solr/collection1/lib/README' to classloader
[junit4:junit4]   2> 530 T2920 oasc.SolrResourceLoader.replaceClassLoader Adding 'file:/mnt/ssd/jenkins/workspace/Lucene-Solr-trunk-Linux/checkout/solr/build/solr-core/test-files/solr/collection1/lib/classes/' to classloader
[junit4:junit4]   2> 555 T2920 oasc.SolrConfig.<init> Using Lucene MatchVersion: LUCENE_50
[junit4:junit4]   2> 578 T2920 oasc.SolrConfig.<init> Loaded SolrConfig: solrconfig-elevate.xml
[junit4:junit4]   2> 579 T2920 oass.IndexSchema.readSchema Reading Solr Schema
[junit4:junit4]   2> 581 T2920 oass.IndexSchema.readSchema Schema name=example
[junit4:junit4]   2> 694 T2920 oass.IndexSchema.readSchema default search field in schema is text
[junit4:junit4]   2> 696 T2920 oass.IndexSchema.readSchema unique key field: id
[junit4:junit4]   2> 697 T2920 oasc.SolrCore.<init> [collection1] Opening new SolrCore at /mnt/ssd/jenkins/workspace/Lucene-Solr-trunk-Linux/checkout/solr/build/solr-core/test-files/solr/collection1/, dataDir=./org.apache.solr.handler.component.DistributedQueryElevationComponentTest-1343752254379/shard1/data/
[junit4:junit4]   2> 697 T2920 oasc.JmxMonitoredMap.<init> JMX monitoring is enabled. Adding Solr mbeans to JMX Server: com.sun.jmx.mbeanserver.JmxMBeanServer@5e1dbd0
[junit4:junit4]   2> 698 T2920 oasc.SolrCore.getNewIndexDir WARNING New index directory detected: old=null new=./org.apache.solr.handler.component.DistributedQueryElevationComponentTest-1343752254379/shard1/data/index/
[junit4:junit4]   2> 698 T2920 oasc.SolrCore.initIndex WARNING [collection1] Solr index directory './org.apache.solr.handler.component.DistributedQueryElevationComponentTest-1343752254379/shard1/data/index' doesn't exist. Creating new index...
[junit4:junit4]   2> 699 T2920 oasc.SolrDeletionPolicy.onCommit SolrDeletionPolicy.onCommit: commits:num=1
[junit4:junit4]   2> 		commit{dir=MockDirWrapper(org.apache.lucene.store.RAMDirectory@5b2bd508 lockFactory=org.apache.lucene.store.SingleInstanceLockFactory@63356e6c),segFN=segments_1,generation=1,filenames=[segments_1]
[junit4:junit4]   2> 699 T2920 oasc.SolrDeletionPolicy.updateCommits newest commit = 1
[junit4:junit4]   2> 700 T2920 oasc.RequestHandlers.initHandlersFromConfig created /update: solr.UpdateRequestHandler
[junit4:junit4]   2> 700 T2920 oasc.RequestHandlers.initHandlersFromConfig created /elevate: org.apache.solr.handler.component.SearchHandler
[junit4:junit4]   2> 700 T2920 oasc.RequestHandlers.initHandlersFromConfig created /dataElevate: org.apache.solr.handler.component.SearchHandler
[junit4:junit4]   2> 701 T2920 oashl.XMLLoader.init xsltCacheLifetimeSeconds=60
[junit4:junit4]   2> 701 T2920 oasc.RequestHandlers.initHandlersFromConfig WARNING no default request handler is registered (either '/select' or 'standard')
[junit4:junit4]   2> 702 T2920 oasc.SolrCore.initDeprecatedSupport WARNING solrconfig.xml uses deprecated <admin/gettableFiles>, Please update your config to use the ShowFileRequestHandler.
[junit4:junit4]   2> 702 T2920 oasc.SolrCore.initDeprecatedSupport WARNING adding ShowFileRequestHandler with hidden files: [SOLRCONFIG-QUERYSENDER.XML, SOLRCONFIG-SLAVE1.XML, SOLRCONFIG-REQHANDLER.INCL, MISSLEADING.EXTENSION.UPDATEPROCESSOR.JS.TXT, BAD_SOLRCONFIG.XML, SOLRCONFIG-UPDATE-PROCESSOR-CHAINS.XML, SCHEMA12.XML, PROTWORDS.TXT, SOLRCONFIG-TERMINDEX.XML, STOP-1.TXT, BAD-SCHEMA-DUP-DYNAMICFIELD.XML, SCHEMA-DFR.XML, SOLRCONFIG-SPELLCHECKCOMPONENT.XML, SCHEMA.XML, DA_COMPOUNDDICTIONARY.TXT, SOLRCONFIG-MERGEPOLICY.XML, BAD-SCHEMA-NOT-INDEXED-BUT-POS.XML, STEMDICT.TXT, SYNONYMS.TXT, BAD-MP-SOLRCONFIG.XML, TRIVIAL.UPDATEPROCESSOR0.JS, STOPWITHBOM.TXT, SCHEMA-SIM.XML, CONDITIONAL.UPDATEPROCESSOR.JS, SCHEMA-COLLATE.XML, BAD-SCHEMA-NONTEXT-ANALYZER.XML, BAD-SOLRCONFIG-INVALID-SCRIPTFILE.XML, SOLRCONFIG-FUNCTIONQUERY.XML, SCHEMA-NOT-REQUIRED-UNIQUE-KEY.XML, BAD-SCHEMA-UNIQUEKEY-MULTIVALUED.XML, SCHEMA-PHRASESUGGEST.XML, HYPHENATION.DTD, BAD-SCHEMA-OMIT-TF-BUT-NOT-POS.XML, SOLRCONFIG-HIGHLIGHT.XML, SCHEMA15.XML, SOLRCONFIG-NOCACHE.XML, SOLRCONFIG-ELEVATE.XML, SCHEMA-TFIDF.XML, SOLRCONFIG-BASIC.XML, SCHEMA11.XML, SOLRCONFIG-LAZYWRITER.XML, SCHEMASURROUND.XML, MAPPING-ISOLATIN1ACCENT.TXT, BAD-SCHEMA-DUP-FIELDTYPE.XML, SCHEMA-NUMERIC.XML, MISSING.FUNCTIONS.UPDATEPROCESSOR.JS, SOLRCONFIG-REPEATER.XML, BAD-SCHEMA-ANALYZER-CLASS-AND-NESTED.XML, BAD-SOLRCONFIG-MISSING-SCRIPTFILE.XML, STOPWORDS.TXT, BAD-SCHEMA-CODEC-GLOBAL-VS-FT-MISMATCH.XML, SCHEMA_CODEC.XML, SOLRCONFIG-PROPINJECT-INDEXDEFAULT.XML, HUNSPELL-TEST.AFF, KEEP-1.TXT, CURRENCY.XML, SCHEMA-REVERSED.XML, ELEVATE.XML, SOLRCONFIG-SLAVE.XML, BAD-SCHEMA-NOT-INDEXED-BUT-TF.XML, ADDFIELDS.UPDATEPROCESSOR.JS, WDFTYPES.TXT, HUNSPELL-TEST.DIC, STOP-SNOWBALL.TXT, SOLRCONFIG-TRANSFORMERS.XML, SCHEMA-REPLICATION1.XML, SOLRCONFIG-SIMPLELOCK.XML, SOLRCONFIG-MASTER2.XML, SOLRCONFIG-SOLCOREPROPERTIES.XML, SOLRCONFIG-PHRASESUGGEST.XML, SOLRCONFIG-ENABLEPLUGIN.XML, KEEP-2.TXT, BAD-SCHEMA-UNIQUEKEY-IS-COPYFIELD-DEST.XML, SOLRCONFIG-ALTDIRECTORY.XML, STOPTYPES-2.TXT, DA_UTF8.XML, SCHEMA-REQUIRED-FIELDS.XML, STOP-2.TXT, THROW.ERROR.ON.ADD.UPDATEPROCESSOR.JS, BAD-SCHEMA-EXTERNAL-FILEFIELD.XML, SOLRCONFIG-SPELLCHECKER.XML, SOLRCONFIG-PROPINJECT.XML, SCHEMA-MINIMAL.XML, BAD-SCHEMA-UNIQUEKEY-USES-DEFAULT.XML, OLD_SYNONYMS.TXT, TRIVIAL.UPDATEPROCESSOR1.JS, SOLRCONFIG-MASTER3.XML, SOLRCONFIG-TLOG.XML, SCHEMA-IB.XML, PHRASESUGGEST.TXT, OPEN-EXCHANGE-RATES.JSON, SCHEMA-BINARYFIELD.XML, FRENCHARTICLES.TXT, SCHEMA-CHARFILTERS.XML, SCHEMA-SPELLCHECKER.XML, SOLRCONFIG-MASTER.XML, COMPOUNDDICTIONARY.TXT, SCHEMA-TRIE.XML, SCHEMA-LUCENEMATCHVERSION.XML, SOLRCONFIG-SCRIPT-UPDATEPROCESSOR.XML, SCHEMA-LMDIRICHLET.XML, SOLRCONFIG_PERF.XML, BAD-SOLRCONFIG-BOGUS-SCRIPTENGINE-NAME.XML, SCHEMA-STOP-KEEP.XML, SOLRCONFIG-SOLR-749.XML, SOLRCONFIG-QUERYSENDER-NOQUERY.XML, SOLRCONFIG-NATIVELOCK.XML, SOLRCONFIG-MASTER1-KEEPONEBACKUP.XML, XSLT, SCHEMA-LMJELINEKMERCER.XML, SCHEMA-BM25.XML, SOLRCONFIG-MASTER1.XML, SOLRCONFIG-DELPOLICY2.XML, SOLRCONFIG_CODEC.XML, SOLRCONFIG-XINCLUDE.XML, BAD-SCHEMA-SIM-GLOBAL-VS-FT-MISMATCH.XML, SCHEMA-REPLICATION2.XML, SOLRCONFIG-DELPOLICY1.XML, STOPWORDSWRONGENCODING.TXT, STOPTYPES-1.TXT, BAD-SCHEMA-NOT-INDEXED-BUT-NORMS.XML, SCHEMA-COPYFIELD-TEST.XML, SOLRCONFIG-CACHING.XML, BAD-SCHEMA-DUP-FIELD.XML, SCHEMA-FOLDING.XML]
[junit4:junit4]   2> 704 T2920 oass.SolrIndexSearcher.<init> Opening Searcher@67cf6f4b main
[junit4:junit4]   2> 704 T2920 oass.SolrIndexSearcher.getIndexDir WARNING WARNING: Directory impl does not support setting indexDir: org.apache.lucene.store.MockDirectoryWrapper
[junit4:junit4]   2> 704 T2920 oasu.CommitTracker.<init> Hard AutoCommit: disabled
[junit4:junit4]   2> 705 T2920 oasu.CommitTracker.<init> Soft AutoCommit: disabled
[junit4:junit4]   2> 705 T2920 oashc.QueryElevationComponent.inform Loading QueryElevation from: /mnt/ssd/jenkins/workspace/Lucene-Solr-trunk-Linux/checkout/solr/build/solr-core/test-files/solr/collection1/conf/elevate.xml
[junit4:junit4]   2> 710 T2920 oashc.QueryElevationComponent.inform Loading QueryElevation from: /mnt/ssd/jenkins/workspace/Lucene-Solr-trunk-Linux/checkout/solr/build/solr-core/test-files/solr/collection1/conf/elevate.xml
[junit4:junit4]   2> 714 T2920 oashc.HttpShardHandlerFactory.getParameter Setting socketTimeout to: 0
[junit4:junit4]   2> 715 T2920 oashc.HttpShardHandlerFactory.getParameter Setting urlScheme to: http://
[junit4:junit4]   2> 715 T2920 oashc.HttpShardHandlerFactory.getParameter Setting connTimeout to: 0
[junit4:junit4]   2> 715 T2920 oashc.HttpShardHandlerFactory.getParameter Setting maxConnectionsPerHost to: 20
[junit4:junit4]   2> 715 T2920 oashc.HttpShardHandlerFactory.getParameter Setting corePoolSize to: 0
[junit4:junit4]   2> 716 T2920 oashc.HttpShardHandlerFactory.getParameter Setting maximumPoolSize to: 2147483647
[junit4:junit4]   2> 716 T2920 oashc.HttpShardHandlerFactory.getParameter Setting maxThreadIdleTime to: 5
[junit4:junit4]   2> 716 T2920 oashc.HttpShardHandlerFactory.getParameter Setting sizeOfQueue to: -1
[junit4:junit4]   2> 716 T2920 oashc.HttpShardHandlerFactory.getParameter Setting fairnessPolicy to: false
[junit4:junit4]   2> 716 T2920 oascsi.HttpClientUtil.createClient Creating new http client, config:maxConnectionsPerHost=20&maxConnections=10000&socketTimeout=0&connTimeout=0&retry=false
[junit4:junit4]   2> 718 T2950 oasc.SolrCore.registerSearcher [collection1] Registered new searcher Searcher@67cf6f4b main{StandardDirectoryReader(segments_1:1)}
[junit4:junit4]   2> 718 T2920 oasc.CoreContainer.register registering core: collection1
[junit4:junit4]   2> 719 T2920 oass.SolrDispatchFilter.init user.dir=/mnt/ssd/jenkins/workspace/Lucene-Solr-trunk-Linux/checkout/solr/build/solr-core/test/J0
[junit4:junit4]   2> 719 T2920 oass.SolrDispatchFilter.init SolrDispatchFilter.init() done
[junit4:junit4]   2> 719 T2920 oascsi.HttpClientUtil.createClient Creating new http client, config:maxConnections=128&maxConnectionsPerHost=32&followRedirects=false
[junit4:junit4]   2> 721 T2920 oejs.Server.doStart jetty-8.1.2.v20120308
[junit4:junit4]   2> 722 T2920 oejs.AbstractConnector.doStart Started SocketConnector@0.0.0.0:51436
[junit4:junit4]   2> 723 T2920 oasc.SolrResourceLoader.locateSolrHome JNDI not configured for solr (NoInitialContextEx)
[junit4:junit4]   2> 723 T2920 oasc.SolrResourceLoader.locateSolrHome using system property solr.solr.home: /mnt/ssd/jenkins/workspace/Lucene-Solr-trunk-Linux/checkout/solr/build/solr-core/test-files/solr
[junit4:junit4]   2> 723 T2920 oasc.SolrResourceLoader.<init> new SolrResourceLoader for deduced Solr Home: '/mnt/ssd/jenkins/workspace/Lucene-Solr-trunk-Linux/checkout/solr/build/solr-core/test-files/solr/'
[junit4:junit4]   2> 729 T2920 oass.SolrDispatchFilter.init SolrDispatchFilter.init()
[junit4:junit4]   2> 729 T2920 oasc.SolrResourceLoader.locateSolrHome JNDI not configured for solr (NoInitialContextEx)
[junit4:junit4]   2> 729 T2920 oasc.SolrResourceLoader.locateSolrHome using system property solr.solr.home: /mnt/ssd/jenkins/workspace/Lucene-Solr-trunk-Linux/checkout/solr/build/solr-core/test-files/solr
[junit4:junit4]   2> 729 T2920 oasc.CoreContainer$Initializer.initialize looking for solr.xml: /mnt/ssd/jenkins/workspace/Lucene-Solr-trunk-Linux/checkout/solr/build/solr-core/test-files/solr/solr.xml
[junit4:junit4]   2> 730 T2920 oasc.CoreContainer.<init> New CoreContainer 833017317
[junit4:junit4]   2> 730 T2920 oasc.CoreContainer.load Loading CoreContainer using Solr Home: '/mnt/ssd/jenkins/workspace/Lucene-Solr-trunk-Linux/checkout/solr/build/solr-core/test-files/solr/'
[junit4:junit4]   2> 730 T2920 oasc.SolrResourceLoader.<init> new SolrResourceLoader for directory: '/mnt/ssd/jenkins/workspace/Lucene-Solr-trunk-Linux/checkout/solr/build/solr-core/test-files/solr/'
[junit4:junit4]   2> 737 T2920 oasc.CoreContainer.load Registering Log Listener
[junit4:junit4]   2> 755 T2920 oasc.CoreContainer.create Creating SolrCore 'collection1' using instanceDir: /mnt/ssd/jenkins/workspace/Lucene-Solr-trunk-Linux/checkout/solr/build/solr-core/test-files/solr/collection1
[junit4:junit4]   2> 755 T2920 oasc.SolrResourceLoader.<init> new SolrResourceLoader for directory: '/mnt/ssd/jenkins/workspace/Lucene-Solr-trunk-Linux/checkout/solr/build/solr-core/test-files/solr/collection1/'
[junit4:junit4]   2> 756 T2920 oasc.SolrResourceLoader.replaceClassLoader Adding 'file:/mnt/ssd/jenkins/workspace/Lucene-Solr-trunk-Linux/checkout/solr/build/solr-core/test-files/solr/collection1/lib/README' to classloader
[junit4:junit4]   2> 756 T2920 oasc.SolrResourceLoader.replaceClassLoader Adding 'file:/mnt/ssd/jenkins/workspace/Lucene-Solr-trunk-Linux/checkout/solr/build/solr-core/test-files/solr/collection1/lib/classes/' to classloader
[junit4:junit4]   2> 771 T2920 oasc.SolrConfig.<init> Using Lucene MatchVersion: LUCENE_50
[junit4:junit4]   2> 800 T2920 oasc.SolrConfig.<init> Loaded SolrConfig: solrconfig-elevate.xml
[junit4:junit4]   2> 800 T2920 oass.IndexSchema.readSchema Reading Solr Schema
[junit4:junit4]   2> 802 T2920 oass.IndexSchema.readSchema Schema name=example
[junit4:junit4]   2> 921 T2920 oass.IndexSchema.readSchema default search field in schema is text
[junit4:junit4]   2> 922 T2920 oass.IndexSchema.readSchema unique key field: id
[junit4:junit4]   2> 924 T2920 oasc.SolrCore.<init> [collection1] Opening new SolrCore at /mnt/ssd/jenkins/workspace/Lucene-Solr-trunk-Linux/checkout/solr/build/solr-core/test-files/solr/collection1/, dataDir=./org.apache.solr.handler.component.DistributedQueryElevationComponentTest-1343752254379/shard2/data/
[junit4:junit4]   2> 925 T2920 oasc.JmxMonitoredMap.<init> JMX monitoring is enabled. Adding Solr mbeans to JMX Server: com.sun.jmx.mbeanserver.JmxMBeanServer@5e1dbd0
[junit4:junit4]   2> 925 T2920 oasc.SolrCore.getNewIndexDir WARNING New index directory detected: old=null new=./org.apache.solr.handler.component.DistributedQueryElevationComponentTest-1343752254379/shard2/data/index/
[junit4:junit4]   2> 926 T2920 oasc.SolrCore.initIndex WARNING [collection1] Solr index directory './org.apache.solr.handler.component.DistributedQueryElevationComponentTest-1343752254379/shard2/data/index' doesn't exist. Creating new index...
[junit4:junit4]   2> 927 T2920 oasc.SolrDeletionPolicy.onCommit SolrDeletionPolicy.onCommit: commits:num=1
[junit4:junit4]   2> 		commit{dir=MockDirWrapper(org.apache.lucene.store.RAMDirectory@4b77fee6 lockFactory=org.apache.lucene.store.SingleInstanceLockFactory@39e861c1),segFN=segments_1,generation=1,filenames=[segments_1]
[junit4:junit4]   2> 927 T2920 oasc.SolrDeletionPolicy.updateCommits newest commit = 1
[junit4:junit4]   2> 928 T2920 oasc.RequestHandlers.initHandlersFromConfig created /update: solr.UpdateRequestHandler
[junit4:junit4]   2> 928 T2920 oasc.RequestHandlers.initHandlersFromConfig created /elevate: org.apache.solr.handler.component.SearchHandler
[junit4:junit4]   2> 929 T2920 oasc.RequestHandlers.initHandlersFromConfig created /dataElevate: org.apache.solr.handler.component.SearchHandler
[junit4:junit4]   2> 929 T2920 oashl.XMLLoader.init xsltCacheLifetimeSeconds=60
[junit4:junit4]   2> 930 T2920 oasc.RequestHandlers.initHandlersFromConfig WARNING no default request handler is registered (either '/select' or 'standard')
[junit4:junit4]   2> 930 T2920 oasc.SolrCore.initDeprecatedSupport WARNING solrconfig.xml uses deprecated <admin/gettableFiles>, Please update your config to use the ShowFileRequestHandler.
[junit4:junit4]   2> 931 T2920 oasc.SolrCore.initDeprecatedSupport WARNING adding ShowFileRequestHandler with hidden files: [SOLRCONFIG-QUERYSENDER.XML, SOLRCONFIG-SLAVE1.XML, SOLRCONFIG-REQHANDLER.INCL, MISSLEADING.EXTENSION.UPDATEPROCESSOR.JS.TXT, BAD_SOLRCONFIG.XML, SOLRCONFIG-UPDATE-PROCESSOR-CHAINS.XML, SCHEMA12.XML, PROTWORDS.TXT, SOLRCONFIG-TERMINDEX.XML, STOP-1.TXT, BAD-SCHEMA-DUP-DYNAMICFIELD.XML, SCHEMA-DFR.XML, SOLRCONFIG-SPELLCHECKCOMPONENT.XML, SCHEMA.XML, DA_COMPOUNDDICTIONARY.TXT, SOLRCONFIG-MERGEPOLICY.XML, BAD-SCHEMA-NOT-INDEXED-BUT-POS.XML, STEMDICT.TXT, SYNONYMS.TXT, BAD-MP-SOLRCONFIG.XML, TRIVIAL.UPDATEPROCESSOR0.JS, STOPWITHBOM.TXT, SCHEMA-SIM.XML, CONDITIONAL.UPDATEPROCESSOR.JS, SCHEMA-COLLATE.XML, BAD-SCHEMA-NONTEXT-ANALYZER.XML, BAD-SOLRCONFIG-INVALID-SCRIPTFILE.XML, SOLRCONFIG-FUNCTIONQUERY.XML, SCHEMA-NOT-REQUIRED-UNIQUE-KEY.XML, BAD-SCHEMA-UNIQUEKEY-MULTIVALUED.XML, SCHEMA-PHRASESUGGEST.XML, HYPHENATION.DTD, BAD-SCHEMA-OMIT-TF-BUT-NOT-POS.XML, SOLRCONFIG-HIGHLIGHT.XML, SCHEMA15.XML, SOLRCONFIG-NOCACHE.XML, SOLRCONFIG-ELEVATE.XML, SCHEMA-TFIDF.XML, SOLRCONFIG-BASIC.XML, SCHEMA11.XML, SOLRCONFIG-LAZYWRITER.XML, SCHEMASURROUND.XML, MAPPING-ISOLATIN1ACCENT.TXT, BAD-SCHEMA-DUP-FIELDTYPE.XML, SCHEMA-NUMERIC.XML, MISSING.FUNCTIONS.UPDATEPROCESSOR.JS, SOLRCONFIG-REPEATER.XML, BAD-SCHEMA-ANALYZER-CLASS-AND-NESTED.XML, BAD-SOLRCONFIG-MISSING-SCRIPTFILE.XML, STOPWORDS.TXT, BAD-SCHEMA-CODEC-GLOBAL-VS-FT-MISMATCH.XML, SCHEMA_CODEC.XML, SOLRCONFIG-PROPINJECT-INDEXDEFAULT.XML, HUNSPELL-TEST.AFF, KEEP-1.TXT, CURRENCY.XML, SCHEMA-REVERSED.XML, ELEVATE.XML, SOLRCONFIG-SLAVE.XML, BAD-SCHEMA-NOT-INDEXED-BUT-TF.XML, ADDFIELDS.UPDATEPROCESSOR.JS, WDFTYPES.TXT, HUNSPELL-TEST.DIC, STOP-SNOWBALL.TXT, SOLRCONFIG-TRANSFORMERS.XML, SCHEMA-REPLICATION1.XML, SOLRCONFIG-SIMPLELOCK.XML, SOLRCONFIG-MASTER2.XML, SOLRCONFIG-SOLCOREPROPERTIES.XML, SOLRCONFIG-PHRASESUGGEST.XML, SOLRCONFIG-ENABLEPLUGIN.XML, KEEP-2.TXT, BAD-SCHEMA-UNIQUEKEY-IS-COPYFIELD-DEST.XML, SOLRCONFIG-ALTDIRECTORY.XML, STOPTYPES-2.TXT, DA_UTF8.XML, SCHEMA-REQUIRED-FIELDS.XML, STOP-2.TXT, THROW.ERROR.ON.ADD.UPDATEPROCESSOR.JS, BAD-SCHEMA-EXTERNAL-FILEFIELD.XML, SOLRCONFIG-SPELLCHECKER.XML, SOLRCONFIG-PROPINJECT.XML, SCHEMA-MINIMAL.XML, BAD-SCHEMA-UNIQUEKEY-USES-DEFAULT.XML, OLD_SYNONYMS.TXT, TRIVIAL.UPDATEPROCESSOR1.JS, SOLRCONFIG-MASTER3.XML, SOLRCONFIG-TLOG.XML, SCHEMA-IB.XML, PHRASESUGGEST.TXT, OPEN-EXCHANGE-RATES.JSON, SCHEMA-BINARYFIELD.XML, FRENCHARTICLES.TXT, SCHEMA-CHARFILTERS.XML, SCHEMA-SPELLCHECKER.XML, SOLRCONFIG-MASTER.XML, COMPOUNDDICTIONARY.TXT, SCHEMA-TRIE.XML, SCHEMA-LUCENEMATCHVERSION.XML, SOLRCONFIG-SCRIPT-UPDATEPROCESSOR.XML, SCHEMA-LMDIRICHLET.XML, SOLRCONFIG_PERF.XML, BAD-SOLRCONFIG-BOGUS-SCRIPTENGINE-NAME.XML, SCHEMA-STOP-KEEP.XML, SOLRCONFIG-SOLR-749.XML, SOLRCONFIG-QUERYSENDER-NOQUERY.XML, SOLRCONFIG-NATIVELOCK.XML, SOLRCONFIG-MASTER1-KEEPONEBACKUP.XML, XSLT, SCHEMA-LMJELINEKMERCER.XML, SCHEMA-BM25.XML, SOLRCONFIG-MASTER1.XML, SOLRCONFIG-DELPOLICY2.XML, SOLRCONFIG_CODEC.XML, SOLRCONFIG-XINCLUDE.XML, BAD-SCHEMA-SIM-GLOBAL-VS-FT-MISMATCH.XML, SCHEMA-REPLICATION2.XML, SOLRCONFIG-DELPOLICY1.XML, STOPWORDSWRONGENCODING.TXT, STOPTYPES-1.TXT, BAD-SCHEMA-NOT-INDEXED-BUT-NORMS.XML, SCHEMA-COPYFIELD-TEST.XML, SOLRCONFIG-CACHING.XML, BAD-SCHEMA-DUP-FIELD.XML, SCHEMA-FOLDING.XML]
[junit4:junit4]   2> 933 T2920 oass.SolrIndexSearcher.<init> Opening Searcher@109fb716 main
[junit4:junit4]   2> 933 T2920 oass.SolrIndexSearcher.getIndexDir WARNING WARNING: Directory impl does not support setting indexDir: org.apache.lucene.store.MockDirectoryWrapper
[junit4:junit4]   2> 933 T2920 oasu.CommitTracker.<init> Hard AutoCommit: disabled
[junit4:junit4]   2> 933 T2920 oasu.CommitTracker.<init> Soft AutoCommit: disabled
[junit4:junit4]   2> 934 T2920 oashc.QueryElevationComponent.inform Loading QueryElevation from: /mnt/ssd/jenkins/workspace/Lucene-Solr-trunk-Linux/checkout/solr/build/solr-core/test-files/solr/collection1/conf/elevate.xml
[junit4:junit4]   2> 938 T2920 oashc.QueryElevationComponent.inform Loading QueryElevation from: /mnt/ssd/jenkins/workspace/Lucene-Solr-trunk-Linux/checkout/solr/build/solr-core/test-files/solr/collection1/conf/elevate.xml
[junit4:junit4]   2> 954 T2920 oashc.HttpShardHandlerFactory.getParameter Setting socketTimeout to: 0
[junit4:junit4]   2> 954 T2920 oashc.HttpShardHandlerFactory.getParameter Setting urlScheme to: http://
[junit4:junit4]   2> 954 T2920 oashc.HttpShardHandlerFactory.getParameter Setting connTimeout to: 0
[junit4:junit4]   2> 954 T2920 oashc.HttpShardHandlerFactory.getParameter Setting maxConnectionsPerHost to: 20
[junit4:junit4]   2> 955 T2920 oashc.HttpShardHandlerFactory.getParameter Setting corePoolSize to: 0
[junit4:junit4]   2> 955 T2920 oashc.HttpShardHandlerFactory.getParameter Setting maximumPoolSize to: 2147483647
[junit4:junit4]   2> 955 T2920 oashc.HttpShardHandlerFactory.getParameter Setting maxThreadIdleTime to: 5
[junit4:junit4]   2> 955 T2920 oashc.HttpShardHandlerFactory.getParameter Setting sizeOfQueue to: -1
[junit4:junit4]   2> 955 T2920 oashc.HttpShardHandlerFactory.getParameter Setting fairnessPolicy to: false
[junit4:junit4]   2> 956 T2920 oascsi.HttpClientUtil.createClient Creating new http client, config:maxConnectionsPerHost=20&maxConnections=10000&socketTimeout=0&connTimeout=0&retry=false
[junit4:junit4]   2> 957 T2960 oasc.SolrCore.registerSearcher [collection1] Registered new searcher Searcher@109fb716 main{StandardDirectoryReader(segments_1:1)}
[junit4:junit4]   2> 957 T2920 oasc.CoreContainer.register registering core: collection1
[junit4:junit4]   2> 958 T2920 oass.SolrDispatchFilter.init user.dir=/mnt/ssd/jenkins/workspace/Lucene-Solr-trunk-Linux/checkout/solr/build/solr-core/test/J0
[junit4:junit4]   2> 958 T2920 oass.SolrDispatchFilter.init SolrDispatchFilter.init() done
[junit4:junit4]   2> 958 T2920 oascsi.HttpClientUtil.createClient Creating new http client, config:maxConnections=128&maxConnectionsPerHost=32&followRedirects=false
[junit4:junit4]   2> ASYNC  NEW_CORE C171 name=collection1 org.apache.solr.core.SolrCore@5942d576
[junit4:junit4]   2> 964 T2923 C171 oasu.DirectUpdateHandler2.deleteAll [collection1] REMOVING ALL DOCUMENTS FROM INDEX
[junit4:junit4]   2> 964 T2923 C171 oasc.SolrDeletionPolicy.onInit SolrDeletionPolicy.onInit: commits:num=1
[junit4:junit4]   2> 		commit{dir=BaseDirectoryWrapper(org.apache.lucene.store.RAMDirectory@32cc63c2 lockFactory=org.apache.lucene.store.SingleInstanceLockFactory@8a96f9c),segFN=segments_1,generation=1,filenames=[segments_1]
[junit4:junit4]   2> 965 T2923 C171 oasc.SolrDeletionPolicy.updateCommits newest commit = 1
[junit4:junit4]   2> 965 T2923 C171 UPDATE [collection1] webapp=/solr path=/update params={wt=javabin&version=2} {deleteByQuery=*:*} 0 2
[junit4:junit4]   2> ASYNC  NEW_CORE C172 name=collection1 org.apache.solr.core.SolrCore@252a44ee
[junit4:junit4]   2> 969 T2933 C172 oasu.DirectUpdateHandler2.deleteAll [collection1] REMOVING ALL DOCUMENTS FROM INDEX
[junit4:junit4]   2> 970 T2933 C172 oasc.SolrDeletionPolicy.onInit SolrDeletionPolicy.onInit: commits:num=1
[junit4:junit4]   2> 		commit{dir=MockDirWrapper(org.apache.lucene.store.RAMDirectory@7a137851 lockFactory=org.apache.lucene.store.SingleInstanceLockFactory@95b5e0f),segFN=segments_1,generation=1,filenames=[segments_1]
[junit4:junit4]   2> 971 T2933 C172 oasc.SolrDeletionPolicy.updateCommits newest commit = 1
[junit4:junit4]   2> 971 T2933 C172 UPDATE [collection1] webapp=/solr path=/update params={wt=javabin&version=2} {deleteByQuery=*:*} 0 2
[junit4:junit4]   2> ASYNC  NEW_CORE C173 name=collection1 org.apache.solr.core.SolrCore@372cc0e4
[junit4:junit4]   2> 975 T2943 C173 oasu.DirectUpdateHandler2.deleteAll [collection1] REMOVING ALL DOCUMENTS FROM INDEX
[junit4:junit4]   2> 976 T2943 C173 oasc.SolrDeletionPolicy.onInit SolrDeletionPolicy.onInit: commits:num=1
[junit4:junit4]   2> 		commit{dir=MockDirWrapper(org.apache.lucene.store.RAMDirectory@5b2bd508 lockFactory=org.apache.lucene.store.SingleInstanceLockFactory@63356e6c),segFN=segments_1,generation=1,filenames=[segments_1]
[junit4:junit4]   2> 976 T2943 C173 oasc.SolrDeletionPolicy.updateCommits newest commit = 1
[junit4:junit4]   2> 977 T2943 C173 UPDATE [collection1] webapp=/solr path=/update params={wt=javabin&version=2} {deleteByQuery=*:*} 0 3
[junit4:junit4]   2> ASYNC  NEW_CORE C174 name=collection1 org.apache.solr.core.SolrCore@6e4461e8
[junit4:junit4]   2> 980 T2953 C174 oasu.DirectUpdateHandler2.deleteAll [collection1] REMOVING ALL DOCUMENTS FROM INDEX
[junit4:junit4]   2> 980 T2953 C174 oasc.SolrDeletionPolicy.onInit SolrDeletionPolicy.onInit: commits:num=1
[junit4:junit4]   2> 		commit{dir=MockDirWrapper(org.apache.lucene.store.RAMDirectory@4b77fee6 lockFactory=org.apache.lucene.store.SingleInstanceLockFactory@39e861c1),segFN=segments_1,generation=1,filenames=[segments_1]
[junit4:junit4]   2> 981 T2953 C174 oasc.SolrDeletionPolicy.updateCommits newest commit = 1
[junit4:junit4]   2> 981 T2953 C174 UPDATE [collection1] webapp=/solr path=/update params={wt=javabin&version=2} {deleteByQuery=*:*} 0 2
[junit4:junit4]   2> 983 T2923 C171 UPDATE [collection1] webapp=/solr path=/update params={wt=javabin&version=2} {add=[1]} 0 0
[junit4:junit4]   2> 985 T2933 C172 UPDATE [collection1] webapp=/solr path=/update params={wt=javabin&version=2} {add=[1]} 0 0
[junit4:junit4]   2> 987 T2923 C171 UPDATE [collection1] webapp=/solr path=/update params={wt=javabin&version=2} {add=[2]} 0 0
[junit4:junit4]   2> 990 T2943 C173 UPDATE [collection1] webapp=/solr path=/update params={wt=javabin&version=2} {add=[2]} 0 1
[junit4:junit4]   2> 991 T2923 C171 UPDATE [collection1] webapp=/solr path=/update params={wt=javabin&version=2} {add=[3]} 0 0
[junit4:junit4]   2> 993 T2953 C174 UPDATE [collection1] webapp=/solr path=/update params={wt=javabin&version=2} {add=[3]} 0 0
[junit4:junit4]   2> 995 T2923 C171 UPDATE [collection1] webapp=/solr path=/update params={wt=javabin&version=2} {add=[4]} 0 0
[junit4:junit4]   2> 997 T2933 C172 UPDATE [collection1] webapp=/solr path=/update params={wt=javabin&version=2} {add=[4]} 0 0
[junit4:junit4]   2> 999 T2923 C171 UPDATE [collection1] webapp=/solr path=/update params={wt=javabin&version=2} {add=[5]} 0 0
[junit4:junit4]   2> 1001 T2943 C173 UPDATE [collection1] webapp=/solr path=/update params={wt=javabin&version=2} {add=[5]} 0 1
[junit4:junit4]   2> 1002 T2923 C171 UPDATE [collection1] webapp=/solr path=/update params={wt=javabin&version=2} {add=[6]} 0 0
[junit4:junit4]   2> 1004 T2953 C174 UPDATE [collection1] webapp=/solr path=/update params={wt=javabin&version=2} {add=[6]} 0 0
[junit4:junit4]   2> 1007 T2923 C171 UPDATE [collection1] webapp=/solr path=/update params={wt=javabin&version=2} {add=[7]} 0 1
[junit4:junit4]   2> 1009 T2953 C174 UPDATE [collection1] webapp=/solr path=/update params={wt=javabin&version=2} {add=[7]} 0 0
[junit4:junit4]   2> 1012 T2923 C171 oasu.DirectUpdateHandler2.commit start commit{flags=0,_version_=0,optimize=false,openSearcher=true,waitSearcher=true,expungeDeletes=false,softCommit=false}
[junit4:junit4]   2> 1013 T2923 C171 oasc.SolrDeletionPolicy.onCommit SolrDeletionPolicy.onCommit: commits:num=2
[junit4:junit4]   2> 		commit{dir=BaseDirectoryWrapper(org.apache.lucene.store.RAMDirectory@32cc63c2 lockFactory=org.apache.lucene.store.SingleInstanceLockFactory@8a96f9c),segFN=segments_1,generation=1,filenames=[segments_1]
[junit4:junit4]   2> 		commit{dir=BaseDirectoryWrapper(org.apache.lucene.store.RAMDirectory@32cc63c2 lockFactory=org.apache.lucene.store.SingleInstanceLockFactory@8a96f9c),segFN=segments_2,generation=2,filenames=[_0_Lucene40_0.tip, _0_MockRandom_0.frq, _0_MockRandom_0.tim, _0_MockRandom_0.doc, _0_Lucene40_0.frq, _0_Lucene40_0.tim, _0.fnm, _0_nrm.cfs, _0_nrm.cfe, _0_Lucene40_0.prx, _0.fdx, _0_MockRandom_0.skp, _0_MockRandom_0.pyl, _0.fdt, _0.si, _0_MockRandom_0.pos, _0_MockRandom_0.tip, _0_MockRandom_0.sd, segments_2]
[junit4:junit4]   2> 1013 T2923 C171 oasc.SolrDeletionPolicy.updateCommits newest commit = 2
[junit4:junit4]   2> 1014 T2923 C171 oass.SolrIndexSearcher.<init> Opening Searcher@545824b6 main
[junit4:junit4]   2> 1014 T2923 C171 oass.SolrIndexSearcher.getIndexDir WARNING WARNING: Directory impl does not support setting indexDir: org.apache.lucene.store.BaseDirectoryWrapper
[junit4:junit4]   2> 1014 T2923 C171 oasu.DirectUpdateHandler2.commit end_commit_flush
[junit4:junit4]   2> 1014 T2930 oasc.SolrCore.registerSearcher [collection1] Registered new searcher Searcher@545824b6 main{StandardDirectoryReader(segments_2:4 _0(5.0):C7)}
[junit4:junit4]   2> 1015 T2923 C171 UPDATE [collection1] webapp=/solr path=/update params={softCommit=false&commit=true&version=2&waitSearcher=true&wt=javabin} {commit=} 0 4
[junit4:junit4]   2> 1018 T2933 C172 oasu.DirectUpdateHandler2.commit start commit{flags=0,_version_=0,optimize=false,openSearcher=true,waitSearcher=true,expungeDeletes=false,softCommit=false}
[junit4:junit4]   2> 1020 T2933 C172 oasc.SolrDeletionPolicy.onCommit SolrDeletionPolicy.onCommit: commits:num=2
[junit4:junit4]   2> 		commit{dir=MockDirWrapper(org.apache.lucene.store.RAMDirectory@7a137851 lockFactory=org.apache.lucene.store.SingleInstanceLockFactory@95b5e0f),segFN=segments_1,generation=1,filenames=[segments_1]
[junit4:junit4]   2> 		commit{dir=MockDirWrapper(org.apache.lucene.store.RAMDirectory@7a137851 lockFactory=org.apache.lucene.store.SingleInstanceLockFactory@95b5e0f),segFN=segments_2,generation=2,filenames=[_0_Lucene40_0.tip, _0_MockRandom_0.frq, _0_MockRandom_0.tim, _0_MockRandom_0.doc, _0_Lucene40_0.frq, _0_Lucene40_0.tim, _0.fnm, _0_nrm.cfs, _0_nrm.cfe, _0_Lucene40_0.prx, _0.fdx, _0_MockRandom_0.skp, _0_MockRandom_0.pyl, _0.fdt, _0.si, _0_MockRandom_0.pos, _0_MockRandom_0.tip, _0_MockRandom_0.sd, segments_2]
[junit4:junit4]   2> 1021 T2933 C172 oasc.SolrDeletionPolicy.updateCommits newest commit = 2
[junit4:junit4]   2> 1022 T2933 C172 oass.SolrIndexSearcher.<init> Opening Searcher@1cd3f943 main
[junit4:junit4]   2> 1022 T2933 C172 oass.SolrIndexSearcher.getIndexDir WARNING WARNING: Directory impl does not support setting indexDir: org.apache.lucene.store.MockDirectoryWrapper
[junit4:junit4]   2> 1022 T2933 C172 oasu.DirectUpdateHandler2.commit end_commit_flush
[junit4:junit4]   2> 1023 T2940 oasc.SolrCore.registerSearcher [collection1] Registered new searcher Searcher@1cd3f943 main{StandardDirectoryReader(segments_2:4 _0(5.0):C2)}
[junit4:junit4]   2> 1023 T2933 C172 UPDATE [collection1] webapp=/solr path=/update params={softCommit=false&commit=true&version=2&waitSearcher=true&wt=javabin} {commit=} 0 5
[junit4:junit4]   2> 1026 T2943 C173 oasu.DirectUpdateHandler2.commit start commit{flags=0,_version_=0,optimize=false,openSearcher=true,waitSearcher=true,expungeDeletes=false,softCommit=false}
[junit4:junit4]   2> 1027 T2943 C173 oasc.SolrDeletionPolicy.onCommit SolrDeletionPolicy.onCommit: commits:num=2
[junit4:junit4]   2> 		commit{dir=MockDirWrapper(org.apache.lucene.store.RAMDirectory@5b2bd508 lockFactory=org.apache.lucene.store.SingleInstanceLockFactory@63356e6c),segFN=segments_1,generation=1,filenames=[segments_1]
[junit4:junit4]   2> 		commit{dir=MockDirWrapper(org.apache.lucene.store.RAMDirectory@5b2bd508 lockFactory=org.apache.lucene.store.SingleInstanceLockFactory@63356e6c),segFN=segments_2,generation=2,filenames=[_0_Lucene40_0.tip, _0_MockRandom_0.frq, _0_Lucene40_0.frq, _0_Lucene40_0.tim, _0.fnm, _0_MockRandom_0.tiv, _0_nrm.cfs, _0_nrm.cfe, _0_MockRandom_0.tib, _0_Lucene40_0.prx, _0.fdx, _0.fdt, _0.si, _0_MockRandom_0.prx, _0_MockRandom_0.sd, segments_2]
[junit4:junit4]   2> 1027 T2943 C173 oasc.SolrDeletionPolicy.updateCommits newest commit = 2
[junit4:junit4]   2> 1028 T2943 C173 oass.SolrIndexSearcher.<init> Opening Searcher@2cd54b45 main
[junit4:junit4]   2> 1028 T2943 C173 oass.SolrIndexSearcher.getIndexDir WARNING WARNING: Directory impl does not support setting indexDir: org.apache.lucene.store.MockDirectoryWrapper
[junit4:junit4]   2> 1029 T2943 C173 oasu.DirectUpdateHandler2.commit end_commit_flush
[junit4:junit4]   2> 1029 T2950 oasc.SolrCore.registerSearcher [collection1] Registered new searcher Searcher@2cd54b45 main{StandardDirectoryReader(segments_2:4 _0(5.0):C2)}
[junit4:junit4]   2> 1029 T2943 C173 UPDATE [collection1] webapp=/solr path=/update params={softCommit=false&commit=true&version=2&waitSearcher=true&wt=javabin} {commit=} 0 3
[junit4:junit4]   2> 1031 T2953 C174 oasu.DirectUpdateHandler2.commit start commit{flags=0,_version_=0,optimize=false,openSearcher=true,waitSearcher=true,expungeDeletes=false,softCommit=false}
[junit4:junit4]   2> 1032 T2953 C174 oasc.SolrDeletionPolicy.onCommit SolrDeletionPolicy.onCommit: commits:num=2
[junit4:junit4]   2> 		commit{dir=MockDirWrapper(org.apache.lucene.store.RAMDirectory@4b77fee6 lockFactory=org.apache.lucene.store.SingleInstanceLockFactory@39e861c1),segFN=segments_1,generation=1,filenames=[segments_1]
[junit4:junit4]   2> 		commit{dir=MockDirWrapper(org.apache.lucene.store.RAMDirectory@4b77fee6 lockFactory=org.apache.lucene.store.SingleInstanceLockFactory@39e861c1),segFN=segments_2,generation=2,filenames=[_0_Lucene40_0.tip, _0_MockRandom_0.frq, _0_MockRandom_0.doc, _0_Lucene40_0.frq, _0_Lucene40_0.tim, _0.fnm, _0_MockRandom_0.tiv, _0_nrm.cfs, _0_nrm.cfe, _0_MockRandom_0.tib, _0_Lucene40_0.prx, _0.fdx, _0_MockRandom_0.skp, _0_MockRandom_0.pyl, _0.fdt, _0.si, _0_MockRandom_0.pos, _0_MockRandom_0.sd, segments_2]
[junit4:junit4]   2> 1033 T2953 C174 oasc.SolrDeletionPolicy.updateCommits newest commit = 2
[junit4:junit4]   2> 1033 T2953 C174 oass.SolrIndexSearcher.<init> Opening Searcher@2572425f main
[junit4:junit4]   2> 1033 T2953 C174 oass.SolrIndexSearcher.getIndexDir WARNING WARNING: Directory impl does not support setting indexDir: org.apache.lucene.store.MockDirectoryWrapper
[junit4:junit4]   2> 1034 T2953 C174 oasu.DirectUpdateHandler2.commit end_commit_flush
[junit4:junit4]   2> 1034 T2960 oasc.SolrCore.registerSearcher [collection1] Registered new searcher Searcher@2572425f main{StandardDirectoryReader(segments_2:4 _0(5.0):C3)}
[junit4:junit4]   2> 1035 T2953 C174 UPDATE [collection1] webapp=/solr path=/update params={softCommit=false&commit=true&version=2&waitSearcher=true&wt=javabin} {commit=} 0 4
[junit4:junit4]   2> 1039 T2923 C171 REQ [collection1] webapp=/solr path=/elevate params={q=*:*&wt=javabin&fl=id,+score,+[elevated]&shards.qt=/elevate&version=2&rows=500&qt=/elevate&sort=id+desc&distrib=false} hits=7 status=0 QTime=3 
[junit4:junit4]   2> 1052 T2944 C173 REQ [collection1] webapp=/solr path=/elevate params={isShard=true&wt=javabin&shards.qt=/elevate&version=2&NOW=1343752255419&rows=500&qt=/elevate&shard.url=localhost:53361/solr&q=*:*&fl=id,score&start=0&distrib=false&fsv=true&sort=id+desc} hits=2 status=0 QTime=2 
[junit4:junit4]   2> 1052 T2934 C172 REQ [collection1] webapp=/solr path=/elevate params={isShard=true&wt=javabin&shards.qt=/elevate&version=2&NOW=1343752255419&rows=500&qt=/elevate&shard.url=localhost:46272/solr&q=*:*&fl=id,score&start=0&distrib=false&fsv=true&sort=id+desc} hits=2 status=0 QTime=1 
[junit4:junit4]   2> 1052 T2954 C174 REQ [collection1] webapp=/solr path=/elevate params={isShard=true&wt=javabin&shards.qt=/elevate&version=2&NOW=1343752255419&rows=500&qt=/elevate&shard.url=localhost:51436/solr&q=*:*&fl=id,score&start=0&distrib=false&fsv=true&sort=id+desc} hits=3 status=0 QTime=1 
[junit4:junit4]   2> 1055 T2954 C174 REQ [collection1] webapp=/solr path=/elevate params={isShard=true&wt=javabin&shards.qt=/elevate&version=2&rows=500&NOW=1343752255419&qt=/elevate&ids=3.0,7.0,6.0&shard.url=localhost:51436/solr&q=*:*&fl=id,+score,+[elevated]&distrib=false} status=0 QTime=0 
[junit4:junit4]   2> 1055 T2944 C173 REQ [collection1] webapp=/solr path=/elevate params={isShard=true&wt=javabin&shards.qt=/elevate&version=2&rows=500&NOW=1343752255419&qt=/elevate&ids=2.0,5.0&shard.url=localhost:53361/solr&q=*:*&fl=id,+score,+[elevated]&distrib=false} status=0 QTime=0 
[junit4:junit4]   2> 1056 T2934 C172 REQ [collection1] webapp=/solr path=/elevate params={isShard=true&wt=javabin&shards.qt=/elevate&version=2&rows=500&NOW=1343752255419&qt=/elevate&ids=4.0,1.0&shard.url=localhost:46272/solr&q=*:*&fl=id,+score,+[elevated]&distrib=false} status=0 QTime=0 
[junit4:junit4]   2> 1056 T2943 C173 REQ [collection1] webapp=/solr path=/elevate params={q=*:*&wt=javabin&fl=id,+score,+[elevated]&shards=localhost:46272/solr,localhost:53361/solr,localhost:51436/solr&shards.qt=/elevate&version=2&rows=500&qt=/elevate&sort=id+desc} status=0 QTime=14 
[junit4:junit4]   2> 1057 T2920 oas.BaseDistributedSearchTestCase.compareResponses SEVERE Mismatched responses:
[junit4:junit4]   2> 	{responseHeader={status=0,QTime=14,params={q=*:*,wt=javabin,fl=id, score, [elevated],shards=localhost:46272/solr,localhost:53361/solr,localhost:51436/solr,shards.qt=/elevate,version=2,rows=500,qt=/elevate,sort=id desc}},response={numFound=7,start=0,maxScore=1.0,docs=[SolrDocument{id=7.0, [elevated]=false, score=1.0}, SolrDocument{id=6.0, [elevated]=false, score=1.0}, SolrDocument{id=5.0, [elevated]=false, score=1.0}, SolrDocument{id=4.0, [elevated]=false, score=1.0}, SolrDocument{id=3.0, [elevated]=false, score=1.0}, SolrDocument{id=2.0, [elevated]=false, score=1.0}, SolrDocument{id=1.0, [elevated]=false, score=1.0}]}}
[junit4:junit4]   2> 	{responseHeader={status=0,QTime=3,params={q=*:*,wt=javabin,fl=id, score, [elevated],shards.qt=/elevate,version=2,rows=500,qt=/elevate,sort=id desc,distrib=false}},response={numFound=7,start=0,maxScore=1.0,docs=[SolrDocument{id=7.0, score=1.0, [elevated]=false}, SolrDocument{id=6.0, score=1.0, [elevated]=false}, SolrDocument{id=5.0, score=1.0, [elevated]=false}, SolrDocument{id=4.0, score=1.0, [elevated]=false}, SolrDocument{id=3.0, score=1.0, [elevated]=false}, SolrDocument{id=2.0, score=1.0, [elevated]=false}, SolrDocument{id=1.0, score=1.0, [elevated]=false}]}}
[junit4:junit4]   2> 1058 T2920 oasc.CoreContainer.shutdown Shutting down CoreContainer instance=1867676750
[junit4:junit4]   2> 1058 T2920 oasc.SolrCore.close [collection1]  CLOSING SolrCore org.apache.solr.core.SolrCore@5942d576
[junit4:junit4]   2> 1059 T2920 oasc.SolrCore.closeSearcher [collection1] Closing main searcher on request.
[junit4:junit4]   2> 1059 T2920 oasu.DirectUpdateHandler2.close closing DirectUpdateHandler2{commits=1,autocommits=0,soft autocommits=0,optimizes=0,rollbacks=0,expungeDeletes=0,docsPending=0,adds=0,deletesById=0,deletesByQuery=0,errors=0,cumulative_adds=7,cumulative_deletesById=0,cumulative_deletesByQuery=1,cumulative_errors=0}
[junit4:junit4]   2> 1061 T2920 oejsh.ContextHandler.doStop stopped o.e.j.s.ServletContextHandler{/solr,null}
[junit4:junit4]   2> 1112 T2920 oasc.CoreContainer.shutdown Shutting down CoreContainer instance=2055953083
[junit4:junit4]   2> 1113 T2920 oasc.SolrCore.close [collection1]  CLOSING SolrCore org.apache.solr.core.SolrCore@252a44ee
[junit4:junit4]   2> 1114 T2920 oasc.SolrCore.closeSearcher [collection1] Closing main searcher on request.
[junit4:junit4]   2> 1114 T2920 oasu.DirectUpdateHandler2.close closing DirectUpdateHandler2{commits=1,autocommits=0,soft autocommits=0,optimizes=0,rollbacks=0,expungeDeletes=0,docsPending=0,adds=0,deletesById=0,deletesByQuery=0,errors=0,cumulative_adds=2,cumulative_deletesById=0,cumulative_deletesByQuery=1,cumulative_errors=0}
[junit4:junit4]   2> 1116 T2920 oejsh.ContextHandler.doStop stopped o.e.j.s.ServletContextHandler{/solr,null}
[junit4:junit4]   2> 1168 T2920 oasc.CoreContainer.shutdown Shutting down CoreContainer instance=865620992
[junit4:junit4]   2> 1169 T2920 oasc.SolrCore.close [collection1]  CLOSING SolrCore org.apache.solr.core.SolrCore@372cc0e4
[junit4:junit4]   2> 1169 T2920 oasc.SolrCore.closeSearcher [collection1] Closing main searcher on request.
[junit4:junit4]   2> 1169 T2920 oasu.DirectUpdateHandler2.close closing DirectUpdateHandler2{commits=1,autocommits=0,soft autocommits=0,optimizes=0,rollbacks=0,expungeDeletes=0,docsPending=0,adds=0,deletesById=0,deletesByQuery=0,errors=0,cumulative_adds=2,cumulative_deletesById=0,cumulative_deletesByQuery=1,cumulative_errors=0}
[junit4:junit4]   2> 1171 T2920 oejsh.ContextHandler.doStop stopped o.e.j.s.ServletContextHandler{/solr,null}
[junit4:junit4]   2> 1223 T2920 oasc.CoreContainer.shutdown Shutting down CoreContainer instance=833017317
[junit4:junit4]   2> 1224 T2920 oasc.SolrCore.close [collection1]  CLOSING SolrCore org.apache.solr.core.SolrCore@6e4461e8
[junit4:junit4]   2> 1225 T2920 oasc.SolrCore.closeSearcher [collection1] Closing main searcher on request.
[junit4:junit4]   2> 1225 T2920 oasu.DirectUpdateHandler2.close closing DirectUpdateHandler2{commits=1,autocommits=0,soft autocommits=0,optimizes=0,rollbacks=0,expungeDeletes=0,docsPending=0,adds=0,deletesById=0,deletesByQuery=0,errors=0,cumulative_adds=3,cumulative_deletesById=0,cumulative_deletesByQuery=1,cumulative_errors=0}
[junit4:junit4]   2> 1229 T2920 oejsh.ContextHandler.doStop stopped o.e.j.s.ServletContextHandler{/solr,null}
[junit4:junit4]   2> 1280 T2920 oas.SolrTestCaseJ4.tearDown ###Ending testDistribSearch
[junit4:junit4]   2> NOTE: reproduce with: ant test  -Dtestcase=DistributedQueryElevationComponentTest -Dtests.method=testDistribSearch -Dtests.seed=C821212695C5CD24 -Dtests.multiplier=3 -Dtests.slow=true -Dtests.locale=zh_TW -Dtests.timezone=Africa/Mbabane -Dtests.file.encoding=ISO-8859-1
[junit4:junit4]   2>
[junit4:junit4]    > (@AfterClass output)
[junit4:junit4]   2> 1318 T2920 oas.SolrTestCaseJ4.deleteCore ###deleteCore
[junit4:junit4]   2> NOTE: test params are: codec=Lucene40: {field_t=PostingsFormat(name=MockRandom), int_i=PostingsFormat(name=MockRandom), plow_t=Lucene40(minBlockSize=40 maxBlockSize=78), text=PostingsFormat(name=MockRandom), id=Lucene40(minBlockSize=40 maxBlockSize=78)}, sim=RandomSimilarityProvider(queryNorm=false,coord=false): {}, locale=zh_TW, timezone=Africa/Mbabane
[junit4:junit4]   2> NOTE: Linux 3.2.0-27-generic amd64/Oracle Corporation 1.8.0-ea (64-bit)/cpus=8,threads=1,free=31409880,total=189149184
[junit4:junit4]   2> NOTE: All tests run in this JVM: [SpellPossibilityIteratorTest, CopyFieldTest, TestBadConfig, UniqFieldsUpdateProcessorFactoryTest, TestSystemIdResolver, MBeansHandlerTest, UpdateRequestProcessorFactoryTest, FastVectorHighlighterTest, TestStressLucene, CurrencyFieldTest, TestMultiCoreConfBootstrap, TestDistributedGrouping, TestRangeQuery, TestJmxMonitoredMap, SyncSliceTest, XmlUpdateRequestHandlerTest, CoreAdminHandlerTest, PreAnalyzedFieldTest, TestSurroundQueryParser, BadComponentTest, SolrCoreTest, StandardRequestHandlerTest, TestNumberUtils, TestValueSourceCache, AutoCommitTest, ResourceLoaderTest, DistributedSpellCheckComponentTest, PathHierarchyTokenizerFactoryTest, HighlighterConfigTest, BasicDistributedZkTest, TestWordDelimiterFilterFactory, CSVRequestHandlerTest, TestFastLRUCache, TestUtils, SolrCmdDistributorTest, FullSolrCloudDistribCmdsTest, TermsComponentTest, TestRandomFaceting, PluginInfoTest, TermVectorComponentTest, ScriptEngineTest, TestSearchPerf, TestRecovery, MinimalSchemaTest, AnalysisAfterCoreReloadTest, SolrRequestParserTest, TestStressReorder, BinaryUpdateRequestHandlerTest, DistanceFunctionTest, SpatialFilterTest, DistributedTermsComponentTest, BasicZkTest, TestFaceting, StatsComponentTest, DirectUpdateHandlerTest, TestCoreContainer, TestSort, DirectSolrSpellCheckerTest, FileBasedSpellCheckerTest, PeerSyncTest, QueryElevationComponentTest, SortByFunctionTest, BasicFunctionalityTest, SignatureUpdateProcessorFactoryTest, TestBinaryResponseWriter, TestJmxIntegration, HighlighterTest, TestIndexSearcher, TestFunctionQuery, TestTrie, DirectSolrConnectionTest, CacheHeaderTest, PolyFieldTest, TestCSVResponseWriter, MoreLikeThisHandlerTest, DocumentBuilderTest, DistributedQueryElevationComponentTest]
[junit4:junit4]   2> 
[junit4:junit4] Completed on J0 in 1.32s, 1 test, 1 failure <<< FAILURES!

[...truncated 232 lines...]
BUILD FAILED
/mnt/ssd/jenkins/workspace/Lucene-Solr-trunk-Linux/checkout/build.xml:29: The following error occurred while executing this line:
/mnt/ssd/jenkins/workspace/Lucene-Solr-trunk-Linux/checkout/solr/build.xml:144: The following error occurred while executing this line:
/mnt/ssd/jenkins/workspace/Lucene-Solr-trunk-Linux/checkout/lucene/module-build.xml:62: The following error occurred while executing this line:
/mnt/ssd/jenkins/workspace/Lucene-Solr-trunk-Linux/checkout/lucene/common-build.xml:1095: The following error occurred while executing this line:
/mnt/ssd/jenkins/workspace/Lucene-Solr-trunk-Linux/checkout/lucene/common-build.xml:790: There were test failures: 223 suites, 899 tests, 1 failure, 5 ignored

Total time: 19 minutes 26 seconds
Build step 'Execute shell' marked build as failure
Archiving artifacts
Recording test results
Email was triggered for: Failure
Sending email for trigger: Failure



Mime
View raw message