lucene-dev mailing list archives

Site index · List index
Message view « Date » · « Thread »
Top « Date » · « Thread »
From Policeman Jenkins Server <jenk...@sd-datasolutions.de>
Subject [JENKINS] Lucene-Solr-trunk-Linux-Java8-64 - Build # 32 - Failure!
Date Sat, 28 Jul 2012 20:04:39 GMT
Build: http://jenkins.sd-datasolutions.de/job/Lucene-Solr-trunk-Linux-Java8-64/32/

1 tests failed.
FAILED:  org.apache.lucene.analysis.util.TestFilesystemResourceLoader.testBaseDir

Error Message:
Resource not found: ./fsResourceLoaderBase5094650948tmp/template.txt

Stack Trace:
java.io.IOException: Resource not found: ./fsResourceLoaderBase5094650948tmp/template.txt
	at __randomizedtesting.SeedInfo.seed([BAAD1496E9124DE5:8084A21C9F3443DD]:0)
	at org.apache.lucene.analysis.util.ClasspathResourceLoader.openResource(ClasspathResourceLoader.java:67)
	at org.apache.lucene.analysis.util.FilesystemResourceLoader.openResource(FilesystemResourceLoader.java:86)
	at org.apache.lucene.analysis.util.TestFilesystemResourceLoader.testBaseDir(TestFilesystemResourceLoader.java:78)
	at sun.reflect.NativeMethodAccessorImpl.invoke0(Native Method)
	at sun.reflect.NativeMethodAccessorImpl.invoke(NativeMethodAccessorImpl.java:57)
	at sun.reflect.DelegatingMethodAccessorImpl.invoke(DelegatingMethodAccessorImpl.java:43)
	at java.lang.reflect.Method.invoke(Method.java:474)
	at com.carrotsearch.randomizedtesting.RandomizedRunner.invoke(RandomizedRunner.java:1995)
	at com.carrotsearch.randomizedtesting.RandomizedRunner.access$1100(RandomizedRunner.java:132)
	at com.carrotsearch.randomizedtesting.RandomizedRunner$6.evaluate(RandomizedRunner.java:818)
	at com.carrotsearch.randomizedtesting.RandomizedRunner$7.evaluate(RandomizedRunner.java:877)
	at com.carrotsearch.randomizedtesting.RandomizedRunner$8.evaluate(RandomizedRunner.java:891)
	at org.apache.lucene.util.TestRuleSetupTeardownChained$1.evaluate(TestRuleSetupTeardownChained.java:50)
	at org.apache.lucene.util.TestRuleFieldCacheSanity$1.evaluate(TestRuleFieldCacheSanity.java:32)
	at org.apache.lucene.util.AbstractBeforeAfterRule$1.evaluate(AbstractBeforeAfterRule.java:45)
	at com.carrotsearch.randomizedtesting.rules.SystemPropertiesInvariantRule$1.evaluate(SystemPropertiesInvariantRule.java:55)
	at org.apache.lucene.util.TestRuleReportUncaughtExceptions$1.evaluate(TestRuleReportUncaughtExceptions.java:68)
	at org.apache.lucene.util.TestRuleThreadAndTestName$1.evaluate(TestRuleThreadAndTestName.java:48)
	at org.apache.lucene.util.TestRuleIgnoreAfterMaxFailures$1.evaluate(TestRuleIgnoreAfterMaxFailures.java:70)
	at org.apache.lucene.util.TestRuleMarkFailure$1.evaluate(TestRuleMarkFailure.java:48)
	at com.carrotsearch.randomizedtesting.RandomizedRunner.runSingleTest(RandomizedRunner.java:825)
	at com.carrotsearch.randomizedtesting.RandomizedRunner.access$700(RandomizedRunner.java:132)
	at com.carrotsearch.randomizedtesting.RandomizedRunner$3$1.run(RandomizedRunner.java:671)
	at com.carrotsearch.randomizedtesting.RandomizedRunner$3.evaluate(RandomizedRunner.java:697)
	at com.carrotsearch.randomizedtesting.RandomizedRunner$4.evaluate(RandomizedRunner.java:736)
	at com.carrotsearch.randomizedtesting.RandomizedRunner$5.evaluate(RandomizedRunner.java:747)
	at org.apache.lucene.util.AbstractBeforeAfterRule$1.evaluate(AbstractBeforeAfterRule.java:45)
	at org.apache.lucene.util.TestRuleReportUncaughtExceptions$1.evaluate(TestRuleReportUncaughtExceptions.java:68)
	at org.apache.lucene.util.TestRuleStoreClassName$1.evaluate(TestRuleStoreClassName.java:38)
	at com.carrotsearch.randomizedtesting.rules.SystemPropertiesInvariantRule$1.evaluate(SystemPropertiesInvariantRule.java:55)
	at org.apache.lucene.util.TestRuleNoInstanceHooksOverrides$1.evaluate(TestRuleNoInstanceHooksOverrides.java:53)
	at org.apache.lucene.util.TestRuleNoStaticHooksShadowing$1.evaluate(TestRuleNoStaticHooksShadowing.java:52)
	at org.apache.lucene.util.TestRuleAssertionsRequired$1.evaluate(TestRuleAssertionsRequired.java:36)
	at org.apache.lucene.util.TestRuleMarkFailure$1.evaluate(TestRuleMarkFailure.java:48)
	at org.apache.lucene.util.TestRuleIgnoreAfterMaxFailures$1.evaluate(TestRuleIgnoreAfterMaxFailures.java:70)
	at org.apache.lucene.util.TestRuleIgnoreTestSuites$1.evaluate(TestRuleIgnoreTestSuites.java:55)
	at com.carrotsearch.randomizedtesting.RandomizedRunner.runSuite(RandomizedRunner.java:605)
	at com.carrotsearch.randomizedtesting.RandomizedRunner.access$400(RandomizedRunner.java:132)
	at com.carrotsearch.randomizedtesting.RandomizedRunner$2.run(RandomizedRunner.java:551)




Build Log:
[...truncated 4323 lines...]
[junit4:junit4] Suite: org.apache.lucene.analysis.util.TestFilesystemResourceLoader
[junit4:junit4] ERROR   0.05s J0 | TestFilesystemResourceLoader.testBaseDir
[junit4:junit4]    > Throwable #1: java.io.IOException: Resource not found: ./fsResourceLoaderBase5094650948tmp/template.txt
[junit4:junit4]    > 	at __randomizedtesting.SeedInfo.seed([BAAD1496E9124DE5:8084A21C9F3443DD]:0)
[junit4:junit4]    > 	at org.apache.lucene.analysis.util.ClasspathResourceLoader.openResource(ClasspathResourceLoader.java:67)
[junit4:junit4]    > 	at org.apache.lucene.analysis.util.FilesystemResourceLoader.openResource(FilesystemResourceLoader.java:86)
[junit4:junit4]    > 	at org.apache.lucene.analysis.util.TestFilesystemResourceLoader.testBaseDir(TestFilesystemResourceLoader.java:78)
[junit4:junit4]    > 	at sun.reflect.NativeMethodAccessorImpl.invoke0(Native Method)
[junit4:junit4]    > 	at sun.reflect.NativeMethodAccessorImpl.invoke(NativeMethodAccessorImpl.java:57)
[junit4:junit4]    > 	at sun.reflect.DelegatingMethodAccessorImpl.invoke(DelegatingMethodAccessorImpl.java:43)
[junit4:junit4]    > 	at java.lang.reflect.Method.invoke(Method.java:474)
[junit4:junit4]    > 	at com.carrotsearch.randomizedtesting.RandomizedRunner.invoke(RandomizedRunner.java:1995)
[junit4:junit4]    > 	at com.carrotsearch.randomizedtesting.RandomizedRunner.access$1100(RandomizedRunner.java:132)
[junit4:junit4]    > 	at com.carrotsearch.randomizedtesting.RandomizedRunner$6.evaluate(RandomizedRunner.java:818)
[junit4:junit4]    > 	at com.carrotsearch.randomizedtesting.RandomizedRunner$7.evaluate(RandomizedRunner.java:877)
[junit4:junit4]    > 	at com.carrotsearch.randomizedtesting.RandomizedRunner$8.evaluate(RandomizedRunner.java:891)
[junit4:junit4]    > 	at org.apache.lucene.util.TestRuleSetupTeardownChained$1.evaluate(TestRuleSetupTeardownChained.java:50)
[junit4:junit4]    > 	at org.apache.lucene.util.TestRuleFieldCacheSanity$1.evaluate(TestRuleFieldCacheSanity.java:32)
[junit4:junit4]    > 	at org.apache.lucene.util.AbstractBeforeAfterRule$1.evaluate(AbstractBeforeAfterRule.java:45)
[junit4:junit4]    > 	at com.carrotsearch.randomizedtesting.rules.SystemPropertiesInvariantRule$1.evaluate(SystemPropertiesInvariantRule.java:55)
[junit4:junit4]    > 	at org.apache.lucene.util.TestRuleReportUncaughtExceptions$1.evaluate(TestRuleReportUncaughtExceptions.java:68)
[junit4:junit4]    > 	at org.apache.lucene.util.TestRuleThreadAndTestName$1.evaluate(TestRuleThreadAndTestName.java:48)
[junit4:junit4]    > 	at org.apache.lucene.util.TestRuleIgnoreAfterMaxFailures$1.evaluate(TestRuleIgnoreAfterMaxFailures.java:70)
[junit4:junit4]    > 	at org.apache.lucene.util.TestRuleMarkFailure$1.evaluate(TestRuleMarkFailure.java:48)
[junit4:junit4]    > 	at com.carrotsearch.randomizedtesting.RandomizedRunner.runSingleTest(RandomizedRunner.java:825)
[junit4:junit4]    > 	at com.carrotsearch.randomizedtesting.RandomizedRunner.access$700(RandomizedRunner.java:132)
[junit4:junit4]    > 	at com.carrotsearch.randomizedtesting.RandomizedRunner$3$1.run(RandomizedRunner.java:671)
[junit4:junit4]    > 	at com.carrotsearch.randomizedtesting.RandomizedRunner$3.evaluate(RandomizedRunner.java:697)
[junit4:junit4]    > 	at com.carrotsearch.randomizedtesting.RandomizedRunner$4.evaluate(RandomizedRunner.java:736)
[junit4:junit4]    > 	at com.carrotsearch.randomizedtesting.RandomizedRunner$5.evaluate(RandomizedRunner.java:747)
[junit4:junit4]    > 	at org.apache.lucene.util.AbstractBeforeAfterRule$1.evaluate(AbstractBeforeAfterRule.java:45)
[junit4:junit4]    > 	at org.apache.lucene.util.TestRuleReportUncaughtExceptions$1.evaluate(TestRuleReportUncaughtExceptions.java:68)
[junit4:junit4]    > 	at org.apache.lucene.util.TestRuleStoreClassName$1.evaluate(TestRuleStoreClassName.java:38)
[junit4:junit4]    > 	at com.carrotsearch.randomizedtesting.rules.SystemPropertiesInvariantRule$1.evaluate(SystemPropertiesInvariantRule.java:55)
[junit4:junit4]    > 	at org.apache.lucene.util.TestRuleNoInstanceHooksOverrides$1.evaluate(TestRuleNoInstanceHooksOverrides.java:53)
[junit4:junit4]    > 	at org.apache.lucene.util.TestRuleNoStaticHooksShadowing$1.evaluate(TestRuleNoStaticHooksShadowing.java:52)
[junit4:junit4]    > 	at org.apache.lucene.util.TestRuleAssertionsRequired$1.evaluate(TestRuleAssertionsRequired.java:36)
[junit4:junit4]    > 	at org.apache.lucene.util.TestRuleMarkFailure$1.evaluate(TestRuleMarkFailure.java:48)
[junit4:junit4]    > 	at org.apache.lucene.util.TestRuleIgnoreAfterMaxFailures$1.evaluate(TestRuleIgnoreAfterMaxFailures.java:70)
[junit4:junit4]    > 	at org.apache.lucene.util.TestRuleIgnoreTestSuites$1.evaluate(TestRuleIgnoreTestSuites.java:55)
[junit4:junit4]    > 	at com.carrotsearch.randomizedtesting.RandomizedRunner.runSuite(RandomizedRunner.java:605)
[junit4:junit4]    > 	at com.carrotsearch.randomizedtesting.RandomizedRunner.access$400(RandomizedRunner.java:132)
[junit4:junit4]    > 	at com.carrotsearch.randomizedtesting.RandomizedRunner$2.run(RandomizedRunner.java:551)
[junit4:junit4]    > 
[junit4:junit4]   2> NOTE: reproduce with: ant test  -Dtestcase=TestFilesystemResourceLoader
-Dtests.method=testBaseDir -Dtests.seed=BAAD1496E9124DE5 -Dtests.multiplier=3 -Dtests.slow=true
-Dtests.locale=sr_RS -Dtests.timezone=Mexico/BajaNorte -Dtests.file.encoding=UTF-8
[junit4:junit4]   2>
[junit4:junit4]    > (@AfterClass output)
[junit4:junit4]   2> NOTE: test params are: codec=Lucene40: {}, sim=RandomSimilarityProvider(queryNorm=true,coord=false):
{}, locale=sr_RS, timezone=Mexico/BajaNorte
[junit4:junit4]   2> NOTE: Linux 3.2.0-26-generic amd64/Oracle Corporation 1.8.0-ea (64-bit)/cpus=8,threads=1,free=121437408,total=194576384
[junit4:junit4]   2> NOTE: All tests run in this JVM: [TestTrimFilterFactory, TestArabicAnalyzer,
TestCommonGramsFilterFactory, TestStandardAnalyzer, TestNorwegianLightStemFilterFactory, TestArabicNormalizationFilter,
TestPorterStemFilter, TestBugInSomething, TestGermanLightStemFilter, TestLengthFilter, TestDuelingAnalyzers,
TestLengthFilterFactory, TestCzechStemFilterFactory, TestWordlistLoader, TestPatternReplaceCharFilterFactory,
TestSnowballPorterFilterFactory, TestDanishAnalyzer, TestGalicianAnalyzer, TokenOffsetPayloadTokenFilterTest,
TestUAX29URLEmailAnalyzer, NumericPayloadTokenFilterTest, HunspellDictionaryTest, TestKeepFilterFactory,
TestGalicianStemFilterFactory, TestRemoveDuplicatesTokenFilterFactory, TestWordnetSynonymParser,
TestBasqueAnalyzer, EdgeNGramTokenizerTest, TestHungarianLightStemFilterFactory, TestPatternTokenizer,
TestWikipediaTokenizerFactory, TestGermanMinimalStemFilterFactory, TestArabicFilters, TestMultiWordSynonyms,
TestCharArrayMap, TestBrazilianStemmer, TestCzechStemmer, TestEnglishAnalyzer, TestIndonesianStemFilterFactory,
TestMappingCharFilterFactory, TestIndonesianAnalyzer, TestPortugueseLightStemFilter, TestSwedishLightStemFilter,
TestUAX29URLEmailTokenizer, TestReversePathHierarchyTokenizer, TestPortugueseStemFilterFactory,
TestGreekStemFilterFactory, TestIrishAnalyzer, TestAnalyzers, TestNorwegianMinimalStemFilter,
TestTeeSinkTokenFilter, TestClassicAnalyzer, TestNorwegianAnalyzer, TestFrenchLightStemFilter,
TestKStemmer, TestTurkishAnalyzer, TestArmenianAnalyzer, TestCzechAnalyzer, TestGermanAnalyzer,
TestPersianAnalyzer, TestSwedishAnalyzer, TestReverseStringFilter, TestKeywordAnalyzer, TestGermanStemFilter,
TestCapitalizationFilter, TestEnglishMinimalStemFilter, TestHungarianLightStemFilter, TestCharArrayIterator,
TestSnowball, TestGreekStemmer, DelimitedPayloadTokenFilterTest, PositionFilterTest, TestHindiStemmer,
TestTypeTokenFilter, TestHindiNormalizer, TestIrishLowerCaseFilter, DateRecognizerSinkTokenizerTest,
TokenRangeSinkTokenizerTest, TestStemmerOverrideFilter, TestBrazilianStemFilterFactory, TestCJKBigramFilterFactory,
TestDictionaryCompoundWordTokenFilterFactory, TestAllAnalyzersHaveFactories, TestStopFilterFactory,
TestTypeTokenFilterFactory, TestGermanNormalizationFilterFactory, TestGermanStemFilterFactory,
TestEnglishMinimalStemFilterFactory, TestKStemFilterFactory, TestPorterStemFilterFactory,
TestSpanishLightStemFilterFactory, TestPersianNormalizationFilterFactory, TestFinnishLightStemFilterFactory,
TestFrenchLightStemFilterFactory, TestFrenchMinimalStemFilterFactory, TestIrishLowerCaseFilterFactory,
TestGalicianMinimalStemFilterFactory, TestLatvianStemFilterFactory, TestCapitalizationFilterFactory,
TestKeywordMarkerFilterFactory, TestStemmerOverrideFilterFactory, TestPatternTokenizerFactory,
TestPortugueseLightStemFilterFactory, TestPortugueseMinimalStemFilterFactory, TestRussianLightStemFilterFactory,
TestShingleFilterFactory, TestStandardFactories, TestUAX29URLEmailTokenizerFactory, TestSwedishLightStemFilterFactory,
TestSynonymFilterFactory, TestThaiWordFilterFactory, TestAnalysisSPILoader, TestFilesystemResourceLoader]
[junit4:junit4]   2> 
[junit4:junit4] Completed on J0 in 0.08s, 2 tests, 1 error <<< FAILURES!

[...truncated 8 lines...]
BUILD FAILED
/mnt/ssd/jenkins/workspace/Lucene-Solr-trunk-Linux-Java8-64/checkout/build.xml:29: The following
error occurred while executing this line:
/mnt/ssd/jenkins/workspace/Lucene-Solr-trunk-Linux-Java8-64/checkout/lucene/build.xml:503:
The following error occurred while executing this line:
/mnt/ssd/jenkins/workspace/Lucene-Solr-trunk-Linux-Java8-64/checkout/lucene/common-build.xml:1497:
The following error occurred while executing this line:
/mnt/ssd/jenkins/workspace/Lucene-Solr-trunk-Linux-Java8-64/checkout/lucene/analysis/build.xml:101:
The following error occurred while executing this line:
/mnt/ssd/jenkins/workspace/Lucene-Solr-trunk-Linux-Java8-64/checkout/lucene/analysis/build.xml:38:
The following error occurred while executing this line:
/mnt/ssd/jenkins/workspace/Lucene-Solr-trunk-Linux-Java8-64/checkout/lucene/module-build.xml:62:
The following error occurred while executing this line:
/mnt/ssd/jenkins/workspace/Lucene-Solr-trunk-Linux-Java8-64/checkout/lucene/common-build.xml:1095:
The following error occurred while executing this line:
/mnt/ssd/jenkins/workspace/Lucene-Solr-trunk-Linux-Java8-64/checkout/lucene/common-build.xml:790:
There were test failures: 210 suites, 1062 tests, 1 error, 1 ignored

Total time: 7 minutes 35 seconds
Build step 'Execute shell' marked build as failure
Archiving artifacts
Recording test results
Email was triggered for: Failure
Sending email for trigger: Failure




Mime
View raw message