lucene-dev mailing list archives

Site index · List index
Message view « Date » · « Thread »
Top « Date » · « Thread »
From Policeman Jenkins Server <jenk...@sd-datasolutions.de>
Subject [JENKINS] Lucene-Solr-trunk-Linux-Java6-64 - Build # 1130 - Failure!
Date Mon, 02 Jul 2012 15:14:19 GMT
Build: http://jenkins.sd-datasolutions.de/job/Lucene-Solr-trunk-Linux-Java6-64/1130/

5 tests failed.
REGRESSION:  org.apache.solr.handler.dataimport.TestSqlEntityProcessorDelta3.testCompositePk_DeltaImport_delete

Error Message:
Exception during query

Stack Trace:
java.lang.RuntimeException: Exception during query
	at __randomizedtesting.SeedInfo.seed([1C8C5AF1930C8ED:20F533B17C4DE081]:0)
	at org.apache.solr.SolrTestCaseJ4.assertQ(SolrTestCaseJ4.java:461)
	at org.apache.solr.SolrTestCaseJ4.assertQ(SolrTestCaseJ4.java:428)
	at org.apache.solr.handler.dataimport.TestSqlEntityProcessorDelta3.testCompositePk_DeltaImport_delete(TestSqlEntityProcessorDelta3.java:111)
	at sun.reflect.NativeMethodAccessorImpl.invoke0(Native Method)
	at sun.reflect.NativeMethodAccessorImpl.invoke(NativeMethodAccessorImpl.java:39)
	at sun.reflect.DelegatingMethodAccessorImpl.invoke(DelegatingMethodAccessorImpl.java:25)
	at java.lang.reflect.Method.invoke(Method.java:597)
	at com.carrotsearch.randomizedtesting.RandomizedRunner.invoke(RandomizedRunner.java:1969)
	at com.carrotsearch.randomizedtesting.RandomizedRunner.access$1100(RandomizedRunner.java:132)
	at com.carrotsearch.randomizedtesting.RandomizedRunner$6.evaluate(RandomizedRunner.java:814)
	at com.carrotsearch.randomizedtesting.RandomizedRunner$7.evaluate(RandomizedRunner.java:875)
	at com.carrotsearch.randomizedtesting.RandomizedRunner$8.evaluate(RandomizedRunner.java:889)
	at com.carrotsearch.randomizedtesting.rules.SystemPropertiesRestoreRule$1.evaluate(SystemPropertiesRestoreRule.java:53)
	at org.apache.lucene.util.TestRuleSetupTeardownChained$1.evaluate(TestRuleSetupTeardownChained.java:50)
	at org.apache.lucene.util.TestRuleFieldCacheSanity$1.evaluate(TestRuleFieldCacheSanity.java:32)
	at org.apache.lucene.util.AbstractBeforeAfterRule$1.evaluate(AbstractBeforeAfterRule.java:45)
	at com.carrotsearch.randomizedtesting.rules.SystemPropertiesInvariantRule$1.evaluate(SystemPropertiesInvariantRule.java:55)
	at org.apache.lucene.util.TestRuleReportUncaughtExceptions$1.evaluate(TestRuleReportUncaughtExceptions.java:68)
	at org.apache.lucene.util.TestRuleThreadAndTestName$1.evaluate(TestRuleThreadAndTestName.java:48)
	at org.apache.lucene.util.TestRuleIgnoreAfterMaxFailures$1.evaluate(TestRuleIgnoreAfterMaxFailures.java:70)
	at org.apache.lucene.util.TestRuleMarkFailure$1.evaluate(TestRuleMarkFailure.java:48)
	at com.carrotsearch.randomizedtesting.RandomizedRunner.runSingleTest(RandomizedRunner.java:821)
	at com.carrotsearch.randomizedtesting.RandomizedRunner.access$700(RandomizedRunner.java:132)
	at com.carrotsearch.randomizedtesting.RandomizedRunner$3$1.run(RandomizedRunner.java:669)
	at com.carrotsearch.randomizedtesting.RandomizedRunner$3.evaluate(RandomizedRunner.java:695)
	at com.carrotsearch.randomizedtesting.RandomizedRunner$4.evaluate(RandomizedRunner.java:734)
	at com.carrotsearch.randomizedtesting.RandomizedRunner$5.evaluate(RandomizedRunner.java:745)
	at com.carrotsearch.randomizedtesting.rules.SystemPropertiesRestoreRule$1.evaluate(SystemPropertiesRestoreRule.java:53)
	at org.apache.lucene.util.AbstractBeforeAfterRule$1.evaluate(AbstractBeforeAfterRule.java:45)
	at org.apache.lucene.util.TestRuleReportUncaughtExceptions$1.evaluate(TestRuleReportUncaughtExceptions.java:68)
	at org.apache.lucene.util.TestRuleStoreClassName$1.evaluate(TestRuleStoreClassName.java:38)
	at org.apache.lucene.util.TestRuleIcuHack$1.evaluate(TestRuleIcuHack.java:51)
	at com.carrotsearch.randomizedtesting.rules.SystemPropertiesInvariantRule$1.evaluate(SystemPropertiesInvariantRule.java:55)
	at org.apache.lucene.util.TestRuleNoInstanceHooksOverrides$1.evaluate(TestRuleNoInstanceHooksOverrides.java:53)
	at org.apache.lucene.util.TestRuleNoStaticHooksShadowing$1.evaluate(TestRuleNoStaticHooksShadowing.java:52)
	at org.apache.lucene.util.TestRuleAssertionsRequired$1.evaluate(TestRuleAssertionsRequired.java:36)
	at org.apache.lucene.util.TestRuleMarkFailure$1.evaluate(TestRuleMarkFailure.java:48)
	at org.apache.lucene.util.TestRuleIgnoreAfterMaxFailures$1.evaluate(TestRuleIgnoreAfterMaxFailures.java:70)
	at org.apache.lucene.util.TestRuleIgnoreTestSuites$1.evaluate(TestRuleIgnoreTestSuites.java:55)
	at com.carrotsearch.randomizedtesting.RandomizedRunner.runSuite(RandomizedRunner.java:605)
	at com.carrotsearch.randomizedtesting.RandomizedRunner.access$400(RandomizedRunner.java:132)
	at com.carrotsearch.randomizedtesting.RandomizedRunner$2.run(RandomizedRunner.java:551)
Caused by: java.lang.RuntimeException: REQUEST FAILED: xpath=//*[@numFound='0']
	xml response was: <?xml version="1.0" encoding="UTF-8"?>
<response>
<lst name="responseHeader"><int name="status">0</int><int name="QTime">1</int><lst name="params"><str name="start">0</str><str name="q">*:* OR testCompositePk_DeltaImport_delete</str><str name="qt">standard</str><str name="rows">20</str><str name="version">2.2</str></lst></lst><result name="response" numFound="1" start="0"><doc><arr name="desc"><str>d1</str></arr><str name="id">2</str><date name="timestamp">2012-07-02T15:13:54.313Z</date></doc></result>
</response>

	request was:start=0&q=*:*+OR+testCompositePk_DeltaImport_delete&qt=standard&rows=20&version=2.2
	at org.apache.solr.SolrTestCaseJ4.assertQ(SolrTestCaseJ4.java:454)
	... 41 more


REGRESSION:  org.apache.solr.handler.dataimport.TestSqlEntityProcessorDelta3.testCompositePk_DeltaImport_add

Error Message:
org.apache.lucene.store.AlreadyClosedException: this IndexWriter is closed

Stack Trace:
org.apache.solr.common.SolrException: org.apache.lucene.store.AlreadyClosedException: this IndexWriter is closed
	at __randomizedtesting.SeedInfo.seed([1C8C5AF1930C8ED:D32E10F5A31A1BA6]:0)
	at org.apache.solr.util.TestHarness.update(TestHarness.java:233)
	at org.apache.solr.util.TestHarness.checkUpdateStatus(TestHarness.java:277)
	at org.apache.solr.util.TestHarness.validateUpdate(TestHarness.java:247)
	at org.apache.solr.SolrTestCaseJ4.checkUpdateU(SolrTestCaseJ4.java:415)
	at org.apache.solr.SolrTestCaseJ4.assertU(SolrTestCaseJ4.java:394)
	at org.apache.solr.SolrTestCaseJ4.assertU(SolrTestCaseJ4.java:388)
	at org.apache.solr.SolrTestCaseJ4.clearIndex(SolrTestCaseJ4.java:760)
	at org.apache.solr.handler.dataimport.TestSqlEntityProcessorDelta3.setUp(TestSqlEntityProcessorDelta3.java:67)
	at sun.reflect.NativeMethodAccessorImpl.invoke0(Native Method)
	at sun.reflect.NativeMethodAccessorImpl.invoke(NativeMethodAccessorImpl.java:39)
	at sun.reflect.DelegatingMethodAccessorImpl.invoke(DelegatingMethodAccessorImpl.java:25)
	at java.lang.reflect.Method.invoke(Method.java:597)
	at com.carrotsearch.randomizedtesting.RandomizedRunner.invoke(RandomizedRunner.java:1969)
	at com.carrotsearch.randomizedtesting.RandomizedRunner.access$1100(RandomizedRunner.java:132)
	at com.carrotsearch.randomizedtesting.RandomizedRunner$7.evaluate(RandomizedRunner.java:873)
	at com.carrotsearch.randomizedtesting.RandomizedRunner$8.evaluate(RandomizedRunner.java:889)
	at com.carrotsearch.randomizedtesting.rules.SystemPropertiesRestoreRule$1.evaluate(SystemPropertiesRestoreRule.java:53)
	at org.apache.lucene.util.TestRuleSetupTeardownChained$1.evaluate(TestRuleSetupTeardownChained.java:50)
	at org.apache.lucene.util.TestRuleFieldCacheSanity$1.evaluate(TestRuleFieldCacheSanity.java:32)
	at org.apache.lucene.util.AbstractBeforeAfterRule$1.evaluate(AbstractBeforeAfterRule.java:45)
	at com.carrotsearch.randomizedtesting.rules.SystemPropertiesInvariantRule$1.evaluate(SystemPropertiesInvariantRule.java:55)
	at org.apache.lucene.util.TestRuleReportUncaughtExceptions$1.evaluate(TestRuleReportUncaughtExceptions.java:68)
	at org.apache.lucene.util.TestRuleThreadAndTestName$1.evaluate(TestRuleThreadAndTestName.java:48)
	at org.apache.lucene.util.TestRuleIgnoreAfterMaxFailures$1.evaluate(TestRuleIgnoreAfterMaxFailures.java:70)
	at org.apache.lucene.util.TestRuleMarkFailure$1.evaluate(TestRuleMarkFailure.java:48)
	at com.carrotsearch.randomizedtesting.RandomizedRunner.runSingleTest(RandomizedRunner.java:821)
	at com.carrotsearch.randomizedtesting.RandomizedRunner.access$700(RandomizedRunner.java:132)
	at com.carrotsearch.randomizedtesting.RandomizedRunner$3$1.run(RandomizedRunner.java:669)
	at com.carrotsearch.randomizedtesting.RandomizedRunner$3.evaluate(RandomizedRunner.java:695)
	at com.carrotsearch.randomizedtesting.RandomizedRunner$4.evaluate(RandomizedRunner.java:734)
	at com.carrotsearch.randomizedtesting.RandomizedRunner$5.evaluate(RandomizedRunner.java:745)
	at com.carrotsearch.randomizedtesting.rules.SystemPropertiesRestoreRule$1.evaluate(SystemPropertiesRestoreRule.java:53)
	at org.apache.lucene.util.AbstractBeforeAfterRule$1.evaluate(AbstractBeforeAfterRule.java:45)
	at org.apache.lucene.util.TestRuleReportUncaughtExceptions$1.evaluate(TestRuleReportUncaughtExceptions.java:68)
	at org.apache.lucene.util.TestRuleStoreClassName$1.evaluate(TestRuleStoreClassName.java:38)
	at org.apache.lucene.util.TestRuleIcuHack$1.evaluate(TestRuleIcuHack.java:51)
	at com.carrotsearch.randomizedtesting.rules.SystemPropertiesInvariantRule$1.evaluate(SystemPropertiesInvariantRule.java:55)
	at org.apache.lucene.util.TestRuleNoInstanceHooksOverrides$1.evaluate(TestRuleNoInstanceHooksOverrides.java:53)
	at org.apache.lucene.util.TestRuleNoStaticHooksShadowing$1.evaluate(TestRuleNoStaticHooksShadowing.java:52)
	at org.apache.lucene.util.TestRuleAssertionsRequired$1.evaluate(TestRuleAssertionsRequired.java:36)
	at org.apache.lucene.util.TestRuleMarkFailure$1.evaluate(TestRuleMarkFailure.java:48)
	at org.apache.lucene.util.TestRuleIgnoreAfterMaxFailures$1.evaluate(TestRuleIgnoreAfterMaxFailures.java:70)
	at org.apache.lucene.util.TestRuleIgnoreTestSuites$1.evaluate(TestRuleIgnoreTestSuites.java:55)
	at com.carrotsearch.randomizedtesting.RandomizedRunner.runSuite(RandomizedRunner.java:605)
	at com.carrotsearch.randomizedtesting.RandomizedRunner.access$400(RandomizedRunner.java:132)
	at com.carrotsearch.randomizedtesting.RandomizedRunner$2.run(RandomizedRunner.java:551)
Caused by: org.apache.lucene.store.AlreadyClosedException: this IndexWriter is closed
	at org.apache.lucene.index.IndexWriter.ensureOpen(IndexWriter.java:551)
	at org.apache.lucene.index.IndexWriter.ensureOpen(IndexWriter.java:556)
	at org.apache.lucene.index.IndexWriter.deleteAll(IndexWriter.java:1880)
	at org.apache.solr.update.DirectUpdateHandler2.deleteAll(DirectUpdateHandler2.java:138)
	at org.apache.solr.update.DirectUpdateHandler2.deleteByQuery(DirectUpdateHandler2.java:290)
	at org.apache.solr.update.processor.RunUpdateProcessor.processDelete(RunUpdateProcessorFactory.java:67)
	at org.apache.solr.update.processor.UpdateRequestProcessor.processDelete(UpdateRequestProcessor.java:55)
	at org.apache.solr.update.processor.DistributedUpdateProcessor.doDeleteByQuery(DistributedUpdateProcessor.java:719)
	at org.apache.solr.update.processor.DistributedUpdateProcessor.processDelete(DistributedUpdateProcessor.java:592)
	at org.apache.solr.update.processor.UpdateRequestProcessor.processDelete(UpdateRequestProcessor.java:55)
	at org.apache.solr.handler.dataimport.AbstractDataImportHandlerTestCase$TestUpdateRequestProcessor.processDelete(AbstractDataImportHandlerTestCase.java:364)
	at org.apache.solr.handler.loader.XMLLoader.processDelete(XMLLoader.java:330)
	at org.apache.solr.handler.loader.XMLLoader.processUpdate(XMLLoader.java:261)
	at org.apache.solr.handler.loader.XMLLoader.load(XMLLoader.java:157)
	at org.apache.solr.handler.UpdateRequestHandler$1.load(UpdateRequestHandler.java:92)
	at org.apache.solr.handler.ContentStreamHandlerBase.handleRequestBody(ContentStreamHandlerBase.java:74)
	at org.apache.solr.handler.RequestHandlerBase.handleRequest(RequestHandlerBase.java:129)
	at org.apache.solr.core.SolrCore.execute(SolrCore.java:1599)
	at org.apache.solr.servlet.DirectSolrConnection.request(DirectSolrConnection.java:131)
	at org.apache.solr.util.TestHarness.update(TestHarness.java:229)
	... 45 more


REGRESSION:  org.apache.solr.handler.dataimport.TestSqlEntityProcessorDelta3.testCompositePk_DeltaImport_empty

Error Message:
org.apache.lucene.store.AlreadyClosedException: this IndexWriter is closed

Stack Trace:
org.apache.solr.common.SolrException: org.apache.lucene.store.AlreadyClosedException: this IndexWriter is closed
	at __randomizedtesting.SeedInfo.seed([1C8C5AF1930C8ED:C6CB5EC0B8A595EF]:0)
	at org.apache.solr.util.TestHarness.update(TestHarness.java:233)
	at org.apache.solr.util.TestHarness.checkUpdateStatus(TestHarness.java:277)
	at org.apache.solr.util.TestHarness.validateUpdate(TestHarness.java:247)
	at org.apache.solr.SolrTestCaseJ4.checkUpdateU(SolrTestCaseJ4.java:415)
	at org.apache.solr.SolrTestCaseJ4.assertU(SolrTestCaseJ4.java:394)
	at org.apache.solr.SolrTestCaseJ4.assertU(SolrTestCaseJ4.java:388)
	at org.apache.solr.SolrTestCaseJ4.clearIndex(SolrTestCaseJ4.java:760)
	at org.apache.solr.handler.dataimport.TestSqlEntityProcessorDelta3.setUp(TestSqlEntityProcessorDelta3.java:67)
	at sun.reflect.NativeMethodAccessorImpl.invoke0(Native Method)
	at sun.reflect.NativeMethodAccessorImpl.invoke(NativeMethodAccessorImpl.java:39)
	at sun.reflect.DelegatingMethodAccessorImpl.invoke(DelegatingMethodAccessorImpl.java:25)
	at java.lang.reflect.Method.invoke(Method.java:597)
	at com.carrotsearch.randomizedtesting.RandomizedRunner.invoke(RandomizedRunner.java:1969)
	at com.carrotsearch.randomizedtesting.RandomizedRunner.access$1100(RandomizedRunner.java:132)
	at com.carrotsearch.randomizedtesting.RandomizedRunner$7.evaluate(RandomizedRunner.java:873)
	at com.carrotsearch.randomizedtesting.RandomizedRunner$8.evaluate(RandomizedRunner.java:889)
	at com.carrotsearch.randomizedtesting.rules.SystemPropertiesRestoreRule$1.evaluate(SystemPropertiesRestoreRule.java:53)
	at org.apache.lucene.util.TestRuleSetupTeardownChained$1.evaluate(TestRuleSetupTeardownChained.java:50)
	at org.apache.lucene.util.TestRuleFieldCacheSanity$1.evaluate(TestRuleFieldCacheSanity.java:32)
	at org.apache.lucene.util.AbstractBeforeAfterRule$1.evaluate(AbstractBeforeAfterRule.java:45)
	at com.carrotsearch.randomizedtesting.rules.SystemPropertiesInvariantRule$1.evaluate(SystemPropertiesInvariantRule.java:55)
	at org.apache.lucene.util.TestRuleReportUncaughtExceptions$1.evaluate(TestRuleReportUncaughtExceptions.java:68)
	at org.apache.lucene.util.TestRuleThreadAndTestName$1.evaluate(TestRuleThreadAndTestName.java:48)
	at org.apache.lucene.util.TestRuleIgnoreAfterMaxFailures$1.evaluate(TestRuleIgnoreAfterMaxFailures.java:70)
	at org.apache.lucene.util.TestRuleMarkFailure$1.evaluate(TestRuleMarkFailure.java:48)
	at com.carrotsearch.randomizedtesting.RandomizedRunner.runSingleTest(RandomizedRunner.java:821)
	at com.carrotsearch.randomizedtesting.RandomizedRunner.access$700(RandomizedRunner.java:132)
	at com.carrotsearch.randomizedtesting.RandomizedRunner$3$1.run(RandomizedRunner.java:669)
	at com.carrotsearch.randomizedtesting.RandomizedRunner$3.evaluate(RandomizedRunner.java:695)
	at com.carrotsearch.randomizedtesting.RandomizedRunner$4.evaluate(RandomizedRunner.java:734)
	at com.carrotsearch.randomizedtesting.RandomizedRunner$5.evaluate(RandomizedRunner.java:745)
	at com.carrotsearch.randomizedtesting.rules.SystemPropertiesRestoreRule$1.evaluate(SystemPropertiesRestoreRule.java:53)
	at org.apache.lucene.util.AbstractBeforeAfterRule$1.evaluate(AbstractBeforeAfterRule.java:45)
	at org.apache.lucene.util.TestRuleReportUncaughtExceptions$1.evaluate(TestRuleReportUncaughtExceptions.java:68)
	at org.apache.lucene.util.TestRuleStoreClassName$1.evaluate(TestRuleStoreClassName.java:38)
	at org.apache.lucene.util.TestRuleIcuHack$1.evaluate(TestRuleIcuHack.java:51)
	at com.carrotsearch.randomizedtesting.rules.SystemPropertiesInvariantRule$1.evaluate(SystemPropertiesInvariantRule.java:55)
	at org.apache.lucene.util.TestRuleNoInstanceHooksOverrides$1.evaluate(TestRuleNoInstanceHooksOverrides.java:53)
	at org.apache.lucene.util.TestRuleNoStaticHooksShadowing$1.evaluate(TestRuleNoStaticHooksShadowing.java:52)
	at org.apache.lucene.util.TestRuleAssertionsRequired$1.evaluate(TestRuleAssertionsRequired.java:36)
	at org.apache.lucene.util.TestRuleMarkFailure$1.evaluate(TestRuleMarkFailure.java:48)
	at org.apache.lucene.util.TestRuleIgnoreAfterMaxFailures$1.evaluate(TestRuleIgnoreAfterMaxFailures.java:70)
	at org.apache.lucene.util.TestRuleIgnoreTestSuites$1.evaluate(TestRuleIgnoreTestSuites.java:55)
	at com.carrotsearch.randomizedtesting.RandomizedRunner.runSuite(RandomizedRunner.java:605)
	at com.carrotsearch.randomizedtesting.RandomizedRunner.access$400(RandomizedRunner.java:132)
	at com.carrotsearch.randomizedtesting.RandomizedRunner$2.run(RandomizedRunner.java:551)
Caused by: org.apache.lucene.store.AlreadyClosedException: this IndexWriter is closed
	at org.apache.lucene.index.IndexWriter.ensureOpen(IndexWriter.java:551)
	at org.apache.lucene.index.IndexWriter.ensureOpen(IndexWriter.java:556)
	at org.apache.lucene.index.IndexWriter.deleteAll(IndexWriter.java:1880)
	at org.apache.solr.update.DirectUpdateHandler2.deleteAll(DirectUpdateHandler2.java:138)
	at org.apache.solr.update.DirectUpdateHandler2.deleteByQuery(DirectUpdateHandler2.java:290)
	at org.apache.solr.update.processor.RunUpdateProcessor.processDelete(RunUpdateProcessorFactory.java:67)
	at org.apache.solr.update.processor.UpdateRequestProcessor.processDelete(UpdateRequestProcessor.java:55)
	at org.apache.solr.update.processor.DistributedUpdateProcessor.doDeleteByQuery(DistributedUpdateProcessor.java:719)
	at org.apache.solr.update.processor.DistributedUpdateProcessor.processDelete(DistributedUpdateProcessor.java:592)
	at org.apache.solr.update.processor.UpdateRequestProcessor.processDelete(UpdateRequestProcessor.java:55)
	at org.apache.solr.handler.dataimport.AbstractDataImportHandlerTestCase$TestUpdateRequestProcessor.processDelete(AbstractDataImportHandlerTestCase.java:364)
	at org.apache.solr.handler.loader.XMLLoader.processDelete(XMLLoader.java:330)
	at org.apache.solr.handler.loader.XMLLoader.processUpdate(XMLLoader.java:261)
	at org.apache.solr.handler.loader.XMLLoader.load(XMLLoader.java:157)
	at org.apache.solr.handler.UpdateRequestHandler$1.load(UpdateRequestHandler.java:92)
	at org.apache.solr.handler.ContentStreamHandlerBase.handleRequestBody(ContentStreamHandlerBase.java:74)
	at org.apache.solr.handler.RequestHandlerBase.handleRequest(RequestHandlerBase.java:129)
	at org.apache.solr.core.SolrCore.execute(SolrCore.java:1599)
	at org.apache.solr.servlet.DirectSolrConnection.request(DirectSolrConnection.java:131)
	at org.apache.solr.util.TestHarness.update(TestHarness.java:229)
	... 45 more


REGRESSION:  org.apache.solr.handler.dataimport.TestSqlEntityProcessorDelta3.testCompositePk_FullImport

Error Message:
org.apache.lucene.store.AlreadyClosedException: this IndexWriter is closed

Stack Trace:
org.apache.solr.common.SolrException: org.apache.lucene.store.AlreadyClosedException: this IndexWriter is closed
	at __randomizedtesting.SeedInfo.seed([1C8C5AF1930C8ED:5FA18B98C368983B]:0)
	at org.apache.solr.util.TestHarness.update(TestHarness.java:233)
	at org.apache.solr.util.TestHarness.checkUpdateStatus(TestHarness.java:277)
	at org.apache.solr.util.TestHarness.validateUpdate(TestHarness.java:247)
	at org.apache.solr.SolrTestCaseJ4.checkUpdateU(SolrTestCaseJ4.java:415)
	at org.apache.solr.SolrTestCaseJ4.assertU(SolrTestCaseJ4.java:394)
	at org.apache.solr.SolrTestCaseJ4.assertU(SolrTestCaseJ4.java:388)
	at org.apache.solr.SolrTestCaseJ4.clearIndex(SolrTestCaseJ4.java:760)
	at org.apache.solr.handler.dataimport.TestSqlEntityProcessorDelta3.setUp(TestSqlEntityProcessorDelta3.java:67)
	at sun.reflect.NativeMethodAccessorImpl.invoke0(Native Method)
	at sun.reflect.NativeMethodAccessorImpl.invoke(NativeMethodAccessorImpl.java:39)
	at sun.reflect.DelegatingMethodAccessorImpl.invoke(DelegatingMethodAccessorImpl.java:25)
	at java.lang.reflect.Method.invoke(Method.java:597)
	at com.carrotsearch.randomizedtesting.RandomizedRunner.invoke(RandomizedRunner.java:1969)
	at com.carrotsearch.randomizedtesting.RandomizedRunner.access$1100(RandomizedRunner.java:132)
	at com.carrotsearch.randomizedtesting.RandomizedRunner$7.evaluate(RandomizedRunner.java:873)
	at com.carrotsearch.randomizedtesting.RandomizedRunner$8.evaluate(RandomizedRunner.java:889)
	at com.carrotsearch.randomizedtesting.rules.SystemPropertiesRestoreRule$1.evaluate(SystemPropertiesRestoreRule.java:53)
	at org.apache.lucene.util.TestRuleSetupTeardownChained$1.evaluate(TestRuleSetupTeardownChained.java:50)
	at org.apache.lucene.util.TestRuleFieldCacheSanity$1.evaluate(TestRuleFieldCacheSanity.java:32)
	at org.apache.lucene.util.AbstractBeforeAfterRule$1.evaluate(AbstractBeforeAfterRule.java:45)
	at com.carrotsearch.randomizedtesting.rules.SystemPropertiesInvariantRule$1.evaluate(SystemPropertiesInvariantRule.java:55)
	at org.apache.lucene.util.TestRuleReportUncaughtExceptions$1.evaluate(TestRuleReportUncaughtExceptions.java:68)
	at org.apache.lucene.util.TestRuleThreadAndTestName$1.evaluate(TestRuleThreadAndTestName.java:48)
	at org.apache.lucene.util.TestRuleIgnoreAfterMaxFailures$1.evaluate(TestRuleIgnoreAfterMaxFailures.java:70)
	at org.apache.lucene.util.TestRuleMarkFailure$1.evaluate(TestRuleMarkFailure.java:48)
	at com.carrotsearch.randomizedtesting.RandomizedRunner.runSingleTest(RandomizedRunner.java:821)
	at com.carrotsearch.randomizedtesting.RandomizedRunner.access$700(RandomizedRunner.java:132)
	at com.carrotsearch.randomizedtesting.RandomizedRunner$3$1.run(RandomizedRunner.java:669)
	at com.carrotsearch.randomizedtesting.RandomizedRunner$3.evaluate(RandomizedRunner.java:695)
	at com.carrotsearch.randomizedtesting.RandomizedRunner$4.evaluate(RandomizedRunner.java:734)
	at com.carrotsearch.randomizedtesting.RandomizedRunner$5.evaluate(RandomizedRunner.java:745)
	at com.carrotsearch.randomizedtesting.rules.SystemPropertiesRestoreRule$1.evaluate(SystemPropertiesRestoreRule.java:53)
	at org.apache.lucene.util.AbstractBeforeAfterRule$1.evaluate(AbstractBeforeAfterRule.java:45)
	at org.apache.lucene.util.TestRuleReportUncaughtExceptions$1.evaluate(TestRuleReportUncaughtExceptions.java:68)
	at org.apache.lucene.util.TestRuleStoreClassName$1.evaluate(TestRuleStoreClassName.java:38)
	at org.apache.lucene.util.TestRuleIcuHack$1.evaluate(TestRuleIcuHack.java:51)
	at com.carrotsearch.randomizedtesting.rules.SystemPropertiesInvariantRule$1.evaluate(SystemPropertiesInvariantRule.java:55)
	at org.apache.lucene.util.TestRuleNoInstanceHooksOverrides$1.evaluate(TestRuleNoInstanceHooksOverrides.java:53)
	at org.apache.lucene.util.TestRuleNoStaticHooksShadowing$1.evaluate(TestRuleNoStaticHooksShadowing.java:52)
	at org.apache.lucene.util.TestRuleAssertionsRequired$1.evaluate(TestRuleAssertionsRequired.java:36)
	at org.apache.lucene.util.TestRuleMarkFailure$1.evaluate(TestRuleMarkFailure.java:48)
	at org.apache.lucene.util.TestRuleIgnoreAfterMaxFailures$1.evaluate(TestRuleIgnoreAfterMaxFailures.java:70)
	at org.apache.lucene.util.TestRuleIgnoreTestSuites$1.evaluate(TestRuleIgnoreTestSuites.java:55)
	at com.carrotsearch.randomizedtesting.RandomizedRunner.runSuite(RandomizedRunner.java:605)
	at com.carrotsearch.randomizedtesting.RandomizedRunner.access$400(RandomizedRunner.java:132)
	at com.carrotsearch.randomizedtesting.RandomizedRunner$2.run(RandomizedRunner.java:551)
Caused by: org.apache.lucene.store.AlreadyClosedException: this IndexWriter is closed
	at org.apache.lucene.index.IndexWriter.ensureOpen(IndexWriter.java:551)
	at org.apache.lucene.index.IndexWriter.ensureOpen(IndexWriter.java:556)
	at org.apache.lucene.index.IndexWriter.deleteAll(IndexWriter.java:1880)
	at org.apache.solr.update.DirectUpdateHandler2.deleteAll(DirectUpdateHandler2.java:138)
	at org.apache.solr.update.DirectUpdateHandler2.deleteByQuery(DirectUpdateHandler2.java:290)
	at org.apache.solr.update.processor.RunUpdateProcessor.processDelete(RunUpdateProcessorFactory.java:67)
	at org.apache.solr.update.processor.UpdateRequestProcessor.processDelete(UpdateRequestProcessor.java:55)
	at org.apache.solr.update.processor.DistributedUpdateProcessor.doDeleteByQuery(DistributedUpdateProcessor.java:719)
	at org.apache.solr.update.processor.DistributedUpdateProcessor.processDelete(DistributedUpdateProcessor.java:592)
	at org.apache.solr.update.processor.UpdateRequestProcessor.processDelete(UpdateRequestProcessor.java:55)
	at org.apache.solr.handler.dataimport.AbstractDataImportHandlerTestCase$TestUpdateRequestProcessor.processDelete(AbstractDataImportHandlerTestCase.java:364)
	at org.apache.solr.handler.loader.XMLLoader.processDelete(XMLLoader.java:330)
	at org.apache.solr.handler.loader.XMLLoader.processUpdate(XMLLoader.java:261)
	at org.apache.solr.handler.loader.XMLLoader.load(XMLLoader.java:157)
	at org.apache.solr.handler.UpdateRequestHandler$1.load(UpdateRequestHandler.java:92)
	at org.apache.solr.handler.ContentStreamHandlerBase.handleRequestBody(ContentStreamHandlerBase.java:74)
	at org.apache.solr.handler.RequestHandlerBase.handleRequest(RequestHandlerBase.java:129)
	at org.apache.solr.core.SolrCore.execute(SolrCore.java:1599)
	at org.apache.solr.servlet.DirectSolrConnection.request(DirectSolrConnection.java:131)
	at org.apache.solr.util.TestHarness.update(TestHarness.java:229)
	... 45 more


REGRESSION:  org.apache.solr.handler.dataimport.TestSqlEntityProcessorDelta3.testCompositePk_DeltaImport_nodelta

Error Message:
org.apache.lucene.store.AlreadyClosedException: this IndexWriter is closed

Stack Trace:
org.apache.solr.common.SolrException: org.apache.lucene.store.AlreadyClosedException: this IndexWriter is closed
	at __randomizedtesting.SeedInfo.seed([1C8C5AF1930C8ED:D231315D7A7D3E71]:0)
	at org.apache.solr.util.TestHarness.update(TestHarness.java:233)
	at org.apache.solr.util.TestHarness.checkUpdateStatus(TestHarness.java:277)
	at org.apache.solr.util.TestHarness.validateUpdate(TestHarness.java:247)
	at org.apache.solr.SolrTestCaseJ4.checkUpdateU(SolrTestCaseJ4.java:415)
	at org.apache.solr.SolrTestCaseJ4.assertU(SolrTestCaseJ4.java:394)
	at org.apache.solr.SolrTestCaseJ4.assertU(SolrTestCaseJ4.java:388)
	at org.apache.solr.SolrTestCaseJ4.clearIndex(SolrTestCaseJ4.java:760)
	at org.apache.solr.handler.dataimport.TestSqlEntityProcessorDelta3.setUp(TestSqlEntityProcessorDelta3.java:67)
	at sun.reflect.NativeMethodAccessorImpl.invoke0(Native Method)
	at sun.reflect.NativeMethodAccessorImpl.invoke(NativeMethodAccessorImpl.java:39)
	at sun.reflect.DelegatingMethodAccessorImpl.invoke(DelegatingMethodAccessorImpl.java:25)
	at java.lang.reflect.Method.invoke(Method.java:597)
	at com.carrotsearch.randomizedtesting.RandomizedRunner.invoke(RandomizedRunner.java:1969)
	at com.carrotsearch.randomizedtesting.RandomizedRunner.access$1100(RandomizedRunner.java:132)
	at com.carrotsearch.randomizedtesting.RandomizedRunner$7.evaluate(RandomizedRunner.java:873)
	at com.carrotsearch.randomizedtesting.RandomizedRunner$8.evaluate(RandomizedRunner.java:889)
	at com.carrotsearch.randomizedtesting.rules.SystemPropertiesRestoreRule$1.evaluate(SystemPropertiesRestoreRule.java:53)
	at org.apache.lucene.util.TestRuleSetupTeardownChained$1.evaluate(TestRuleSetupTeardownChained.java:50)
	at org.apache.lucene.util.TestRuleFieldCacheSanity$1.evaluate(TestRuleFieldCacheSanity.java:32)
	at org.apache.lucene.util.AbstractBeforeAfterRule$1.evaluate(AbstractBeforeAfterRule.java:45)
	at com.carrotsearch.randomizedtesting.rules.SystemPropertiesInvariantRule$1.evaluate(SystemPropertiesInvariantRule.java:55)
	at org.apache.lucene.util.TestRuleReportUncaughtExceptions$1.evaluate(TestRuleReportUncaughtExceptions.java:68)
	at org.apache.lucene.util.TestRuleThreadAndTestName$1.evaluate(TestRuleThreadAndTestName.java:48)
	at org.apache.lucene.util.TestRuleIgnoreAfterMaxFailures$1.evaluate(TestRuleIgnoreAfterMaxFailures.java:70)
	at org.apache.lucene.util.TestRuleMarkFailure$1.evaluate(TestRuleMarkFailure.java:48)
	at com.carrotsearch.randomizedtesting.RandomizedRunner.runSingleTest(RandomizedRunner.java:821)
	at com.carrotsearch.randomizedtesting.RandomizedRunner.access$700(RandomizedRunner.java:132)
	at com.carrotsearch.randomizedtesting.RandomizedRunner$3$1.run(RandomizedRunner.java:669)
	at com.carrotsearch.randomizedtesting.RandomizedRunner$3.evaluate(RandomizedRunner.java:695)
	at com.carrotsearch.randomizedtesting.RandomizedRunner$4.evaluate(RandomizedRunner.java:734)
	at com.carrotsearch.randomizedtesting.RandomizedRunner$5.evaluate(RandomizedRunner.java:745)
	at com.carrotsearch.randomizedtesting.rules.SystemPropertiesRestoreRule$1.evaluate(SystemPropertiesRestoreRule.java:53)
	at org.apache.lucene.util.AbstractBeforeAfterRule$1.evaluate(AbstractBeforeAfterRule.java:45)
	at org.apache.lucene.util.TestRuleReportUncaughtExceptions$1.evaluate(TestRuleReportUncaughtExceptions.java:68)
	at org.apache.lucene.util.TestRuleStoreClassName$1.evaluate(TestRuleStoreClassName.java:38)
	at org.apache.lucene.util.TestRuleIcuHack$1.evaluate(TestRuleIcuHack.java:51)
	at com.carrotsearch.randomizedtesting.rules.SystemPropertiesInvariantRule$1.evaluate(SystemPropertiesInvariantRule.java:55)
	at org.apache.lucene.util.TestRuleNoInstanceHooksOverrides$1.evaluate(TestRuleNoInstanceHooksOverrides.java:53)
	at org.apache.lucene.util.TestRuleNoStaticHooksShadowing$1.evaluate(TestRuleNoStaticHooksShadowing.java:52)
	at org.apache.lucene.util.TestRuleAssertionsRequired$1.evaluate(TestRuleAssertionsRequired.java:36)
	at org.apache.lucene.util.TestRuleMarkFailure$1.evaluate(TestRuleMarkFailure.java:48)
	at org.apache.lucene.util.TestRuleIgnoreAfterMaxFailures$1.evaluate(TestRuleIgnoreAfterMaxFailures.java:70)
	at org.apache.lucene.util.TestRuleIgnoreTestSuites$1.evaluate(TestRuleIgnoreTestSuites.java:55)
	at com.carrotsearch.randomizedtesting.RandomizedRunner.runSuite(RandomizedRunner.java:605)
	at com.carrotsearch.randomizedtesting.RandomizedRunner.access$400(RandomizedRunner.java:132)
	at com.carrotsearch.randomizedtesting.RandomizedRunner$2.run(RandomizedRunner.java:551)
Caused by: org.apache.lucene.store.AlreadyClosedException: this IndexWriter is closed
	at org.apache.lucene.index.IndexWriter.ensureOpen(IndexWriter.java:551)
	at org.apache.lucene.index.IndexWriter.ensureOpen(IndexWriter.java:556)
	at org.apache.lucene.index.IndexWriter.deleteAll(IndexWriter.java:1880)
	at org.apache.solr.update.DirectUpdateHandler2.deleteAll(DirectUpdateHandler2.java:138)
	at org.apache.solr.update.DirectUpdateHandler2.deleteByQuery(DirectUpdateHandler2.java:290)
	at org.apache.solr.update.processor.RunUpdateProcessor.processDelete(RunUpdateProcessorFactory.java:67)
	at org.apache.solr.update.processor.UpdateRequestProcessor.processDelete(UpdateRequestProcessor.java:55)
	at org.apache.solr.update.processor.DistributedUpdateProcessor.doDeleteByQuery(DistributedUpdateProcessor.java:719)
	at org.apache.solr.update.processor.DistributedUpdateProcessor.processDelete(DistributedUpdateProcessor.java:592)
	at org.apache.solr.update.processor.UpdateRequestProcessor.processDelete(UpdateRequestProcessor.java:55)
	at org.apache.solr.handler.dataimport.AbstractDataImportHandlerTestCase$TestUpdateRequestProcessor.processDelete(AbstractDataImportHandlerTestCase.java:364)
	at org.apache.solr.handler.loader.XMLLoader.processDelete(XMLLoader.java:330)
	at org.apache.solr.handler.loader.XMLLoader.processUpdate(XMLLoader.java:261)
	at org.apache.solr.handler.loader.XMLLoader.load(XMLLoader.java:157)
	at org.apache.solr.handler.UpdateRequestHandler$1.load(UpdateRequestHandler.java:92)
	at org.apache.solr.handler.ContentStreamHandlerBase.handleRequestBody(ContentStreamHandlerBase.java:74)
	at org.apache.solr.handler.RequestHandlerBase.handleRequest(RequestHandlerBase.java:129)
	at org.apache.solr.core.SolrCore.execute(SolrCore.java:1599)
	at org.apache.solr.servlet.DirectSolrConnection.request(DirectSolrConnection.java:131)
	at org.apache.solr.util.TestHarness.update(TestHarness.java:229)
	... 45 more




Build Log:
[...truncated 9254 lines...]
   [junit4] Suite: org.apache.solr.handler.dataimport.TestSqlEntityProcessorDelta3
   [junit4]    > (@BeforeClass output)
   [junit4]   2> 0 T82 oas.SolrTestCaseJ4.initCore ####initCore
   [junit4]   2> Creating dataDir: /mnt/ssd/jenkins/workspace/Lucene-Solr-trunk-Linux-Java6-64/checkout/solr/build/contrib/solr-dataimporthandler/test/J0/./solrtest-TestSqlEntityProcessorDelta3-1341242033926
   [junit4]   2> 1 T82 oasc.SolrResourceLoader.<init> new SolrResourceLoader for directory: '/mnt/ssd/jenkins/workspace/Lucene-Solr-trunk-Linux-Java6-64/checkout/solr/build/contrib/solr-dataimporthandler/test-files/dih/solr/collection1/'
   [junit4]   2> 41 T82 oasc.SolrConfig.<init> Using Lucene MatchVersion: LUCENE_50
   [junit4]   2> 104 T82 oasc.SolrConfig.<init> Loaded SolrConfig: dataimport-solrconfig.xml
   [junit4]   2> 104 T82 oass.IndexSchema.readSchema Reading Solr Schema
   [junit4]   2> 114 T82 oass.IndexSchema.readSchema Schema name=dih_test
   [junit4]   2> 191 T82 oass.IndexSchema.readSchema default search field in schema is desc
   [junit4]   2> 193 T82 oass.IndexSchema.readSchema query parser default operator is OR
   [junit4]   2> 195 T82 oass.IndexSchema.readSchema unique key field: id
   [junit4]   2> 197 T82 oasc.SolrResourceLoader.locateSolrHome JNDI not configured for solr (NoInitialContextEx)
   [junit4]   2> 197 T82 oasc.SolrResourceLoader.locateSolrHome using system property solr.solr.home: /mnt/ssd/jenkins/workspace/Lucene-Solr-trunk-Linux-Java6-64/checkout/solr/build/contrib/solr-dataimporthandler/test-files/dih/solr
   [junit4]   2> 198 T82 oasc.SolrResourceLoader.<init> new SolrResourceLoader for directory: '/mnt/ssd/jenkins/workspace/Lucene-Solr-trunk-Linux-Java6-64/checkout/solr/build/contrib/solr-dataimporthandler/test-files/dih/solr/'
   [junit4]   2> 198 T82 oasc.CoreContainer.<init> New CoreContainer 124163361
   [junit4]   2> 198 T82 oasc.SolrCore.<init> [collection1] Opening new SolrCore at /mnt/ssd/jenkins/workspace/Lucene-Solr-trunk-Linux-Java6-64/checkout/solr/build/contrib/solr-dataimporthandler/test-files/dih/solr/collection1/, dataDir=/mnt/ssd/jenkins/workspace/Lucene-Solr-trunk-Linux-Java6-64/checkout/solr/build/contrib/solr-dataimporthandler/test/J0/./solrtest-TestSqlEntityProcessorDelta3-1341242033926/
   [junit4]   2> 199 T82 oasc.SolrCore.<init> JMX monitoring not detected for core: collection1
   [junit4]   2> 199 T82 oasc.SolrCore.initListeners [collection1] Added SolrEventListener for newSearcher: org.apache.solr.core.QuerySenderListener{queries=[{q=solr,start=0,rows=10}, {q=rocks,start=0,rows=10}, {q=static newSearcher warming query from solrconfig.xml}]}
   [junit4]   2> 199 T82 oasc.SolrCore.initListeners [collection1] Added SolrEventListener for firstSearcher: org.apache.solr.core.QuerySenderListener{queries=[]}
   [junit4]   2> 200 T82 oasc.SolrCore.getNewIndexDir WARNING New index directory detected: old=null new=/mnt/ssd/jenkins/workspace/Lucene-Solr-trunk-Linux-Java6-64/checkout/solr/build/contrib/solr-dataimporthandler/test/J0/./solrtest-TestSqlEntityProcessorDelta3-1341242033926/index/
   [junit4]   2> 200 T82 oasc.SolrCore.initIndex WARNING [collection1] Solr index directory '/mnt/ssd/jenkins/workspace/Lucene-Solr-trunk-Linux-Java6-64/checkout/solr/build/contrib/solr-dataimporthandler/test/J0/./solrtest-TestSqlEntityProcessorDelta3-1341242033926/index' doesn't exist. Creating new index...
   [junit4]   2> 210 T82 oasc.SolrDeletionPolicy.onCommit SolrDeletionPolicy.onCommit: commits:num=1
   [junit4]   2> 		commit{dir=MockDirWrapper(org.apache.lucene.store.MMapDirectory@/mnt/ssd/jenkins/workspace/Lucene-Solr-trunk-Linux-Java6-64/checkout/solr/build/contrib/solr-dataimporthandler/test/J0/index1798717987tmp lockFactory=org.apache.lucene.store.NativeFSLockFactory@3850620f),segFN=segments_1,generation=1,filenames=[segments_1]
   [junit4]   2> 210 T82 oasc.SolrDeletionPolicy.updateCommits newest commit = 1
   [junit4]   2> 211 T82 oasup.UpdateRequestProcessorChain.init inserting DistributedUpdateProcessorFactory into updateRequestProcessorChain "" (default)
   [junit4]   2> 212 T82 oasc.RequestHandlers.initHandlersFromConfig created standard: solr.StandardRequestHandler
   [junit4]   2> 212 T82 oasc.RequestHandlers.initHandlersFromConfig created /dataimport: org.apache.solr.handler.dataimport.DataImportHandler
   [junit4]   2> 212 T82 oasc.RequestHandlers.initHandlersFromConfig created /search: org.apache.solr.handler.component.SearchHandler
   [junit4]   2> 212 T82 oasc.RequestHandlers.initHandlersFromConfig created /update: solr.UpdateRequestHandler
   [junit4]   2> 213 T82 oashl.XMLLoader.init xsltCacheLifetimeSeconds=60
   [junit4]   2> 216 T82 oass.SolrIndexSearcher.<init> Opening Searcher@66201d6d main
   [junit4]   2> 217 T82 oass.SolrIndexSearcher.<init> WARNING WARNING: Directory impl does not support setting indexDir: org.apache.lucene.store.MockDirectoryWrapper
   [junit4]   2> 217 T82 oasu.CommitTracker.<init> Hard AutoCommit: disabled
   [junit4]   2> 218 T82 oasu.CommitTracker.<init> Soft AutoCommit: disabled
   [junit4]   2> 218 T82 oashc.HttpShardHandlerFactory.getParameter Setting socketTimeout to: 0
   [junit4]   2> 218 T82 oashc.HttpShardHandlerFactory.getParameter Setting urlScheme to: http://
   [junit4]   2> 218 T82 oashc.HttpShardHandlerFactory.getParameter Setting connTimeout to: 0
   [junit4]   2> 219 T82 oashc.HttpShardHandlerFactory.getParameter Setting maxConnectionsPerHost to: 20
   [junit4]   2> 219 T82 oashc.HttpShardHandlerFactory.getParameter Setting corePoolSize to: 0
   [junit4]   2> 219 T82 oashc.HttpShardHandlerFactory.getParameter Setting maximumPoolSize to: 2147483647
   [junit4]   2> 219 T82 oashc.HttpShardHandlerFactory.getParameter Setting maxThreadIdleTime to: 5
   [junit4]   2> 220 T82 oashc.HttpShardHandlerFactory.getParameter Setting sizeOfQueue to: -1
   [junit4]   2> 220 T82 oashc.HttpShardHandlerFactory.getParameter Setting fairnessPolicy to: false
   [junit4]   2> 220 T82 oascsi.HttpClientUtil.createClient Creating new http client, config:maxConnectionsPerHost=20&maxConnections=10000&socketTimeout=0&connTimeout=0&retry=false
   [junit4]   2> 223 T83 oasc.QuerySenderListener.newSearcher QuerySenderListener sending requests to Searcher@66201d6d main{StandardDirectoryReader(segments_1:1)}
   [junit4]   2> 223 T82 oasc.CoreContainer.register registering core: collection1
   [junit4]   2> 224 T83 oasc.QuerySenderListener.newSearcher QuerySenderListener done.
   [junit4]   2> 224 T83 oasc.SolrCore.registerSearcher [collection1] Registered new searcher Searcher@66201d6d main{StandardDirectoryReader(segments_1:1)}
   [junit4]   2> 224 T82 oas.SolrTestCaseJ4.initCore ####initCore end
   [junit4]   2> 
   [junit4] ERROR   0.12s J0 | TestSqlEntityProcessorDelta3.testCompositePk_DeltaImport_delete
   [junit4]    > Throwable #1: java.lang.RuntimeException: Exception during query
   [junit4]    > 	at __randomizedtesting.SeedInfo.seed([1C8C5AF1930C8ED:20F533B17C4DE081]:0)
   [junit4]    > 	at org.apache.solr.SolrTestCaseJ4.assertQ(SolrTestCaseJ4.java:461)
   [junit4]    > 	at org.apache.solr.SolrTestCaseJ4.assertQ(SolrTestCaseJ4.java:428)
   [junit4]    > 	at org.apache.solr.handler.dataimport.TestSqlEntityProcessorDelta3.testCompositePk_DeltaImport_delete(TestSqlEntityProcessorDelta3.java:111)
   [junit4]    > 	at sun.reflect.NativeMethodAccessorImpl.invoke0(Native Method)
   [junit4]    > 	at sun.reflect.NativeMethodAccessorImpl.invoke(NativeMethodAccessorImpl.java:39)
   [junit4]    > 	at sun.reflect.DelegatingMethodAccessorImpl.invoke(DelegatingMethodAccessorImpl.java:25)
   [junit4]    > 	at java.lang.reflect.Method.invoke(Method.java:597)
   [junit4]    > 	at com.carrotsearch.randomizedtesting.RandomizedRunner.invoke(RandomizedRunner.java:1969)
   [junit4]    > 	at com.carrotsearch.randomizedtesting.RandomizedRunner.access$1100(RandomizedRunner.java:132)
   [junit4]    > 	at com.carrotsearch.randomizedtesting.RandomizedRunner$6.evaluate(RandomizedRunner.java:814)
   [junit4]    > 	at com.carrotsearch.randomizedtesting.RandomizedRunner$7.evaluate(RandomizedRunner.java:875)
   [junit4]    > 	at com.carrotsearch.randomizedtesting.RandomizedRunner$8.evaluate(RandomizedRunner.java:889)
   [junit4]    > 	at com.carrotsearch.randomizedtesting.rules.SystemPropertiesRestoreRule$1.evaluate(SystemPropertiesRestoreRule.java:53)
   [junit4]    > 	at org.apache.lucene.util.TestRuleSetupTeardownChained$1.evaluate(TestRuleSetupTeardownChained.java:50)
   [junit4]    > 	at org.apache.lucene.util.TestRuleFieldCacheSanity$1.evaluate(TestRuleFieldCacheSanity.java:32)
   [junit4]    > 	at org.apache.lucene.util.AbstractBeforeAfterRule$1.evaluate(AbstractBeforeAfterRule.java:45)
   [junit4]    > 	at com.carrotsearch.randomizedtesting.rules.SystemPropertiesInvariantRule$1.evaluate(SystemPropertiesInvariantRule.java:55)
   [junit4]    > 	at org.apache.lucene.util.TestRuleReportUncaughtExceptions$1.evaluate(TestRuleReportUncaughtExceptions.java:68)
   [junit4]    > 	at org.apache.lucene.util.TestRuleThreadAndTestName$1.evaluate(TestRuleThreadAndTestName.java:48)
   [junit4]    > 	at org.apache.lucene.util.TestRuleIgnoreAfterMaxFailures$1.evaluate(TestRuleIgnoreAfterMaxFailures.java:70)
   [junit4]    > 	at org.apache.lucene.util.TestRuleMarkFailure$1.evaluate(TestRuleMarkFailure.java:48)
   [junit4]    > 	at com.carrotsearch.randomizedtesting.RandomizedRunner.runSingleTest(RandomizedRunner.java:821)
   [junit4]    > 	at com.carrotsearch.randomizedtesting.RandomizedRunner.access$700(RandomizedRunner.java:132)
   [junit4]    > 	at com.carrotsearch.randomizedtesting.RandomizedRunner$3$1.run(RandomizedRunner.java:669)
   [junit4]    > 	at com.carrotsearch.randomizedtesting.RandomizedRunner$3.evaluate(RandomizedRunner.java:695)
   [junit4]    > 	at com.carrotsearch.randomizedtesting.RandomizedRunner$4.evaluate(RandomizedRunner.java:734)
   [junit4]    > 	at com.carrotsearch.randomizedtesting.RandomizedRunner$5.evaluate(RandomizedRunner.java:745)
   [junit4]    > 	at com.carrotsearch.randomizedtesting.rules.SystemPropertiesRestoreRule$1.evaluate(SystemPropertiesRestoreRule.java:53)
   [junit4]    > 	at org.apache.lucene.util.AbstractBeforeAfterRule$1.evaluate(AbstractBeforeAfterRule.java:45)
   [junit4]    > 	at org.apache.lucene.util.TestRuleReportUncaughtExceptions$1.evaluate(TestRuleReportUncaughtExceptions.java:68)
   [junit4]    > 	at org.apache.lucene.util.TestRuleStoreClassName$1.evaluate(TestRuleStoreClassName.java:38)
   [junit4]    > 	at org.apache.lucene.util.TestRuleIcuHack$1.evaluate(TestRuleIcuHack.java:51)
   [junit4]    > 	at com.carrotsearch.randomizedtesting.rules.SystemPropertiesInvariantRule$1.evaluate(SystemPropertiesInvariantRule.java:55)
   [junit4]    > 	at org.apache.lucene.util.TestRuleNoInstanceHooksOverrides$1.evaluate(TestRuleNoInstanceHooksOverrides.java:53)
   [junit4]    > 	at org.apache.lucene.util.TestRuleNoStaticHooksShadowing$1.evaluate(TestRuleNoStaticHooksShadowing.java:52)
   [junit4]    > 	at org.apache.lucene.util.TestRuleAssertionsRequired$1.evaluate(TestRuleAssertionsRequired.java:36)
   [junit4]    > 	at org.apache.lucene.util.TestRuleMarkFailure$1.evaluate(TestRuleMarkFailure.java:48)
   [junit4]    > 	at org.apache.lucene.util.TestRuleIgnoreAfterMaxFailures$1.evaluate(TestRuleIgnoreAfterMaxFailures.java:70)
   [junit4]    > 	at org.apache.lucene.util.TestRuleIgnoreTestSuites$1.evaluate(TestRuleIgnoreTestSuites.java:55)
   [junit4]    > 	at com.carrotsearch.randomizedtesting.RandomizedRunner.runSuite(RandomizedRunner.java:605)
   [junit4]    > 	at com.carrotsearch.randomizedtesting.RandomizedRunner.access$400(RandomizedRunner.java:132)
   [junit4]    > 	at com.carrotsearch.randomizedtesting.RandomizedRunner$2.run(RandomizedRunner.java:551)
   [junit4]    > Caused by: java.lang.RuntimeException: REQUEST FAILED: xpath=//*[@numFound='0']
   [junit4]    > 	xml response was: <?xml version="1.0" encoding="UTF-8"?>
   [junit4]    > <response>
   [junit4]    > <lst name="responseHeader"><int name="status">0</int><int name="QTime">1</int><lst name="params"><str name="start">0</str><str name="q">*:* OR testCompositePk_DeltaImport_delete</str><str name="qt">standard</str><str name="rows">20</str><str name="version">2.2</str></lst></lst><result name="response" numFound="1" start="0"><doc><arr name="desc"><str>d1</str></arr><str name="id">2</str><date name="timestamp">2012-07-02T15:13:54.313Z</date></doc></result>
   [junit4]    > </response>
   [junit4]    > 
   [junit4]    > 	request was:start=0&q=*:*+OR+testCompositePk_DeltaImport_delete&qt=standard&rows=20&version=2.2
   [junit4]    > 	at org.apache.solr.SolrTestCaseJ4.assertQ(SolrTestCaseJ4.java:454)
   [junit4]    > 	... 41 more
   [junit4]    > 
   [junit4]   2> 362 T82 oas.SolrTestCaseJ4.setUp ###Starting testCompositePk_DeltaImport_delete
   [junit4]   2> 367 T82 C11 oasu.DirectUpdateHandler2.deleteAll [collection1] REMOVING ALL DOCUMENTS FROM INDEX
   [junit4]   2> 370 T82 C11 UPDATE [collection1] webapp=null path=null params={} {deleteByQuery=*:*} 0 3
   [junit4]   2> 377 T82 C11 oasu.DirectUpdateHandler2.commit start commit{flags=0,version=0,optimize=false,openSearcher=true,waitSearcher=true,expungeDeletes=false,softCommit=false}
   [junit4]   2> 378 T82 C11 oasc.SolrDeletionPolicy.onCommit SolrDeletionPolicy.onCommit: commits:num=2
   [junit4]   2> 		commit{dir=MockDirWrapper(org.apache.lucene.store.MMapDirectory@/mnt/ssd/jenkins/workspace/Lucene-Solr-trunk-Linux-Java6-64/checkout/solr/build/contrib/solr-dataimporthandler/test/J0/index1798717987tmp lockFactory=org.apache.lucene.store.NativeFSLockFactory@3850620f),segFN=segments_4,generation=4,filenames=[_1_Lucene40_0.tim, _1.fdx, _1.fdt, _1.si, _1_Lucene40_0.frq, _1.fnm, _1_Lucene40_0.tip, segments_4]
   [junit4]   2> 		commit{dir=MockDirWrapper(org.apache.lucene.store.MMapDirectory@/mnt/ssd/jenkins/workspace/Lucene-Solr-trunk-Linux-Java6-64/checkout/solr/build/contrib/solr-dataimporthandler/test/J0/index1798717987tmp lockFactory=org.apache.lucene.store.NativeFSLockFactory@3850620f),segFN=segments_5,generation=5,filenames=[segments_5]
   [junit4]   2> 379 T82 C11 oasc.SolrDeletionPolicy.updateCommits newest commit = 5
   [junit4]   2> 381 T82 C11 oass.SolrIndexSearcher.<init> Opening Searcher@38ec029 main
   [junit4]   2> 382 T82 C11 oass.SolrIndexSearcher.<init> WARNING WARNING: Directory impl does not support setting indexDir: org.apache.lucene.store.MockDirectoryWrapper
   [junit4]   2> 383 T82 C11 oasu.DirectUpdateHandler2.commit end_commit_flush
   [junit4]   2> 383 T83 oasc.QuerySenderListener.newSearcher QuerySenderListener sending requests to Searcher@38ec029 main{StandardDirectoryReader(segments_5:10)}
   [junit4]   2> 384 T83 C11 REQ [collection1] webapp=null path=null params={start=0&event=newSearcher&q=solr&distrib=false&rows=10} hits=0 status=0 QTime=1 
   [junit4]   2> 384 T83 C11 REQ [collection1] webapp=null path=null params={start=0&event=newSearcher&q=rocks&distrib=false&rows=10} hits=0 status=0 QTime=0 
   [junit4]   2> 384 T83 C11 REQ [collection1] webapp=null path=null params={event=newSearcher&q=static+newSearcher+warming+query+from+solrconfig.xml&distrib=false} hits=0 status=0 QTime=0 
   [junit4]   2> 385 T83 oasc.QuerySenderListener.newSearcher QuerySenderListener done.
   [junit4]   2> 385 T83 oasc.SolrCore.registerSearcher [collection1] Registered new searcher Searcher@38ec029 main{StandardDirectoryReader(segments_5:10)}
   [junit4]   2> 385 T82 C11 UPDATE [collection1] webapp=null path=null params={} {commit=} 0 8
   [junit4]   2> 388 T82 C11 oashd.DataImportHandler.processConfiguration No configuration specified in solrconfig.xml for DataImportHandler
   [junit4]   2> 391 T82 C11 oashd.DataImporter.loadDataConfig Data Configuration loaded successfully
   [junit4]   2> 392 T82 C11 oashd.DataImporter.doFullImport Starting Full Import
   [junit4]   2> 392 T82 C11 oashd.SimplePropertiesWriter.readIndexerProperties Read dataimport.properties
   [junit4]   2> 393 T82 C11 oasu.DirectUpdateHandler2.deleteAll [collection1] REMOVING ALL DOCUMENTS FROM INDEX
   [junit4]   2> 395 T82 C11 oashd.DocBuilder.finish Import completed successfully
   [junit4]   2> 396 T82 C11 oasu.DirectUpdateHandler2.commit start commit{flags=0,version=0,optimize=false,openSearcher=true,waitSearcher=true,expungeDeletes=false,softCommit=false}
   [junit4]   2> 408 T82 C11 oasc.SolrDeletionPolicy.onCommit SolrDeletionPolicy.onCommit: commits:num=2
   [junit4]   2> 		commit{dir=MockDirWrapper(org.apache.lucene.store.MMapDirectory@/mnt/ssd/jenkins/workspace/Lucene-Solr-trunk-Linux-Java6-64/checkout/solr/build/contrib/solr-dataimporthandler/test/J0/index1798717987tmp lockFactory=org.apache.lucene.store.NativeFSLockFactory@3850620f),segFN=segments_5,generation=5,filenames=[segments_5]
   [junit4]   2> 		commit{dir=MockDirWrapper(org.apache.lucene.store.MMapDirectory@/mnt/ssd/jenkins/workspace/Lucene-Solr-trunk-Linux-Java6-64/checkout/solr/build/contrib/solr-dataimporthandler/test/J0/index1798717987tmp lockFactory=org.apache.lucene.store.NativeFSLockFactory@3850620f),segFN=segments_6,generation=6,filenames=[_2.si, _2_Lucene40_0.tip, _2_Lucene40_0.frq, _2.fdt, _2_Lucene40_0.tim, _2.fdx, segments_6, _2.fnm]
   [junit4]   2> 409 T82 C11 oasc.SolrDeletionPolicy.updateCommits newest commit = 6
   [junit4]   2> 414 T82 C11 oass.SolrIndexSearcher.<init> Opening Searcher@19737b9f main
   [junit4]   2> 414 T82 C11 oass.SolrIndexSearcher.<init> WARNING WARNING: Directory impl does not support setting indexDir: org.apache.lucene.store.MockDirectoryWrapper
   [junit4]   2> 415 T82 C11 oasu.DirectUpdateHandler2.commit end_commit_flush
   [junit4]   2> 418 T83 oasc.QuerySenderListener.newSearcher QuerySenderListener sending requests to Searcher@19737b9f main{StandardDirectoryReader(segments_6:13 _2(5.0):C1)}
   [junit4]   2> 419 T83 C11 REQ [collection1] webapp=null path=null params={start=0&event=newSearcher&q=solr&distrib=false&rows=10} hits=0 status=0 QTime=0 
   [junit4]   2> 419 T83 C11 REQ [collection1] webapp=null path=null params={start=0&event=newSearcher&q=rocks&distrib=false&rows=10} hits=0 status=0 QTime=0 
   [junit4]   2> 420 T83 C11 REQ [collection1] webapp=null path=null params={event=newSearcher&q=static+newSearcher+warming+query+from+solrconfig.xml&distrib=false} hits=0 status=0 QTime=0 
   [junit4]   2> 420 T83 oasc.QuerySenderListener.newSearcher QuerySenderListener done.
   [junit4]   2> 421 T83 oasc.SolrCore.registerSearcher [collection1] Registered new searcher Searcher@19737b9f main{StandardDirectoryReader(segments_6:13 _2(5.0):C1)}
   [junit4]   2> 422 T82 C11 oashd.SimplePropertiesWriter.readIndexerProperties Read dataimport.properties
   [junit4]   2> 422 T82 C11 oashd.SimplePropertiesWriter.persist Wrote last indexed time to dataimport.properties
   [junit4]   2> 422 T82 C11 oashd.DocBuilder.execute Time taken = 0:0:0.29
   [junit4]   2> 423 T82 C11 UPDATE [collection1] webapp=null path=null params={clean=true&dataConfig=<dataConfig>++<dataSource++type%3D"MockDataSource"/>%0a++<document>++++<entity+name%3D"parent"+pk%3D"parent_id"+rootEntity%3D"false"++++++++++++query%3D"select+*+from+parent"++++++++++++deltaQuery%3D"select+parent_id+from+parent+where+last_modified+>+NOW"++++++++++++deltaImportQuery%3D"select+*+from+parent+where+last_modified+>+NOW+AND+parent_id%3D${dih.delta.parent_id}">++++++<field+column%3D"desc"+name%3D"desc"/>++++++<entity+name%3D"child"+pk%3D"id"+rootEntity%3D"true"++++++++++++++query%3D"select+*+from+child"++++++++++++++deletedPkQuery%3D"select+id+from+child+where+last_modified+>+NOW+AND+deleted%3D'true'"++++++++++++++deltaQuery%3D"select+id+from+child+where+last_modified+>+NOW"++++++++++++++parentDeltaQuery%3D"select+parent_id+from+child+where+id%3D${child.id}"++++++++++++++deltaImportQuery%3D"select+*+from+child+where+last_modified+>+NOW+AND+parent_id%3D${dih.delta.parent_id}">++++++++<field+column%3D"id"+name%3D"id"+/>++++++</entity>++++</entity>++</document></dataConfig>%0a&commit=true&command=full-import&debug=on} {deleteByQuery=*:*,add=[2],commit=} 0 35
   [junit4]   2> 424 T82 C11 REQ [collection1] webapp=null path=null params={start=0&q=*:*+OR+add1document&qt=standard&rows=20&version=2.2} hits=1 status=0 QTime=1 
   [junit4]   2> 426 T82 C11 REQ [collection1] webapp=null path=null params={start=0&q=id:1&qt=standard&rows=20&version=2.2} hits=0 status=0 QTime=0 
   [junit4]   2> 429 T82 C11 REQ [collection1] webapp=null path=null params={start=0&q=id:2&qt=standard&rows=20&version=2.2} hits=1 status=0 QTime=0 
   [junit4]   2> 433 T82 C11 REQ [collection1] webapp=null path=null params={start=0&q=desc:d1&qt=standard&rows=20&version=2.2} hits=1 status=0 QTime=0 
   [junit4]   2> 436 T82 C11 oashd.DataImportHandler.processConfiguration No configuration specified in solrconfig.xml for DataImportHandler
   [junit4]   2> 438 T82 C11 oashd.DataImporter.loadDataConfig Data Configuration loaded successfully
   [junit4]   2> 439 T82 C11 oashd.DataImporter.doDeltaImport Starting Delta Import
   [junit4]   2> 439 T82 C11 oashd.SimplePropertiesWriter.readIndexerProperties Read dataimport.properties
   [junit4]   2> 440 T82 C11 oashd.DataImporter.doDeltaImport SEVERE Delta Import Failed org.apache.solr.handler.dataimport.DataImportHandlerException: Properties is not writable. Delta imports are supported by data config but will not work. Processing Document # 1
   [junit4]   2> 	at org.apache.solr.handler.dataimport.DataImporter.checkWritablePersistFile(DataImporter.java:350)
   [junit4]   2> 	at org.apache.solr.handler.dataimport.DataImporter.doDeltaImport(DataImporter.java:362)
   [junit4]   2> 	at org.apache.solr.handler.dataimport.DataImporter.runCmd(DataImporter.java:401)
   [junit4]   2> 	at org.apache.solr.handler.dataimport.DataImportHandler.handleRequestBody(DataImportHandler.java:205)
   [junit4]   2> 	at org.apache.solr.handler.RequestHandlerBase.handleRequest(RequestHandlerBase.java:129)
   [junit4]   2> 	at org.apache.solr.core.SolrCore.execute(SolrCore.java:1599)
   [junit4]   2> 	at org.apache.solr.util.TestHarness.query(TestHarness.java:330)
   [junit4]   2> 	at org.apache.solr.handler.dataimport.AbstractDataImportHandlerTestCase.runDeltaImport(AbstractDataImportHandlerTestCase.java:103)
   [junit4]   2> 	at org.apache.solr.handler.dataimport.TestSqlEntityProcessorDelta3.testCompositePk_DeltaImport_delete(TestSqlEntityProcessorDelta3.java:110)
   [junit4]   2> 	at sun.reflect.NativeMethodAccessorImpl.invoke0(Native Method)
   [junit4]   2> 	at sun.reflect.NativeMethodAccessorImpl.invoke(NativeMethodAccessorImpl.java:39)
   [junit4]   2> 	at sun.reflect.DelegatingMethodAccessorImpl.invoke(DelegatingMethodAccessorImpl.java:25)
   [junit4]   2> 	at java.lang.reflect.Method.invoke(Method.java:597)
   [junit4]   2> 	at com.carrotsearch.randomizedtesting.RandomizedRunner.invoke(RandomizedRunner.java:1969)
   [junit4]   2> 	at com.carrotsearch.randomizedtesting.RandomizedRunner.access$1100(RandomizedRunner.java:132)
   [junit4]   2> 	at com.carrotsearch.randomizedtesting.RandomizedRunner$6.evaluate(RandomizedRunner.java:814)
   [junit4]   2> 	at com.carrotsearch.randomizedtesting.RandomizedRunner$7.evaluate(RandomizedRunner.java:875)
   [junit4]   2> 	at com.carrotsearch.randomizedtesting.RandomizedRunner$8.evaluate(RandomizedRunner.java:889)
   [junit4]   2> 	at com.carrotsearch.randomizedtesting.rules.SystemPropertiesRestoreRule$1.evaluate(SystemPropertiesRestoreRule.java:53)
   [junit4]   2> 	at org.apache.lucene.util.TestRuleSetupTeardownChained$1.evaluate(TestRuleSetupTeardownChained.java:50)
   [junit4]   2> 	at org.apache.lucene.util.TestRuleFieldCacheSanity$1.evaluate(TestRuleFieldCacheSanity.java:32)
   [junit4]   2> 	at org.apache.lucene.util.AbstractBeforeAfterRule$1.evaluate(AbstractBeforeAfterRule.java:45)
   [junit4]   2> 	at com.carrotsearch.randomizedtesting.rules.SystemPropertiesInvariantRule$1.evaluate(SystemPropertiesInvariantRule.java:55)
   [junit4]   2> 	at org.apache.lucene.util.TestRuleReportUncaughtExceptions$1.evaluate(TestRuleReportUncaughtExceptions.java:68)
   [junit4]   2> 	at org.apache.lucene.util.TestRuleThreadAndTestName$1.evaluate(TestRuleThreadAndTestName.java:48)
   [junit4]   2> 	at org.apache.lucene.util.TestRuleIgnoreAfterMaxFailures$1.evaluate(TestRuleIgnoreAfterMaxFailures.java:70)
   [junit4]   2> 	at org.apache.lucene.util.TestRuleMarkFailure$1.evaluate(TestRuleMarkFailure.java:48)
   [junit4]   2> 	at com.carrotsearch.randomizedtesting.RandomizedRunner.runSingleTest(RandomizedRunner.java:821)
   [junit4]   2> 	at com.carrotsearch.randomizedtesting.RandomizedRunner.access$700(RandomizedRunner.java:132)
   [junit4]   2> 	at com.carrotsearch.randomizedtesting.RandomizedRunner$3$1.run(RandomizedRunner.java:669)
   [junit4]   2> 	at com.carrotsearch.randomizedtesting.RandomizedRunner$3.evaluate(RandomizedRunner.java:695)
   [junit4]   2> 	at com.carrotsearch.randomizedtesting.RandomizedRunner$4.evaluate(RandomizedRunner.java:734)
   [junit4]   2> 	at com.carrotsearch.randomizedtesting.RandomizedRunner$5.evaluate(RandomizedRunner.java:745)
   [junit4]   2> 	at com.carrotsearch.randomizedtesting.rules.SystemPropertiesRestoreRule$1.evaluate(SystemPropertiesRestoreRule.java:53)
   [junit4]   2> 	at org.apache.lucene.util.AbstractBeforeAfterRule$1.evaluate(AbstractBeforeAfterRule.java:45)
   [junit4]   2> 	at org.apache.lucene.util.TestRuleReportUncaughtExceptions$1.evaluate(TestRuleReportUncaughtExceptions.java:68)
   [junit4]   2> 	at org.apache.lucene.util.TestRuleStoreClassName$1.evaluate(TestRuleStoreClassName.java:38)
   [junit4]   2> 	at org.apache.lucene.util.TestRuleIcuHack$1.evaluate(TestRuleIcuHack.java:51)
   [junit4]   2> 	at com.carrotsearch.randomizedtesting.rules.SystemPropertiesInvariantRule$1.evaluate(SystemPropertiesInvariantRule.java:55)
   [junit4]   2> 	at org.apache.lucene.util.TestRuleNoInstanceHooksOverrides$1.evaluate(TestRuleNoInstanceHooksOverrides.java:53)
   [junit4]   2> 	at org.apache.lucene.util.TestRuleNoStaticHooksShadowing$1.evaluate(TestRuleNoStaticHooksShadowing.java:52)
   [junit4]   2> 	at org.apache.lucene.util.TestRuleAssertionsRequired$1.evaluate(TestRuleAssertionsRequired.java:36)
   [junit4]   2> 	at org.apache.lucene.util.TestRuleMarkFailure$1.evaluate(TestRuleMarkFailure.java:48)
   [junit4]   2> 	at org.apache.lucene.util.TestRuleIgnoreAfterMaxFailures$1.evaluate(TestRuleIgnoreAfterMaxFailures.java:70)
   [junit4]   2> 	at org.apache.lucene.util.TestRuleIgnoreTestSuites$1.evaluate(TestRuleIgnoreTestSuites.java:55)
   [junit4]   2> 	at com.carrotsearch.randomizedtesting.RandomizedRunner.runSuite(RandomizedRunner.java:605)
   [junit4]   2> 	at com.carrotsearch.randomizedtesting.RandomizedRunner.access$400(RandomizedRunner.java:132)
   [junit4]   2> 	at com.carrotsearch.randomizedtesting.RandomizedRunner$2.run(RandomizedRunner.java:551)
   [junit4]   2> 
   [junit4]   2> 440 T82 C11 oasu.DirectUpdateHandler2.rollback start rollback{flags=0,version=0}
   [junit4]   2> 443 T82 C11 oashd.SolrWriter.rollback SEVERE Exception while solr rollback. org.apache.lucene.index.IndexNotFoundException: no segments* file found in MockDirWrapper(NRTCachingDirectory(org.apache.lucene.store.RAMDirectory@65087be0 lockFactory=org.apache.lucene.store.NativeFSLockFactory@7ce9927a; maxCacheMB=0.2607421875 maxMergeSizeMB=0.6806640625)): files: []
   [junit4]   2> 	at org.apache.lucene.index.SegmentInfos$FindSegmentsFile.run(SegmentInfos.java:596)
   [junit4]   2> 	at org.apache.lucene.index.SegmentInfos$FindSegmentsFile.run(SegmentInfos.java:486)
   [junit4]   2> 	at org.apache.lucene.index.SegmentInfos.read(SegmentInfos.java:319)
   [junit4]   2> 	at org.apache.lucene.index.IndexWriter.<init>(IndexWriter.java:632)
   [junit4]   2> 	at org.apache.solr.update.SolrIndexWriter.<init>(SolrIndexWriter.java:58)
   [junit4]   2> 	at org.apache.solr.update.DefaultSolrCoreState.createMainIndexWriter(DefaultSolrCoreState.java:111)
   [junit4]   2> 	at org.apache.solr.update.DefaultSolrCoreState.newIndexWriter(DefaultSolrCoreState.java:61)
   [junit4]   2> 	at org.apache.solr.update.DefaultSolrCoreState.rollbackIndexWriter(DefaultSolrCoreState.java:106)
   [junit4]   2> 	at org.apache.solr.update.DirectUpdateHandler2.rollbackWriter(DirectUpdateHandler2.java:143)
   [junit4]   2> 	at org.apache.solr.update.DirectUpdateHandler2.rollback(DirectUpdateHandler2.java:503)
   [junit4]   2> 	at org.apache.solr.update.processor.RunUpdateProcessor.processRollback(RunUpdateProcessorFactory.java:93)
   [junit4]   2> 	at org.apache.solr.update.processor.UpdateRequestProcessor.processRollback(UpdateRequestProcessor.java:72)
   [junit4]   2> 	at org.apache.solr.update.processor.UpdateRequestProcessor.processRollback(UpdateRequestProcessor.java:72)
   [junit4]   2> 	at org.apache.solr.handler.dataimport.AbstractDataImportHandlerTestCase$TestUpdateRequestProcessor.processRollback(AbstractDataImportHandlerTestCase.java:376)
   [junit4]   2> 	at org.apache.solr.handler.dataimport.SolrWriter.rollback(SolrWriter.java:117)
   [junit4]   2> 	at org.apache.solr.handler.dataimport.DocBuilder.rollback(DocBuilder.java:319)
   [junit4]   2> 	at org.apache.solr.handler.dataimport.DataImporter.doDeltaImport(DataImporter.java:368)
   [junit4]   2> 	at org.apache.solr.handler.dataimport.DataImporter.runCmd(DataImporter.java:401)
   [junit4]   2> 	at org.apache.solr.handler.dataimport.DataImportHandler.handleRequestBody(DataImportHandler.java:205)
   [junit4]   2> 	at org.apache.solr.handler.RequestHandlerBase.handleRequest(RequestHandlerBase.java:129)
   [junit4]   2> 	at org.apache.solr.core.SolrCore.execute(SolrCore.java:1599)
   [junit4]   2> 	at org.apache.solr.util.TestHarness.query(TestHarness.java:330)
   [junit4]   2> 	at org.apache.solr.handler.dataimport.AbstractDataImportHandlerTestCase.runDeltaImport(AbstractDataImportHandlerTestCase.java:103)
   [junit4]   2> 	at org.apache.solr.handler.dataimport.TestSqlEntityProcessorDelta3.testCompositePk_DeltaImport_delete(TestSqlEntityProcessorDelta3.java:110)
   [junit4]   2> 	at sun.reflect.NativeMethodAccessorImpl.invoke0(Native Method)
   [junit4]   2> 	at sun.reflect.NativeMethodAccessorImpl.invoke(NativeMethodAccessorImpl.java:39)
   [junit4]   2> 	at sun.reflect.DelegatingMethodAccessorImpl.invoke(DelegatingMethodAccessorImpl.java:25)
   [junit4]   2> 	at java.lang.reflect.Method.invoke(Method.java:597)
   [junit4]   2> 	at com.carrotsearch.randomizedtesting.RandomizedRunner.invoke(RandomizedRunner.java:1969)
   [junit4]   2> 	at com.carrotsearch.randomizedtesting.RandomizedRunner.access$1100(RandomizedRunner.java:132)
   [junit4]   2> 	at com.carrotsearch.randomizedtesting.RandomizedRunner$6.evaluate(RandomizedRunner.java:814)
   [junit4]   2> 	at com.carrotsearch.randomizedtesting.RandomizedRunner$7.evaluate(RandomizedRunner.java:875)
   [junit4]   2> 	at com.carrotsearch.randomizedtesting.RandomizedRunner$8.evaluate(RandomizedRunner.java:889)
   [junit4]   2> 	at com.carrotsearch.randomizedtesting.rules.SystemPropertiesRestoreRule$1.evaluate(SystemPropertiesRestoreRule.java:53)
   [junit4]   2> 	at org.apache.lucene.util.TestRuleSetupTeardownChained$1.evaluate(TestRuleSetupTeardownChained.java:50)
   [junit4]   2> 	at org.apache.lucene.util.TestRuleFieldCacheSanity$1.evaluate(TestRuleFieldCacheSanity.java:32)
   [junit4]   2> 	at org.apache.lucene.util.AbstractBeforeAfterRule$1.evaluate(AbstractBeforeAfterRule.java:45)
   [junit4]   2> 	at com.carrotsearch.randomizedtesting.rules.SystemPropertiesInvariantRule$1.evaluate(SystemPropertiesInvariantRule.java:55)
   [junit4]   2> 	at org.apache.lucene.util.TestRuleReportUncaughtExceptions$1.evaluate(TestRuleReportUncaughtExceptions.java:68)
   [junit4]   2> 	at org.apache.lucene.util.TestRuleThreadAndTestName$1.evaluate(TestRuleThreadAndTestName.java:48)
   [junit4]   2> 	at org.apache.lucene.util.TestRuleIgnoreAfterMaxFailures$1.evaluate(TestRuleIgnoreAfterMaxFailures.java:70)
   [junit4]   2> 	at org.apache.lucene.util.TestRuleMarkFailure$1.evaluate(TestRuleMarkFailure.java:48)
   [junit4]   2> 	at com.carrotsearch.randomizedtesting.RandomizedRunner.runSingleTest(RandomizedRunner.java:821)
   [junit4]   2> 	at com.carrotsearch.randomizedtesting.RandomizedRunner.access$700(RandomizedRunner.java:132)
   [junit4]   2> 	at com.carrotsearch.randomizedtesting.RandomizedRunner$3$1.run(RandomizedRunner.java:669)
   [junit4]   2> 	at com.carrotsearch.randomizedtesting.RandomizedRunner$3.evaluate(RandomizedRunner.java:695)
   [junit4]   2> 	at com.carrotsearch.randomizedtesting.RandomizedRunner$4.evaluate(RandomizedRunner.java:734)
   [junit4]   2> 	at com.carrotsearch.randomizedtesting.RandomizedRunner$5.evaluate(RandomizedRunner.java:745)
   [junit4]   2> 	at com.carrotsearch.randomizedtesting.rules.SystemPropertiesRestoreRule$1.evaluate(SystemPropertiesRestoreRule.java:53)
   [junit4]   2> 	at org.apache.lucene.util.AbstractBeforeAfterRule$1.evaluate(AbstractBeforeAfterRule.java:45)
   [junit4]   2> 	at org.apache.lucene.util.TestRuleReportUncaughtExceptions$1.evaluate(TestRuleReportUncaughtExceptions.java:68)
   [junit4]   2> 	at org.apache.lucene.util.TestRuleStoreClassName$1.evaluate(TestRuleStoreClassName.java:38)
   [junit4]   2> 	at org.apache.lucene.util.TestRuleIcuHack$1.evaluate(TestRuleIcuHack.java:51)
   [junit4]   2> 	at com.carrotsearch.randomizedtesting.rules.SystemPropertiesInvariantRule$1.evaluate(SystemPropertiesInvariantRule.java:55)
   [junit4]   2> 	at org.apache.lucene.util.TestRuleNoInstanceHooksOverrides$1.evaluate(TestRuleNoInstanceHooksOverrides.java:53)
   [junit4]   2> 	at org.apache.lucene.util.TestRuleNoStaticHooksShadowing$1.evaluate(TestRuleNoStaticHooksShadowing.java:52)
   [junit4]   2> 	at org.apache.lucene.util.TestRuleAssertionsRequired$1.evaluate(TestRuleAssertionsRequired.java:36)
   [junit4]   2> 	at org.apache.lucene.util.TestRuleMarkFailure$1.evaluate(TestRuleMarkFailure.java:48)
   [junit4]   2> 	at org.apache.lucene.util.TestRuleIgnoreAfterMaxFailures$1.evaluate(TestRuleIgnoreAfterMaxFailures.java:70)
   [junit4]   2> 	at org.apache.lucene.util.TestRuleIgnoreTestSuites$1.evaluate(TestRuleIgnoreTestSuites.java:55)
   [junit4]   2> 	at com.carrotsearch.randomizedtesting.RandomizedRunner.runSuite(RandomizedRunner.java:605)
   [junit4]   2> 	at com.carrotsearch.randomizedtesting.RandomizedRunner.access$400(RandomizedRunner.java:132)
   [junit4]   2> 	at com.carrotsearch.randomizedtesting.RandomizedRunner$2.run(RandomizedRunner.java:551)
   [junit4]   2> 
   [junit4]   2> 445 T82 C11 REQ [collection1] webapp=null path=null params={clean=false&dataConfig=<dataConfig>++<dataSource++type%3D"MockDataSource"/>%0a++<document>++++<entity+name%3D"parent"+pk%3D"parent_id"+rootEntity%3D"false"++++++++++++query%3D"select+*+from+parent"++++++++++++deltaQuery%3D"select+parent_id+from+parent+where+last_modified+>+NOW"++++++++++++deltaImportQuery%3D"select+*+from+parent+where+last_modified+>+NOW+AND+parent_id%3D${dih.delta.parent_id}">++++++<field+column%3D"desc"+name%3D"desc"/>++++++<entity+name%3D"child"+pk%3D"id"+rootEntity%3D"true"++++++++++++++query%3D"select+*+from+child"++++++++++++++deletedPkQuery%3D"select+id+from+child+where+last_modified+>+NOW+AND+deleted%3D'true'"++++++++++++++deltaQuery%3D"select+id+from+child+where+last_modified+>+NOW"++++++++++++++parentDeltaQuery%3D"select+parent_id+from+child+where+id%3D${child.id}"++++++++++++++deltaImportQuery%3D"select+*+from+child+where+last_modified+>+NOW+AND+parent_id%3D${dih.delta.parent_id}">++++++++<field+column%3D"id"+name%3D"id"+/>++++++</entity>++++</entity>++</document></dataConfig>%0a&commit=true&command=delta-import&debug=on} status=0 QTime=9 
   [junit4]   2> 446 T82 C11 REQ [collection1] webapp=null path=null params={start=0&q=*:*+OR+testCompositePk_DeltaImport_delete&qt=standard&rows=20&version=2.2} hits=1 status=0 QTime=1 
   [junit4]   2> 448 T82 oas.SolrTestCaseJ4.assertQ SEVERE REQUEST FAILED: xpath=//*[@numFound='0']
   [junit4]   2> 		xml response was: <?xml version="1.0" encoding="UTF-8"?>
   [junit4]   2> 	<response>
   [junit4]   2> 	<lst name="responseHeader"><int name="status">0</int><int name="QTime">1</int><lst name="params"><str name="start">0</str><str name="q">*:* OR testCompositePk_DeltaImport_delete</str><str name="qt">standard</str><str name="rows">20</str><str name="version">2.2</str></lst></lst><result name="response" numFound="1" start="0"><doc><arr name="desc"><str>d1</str></arr><str name="id">2</str><date name="timestamp">2012-07-02T15:13:54.313Z</date></doc></result>
   [junit4]   2> 	</response>
   [junit4]   2> 	
   [junit4]   2> 		request was:start=0&q=*:*+OR+testCompositePk_DeltaImport_delete&qt=standard&rows=20&version=2.2
   [junit4]   2> 449 T82 oasc.SolrException.log SEVERE REQUEST FAILED: start=0&q=*:*+OR+testCompositePk_DeltaImport_delete&qt=standard&rows=20&version=2.2:java.lang.RuntimeException: REQUEST FAILED: xpath=//*[@numFound='0']
   [junit4]   2> 		xml response was: <?xml version="1.0" encoding="UTF-8"?>
   [junit4]   2> 	<response>
   [junit4]   2> 	<lst name="responseHeader"><int name="status">0</int><int name="QTime">1</int><lst name="params"><str name="start">0</str><str name="q">*:* OR testCompositePk_DeltaImport_delete</str><str name="qt">standard</str><str name="rows">20</str><str name="version">2.2</str></lst></lst><result name="response" numFound="1" start="0"><doc><arr name="desc"><str>d1</str></arr><str name="id">2</str><date name="timestamp">2012-07-02T15:13:54.313Z</date></doc></result>
   [junit4]   2> 	</response>
   [junit4]   2> 	
   [junit4]   2> 		request was:start=0&q=*:*+OR+testCompositePk_DeltaImport_delete&qt=standard&rows=20&version=2.2
   [junit4]   2> 		at org.apache.solr.SolrTestCaseJ4.assertQ(SolrTestCaseJ4.java:454)
   [junit4]   2> 		at org.apache.solr.SolrTestCaseJ4.assertQ(SolrTestCaseJ4.java:428)
   [junit4]   2> 		at org.apache.solr.handler.dataimport.TestSqlEntityProcessorDelta3.testCompositePk_DeltaImport_delete(TestSqlEntityProcessorDelta3.java:111)
   [junit4]   2> 		at sun.reflect.NativeMethodAccessorImpl.invoke0(Native Method)
   [junit4]   2> 		at sun.reflect.NativeMethodAccessorImpl.invoke(NativeMethodAccessorImpl.java:39)
   [junit4]   2> 		at sun.reflect.DelegatingMethodAccessorImpl.invoke(DelegatingMethodAccessorImpl.java:25)
   [junit4]   2> 		at java.lang.reflect.Method.invoke(Method.java:597)
   [junit4]   2> 		at com.carrotsearch.randomizedtesting.RandomizedRunner.invoke(RandomizedRunner.java:1969)
   [junit4]   2> 		at com.carrotsearch.randomizedtesting.RandomizedRunner.access$1100(RandomizedRunner.java:132)
   [junit4]   2> 		at com.carrotsearch.randomizedtesting.RandomizedRunner$6.evaluate(RandomizedRunner.java:814)
   [junit4]   2> 		at com.carrotsearch.randomizedtesting.RandomizedRunner$7.evaluate(RandomizedRunner.java:875)
   [junit4]   2> 		at com.carrotsearch.randomizedtesting.RandomizedRunner$8.evaluate(RandomizedRunner.java:889)
   [junit4]   2> 		at com.carrotsearch.randomizedtesting.rules.SystemPropertiesRestoreRule$1.evaluate(SystemPropertiesRestoreRule.java:53)
   [junit4]   2> 		at org.apache.lucene.util.TestRuleSetupTeardownChained$1.evaluate(TestRuleSetupTeardownChained.java:50)
   [junit4]   2> 		at org.apache.lucene.util.TestRuleFieldCacheSanity$1.evaluate(TestRuleFieldCacheSanity.java:32)
   [junit4]   2> 		at org.apache.lucene.util.AbstractBeforeAfterRule$1.evaluate(AbstractBeforeAfterRule.java:45)
   [junit4]   2> 		at com.carrotsearch.randomizedtesting.rules.SystemPropertiesInvariantRule$1.evaluate(SystemPropertiesInvariantRule.java:55)
   [junit4]   2> 		at org.apache.lucene.util.TestRuleReportUncaughtExceptions$1.evaluate(TestRuleReportUncaughtExceptions.java:68)
   [junit4]   2> 		at org.apache.lucene.util.TestRuleThreadAndTestName$1.evaluate(TestRuleThreadAndTestName.java:48)
   [junit4]   2> 		at org.apache.lucene.util.TestRuleIgnoreAfterMaxFailures$1.evaluate(TestRuleIgnoreAfterMaxFailures.java:70)
   [junit4]   2> 		at org.apache.lucene.util.TestRuleMarkFailure$1.evaluate(TestRuleMarkFailure.java:48)
   [junit4]   2> 		at com.carrotsearch.randomizedtesting.RandomizedRunner.runSingleTest(RandomizedRunner.java:821)
   [junit4]   2> 		at com.carrotsearch.randomizedtesting.RandomizedRunner.access$700(RandomizedRunner.java:132)
   [junit4]   2> 		at com.carrotsearch.randomizedtesting.RandomizedRunner$3$1.run(RandomizedRunner.java:669)
   [junit4]   2> 		at com.carrotsearch.randomizedtesting.RandomizedRunner$3.evaluate(RandomizedRunner.java:695)
   [junit4]   2> 		at com.carrotsearch.randomizedtesting.RandomizedRunner$4.evaluate(RandomizedRunner.java:734)
   [junit4]   2> 		at com.carrotsearch.randomizedtesting.RandomizedRunner$5.evaluate(RandomizedRunner.java:745)
   [junit4]   2> 		at com.carrotsearch.randomizedtesting.rules.SystemPropertiesRestoreRule$1.evaluate(SystemPropertiesRestoreRule.java:53)
   [junit4]   2> 		at org.apache.lucene.util.AbstractBeforeAfterRule$1.evaluate(AbstractBeforeAfterRule.java:45)
   [junit4]   2> 		at org.apache.lucene.util.TestRuleReportUncaughtExceptions$1.evaluate(TestRuleReportUncaughtExceptions.java:68)
   [junit4]   2> 		at org.apache.lucene.util.TestRuleStoreClassName$1.evaluate(TestRuleStoreClassName.java:38)
   [junit4]   2> 		at org.apache.lucene.util.TestRuleIcuHack$1.evaluate(TestRuleIcuHack.java:51)
   [junit4]   2> 		at com.carrotsearch.randomizedtesting.rules.SystemPropertiesInvariantRule$1.evaluate(SystemPropertiesInvariantRule.java:55)
   [junit4]   2> 		at org.apache.lucene.util.TestRuleNoInstanceHooksOverrides$1.evaluate(TestRuleNoInstanceHooksOverrides.java:53)
   [junit4]   2> 		at org.apache.lucene.util.TestRuleNoStaticHooksShadowing$1.evaluate(TestRuleNoStaticHooksShadowing.java:52)
   [junit4]   2> 		at org.apache.lucene.util.TestRuleAssertionsRequired$1.evaluate(TestRuleAssertionsRequired.java:36)
   [junit4]   2> 		at org.apache.lucene.util.TestRuleMarkFailure$1.evaluate(TestRuleMarkFailure.java:48)
   [junit4]   2> 		at org.apache.lucene.util.TestRuleIgnoreAfterMaxFailures$1.evaluate(TestRuleIgnoreAfterMaxFailures.java:70)
   [junit4]   2> 		at org.apache.lucene.util.TestRuleIgnoreTestSuites$1.evaluate(TestRuleIgnoreTestSuites.java:55)
   [junit4]   2> 		at com.carrotsearch.randomizedtesting.RandomizedRunner.runSuite(RandomizedRunner.java:605)
   [junit4]   2> 		at com.carrotsearch.randomizedtesting.RandomizedRunner.access$400(RandomizedRunner.java:132)
   [junit4]   2> 		at com.carrotsearch.randomizedtesting.RandomizedRunner$2.run(RandomizedRunner.java:551)
   [junit4]   2> 	
   [junit4]   2> 450 T82 oashd.AbstractDataImportHandlerTestCase.tearDown Looking for dataimport.properties at: /mnt/ssd/jenkins/workspace/Lucene-Solr-trunk-Linux-Java6-64/checkout/solr/build/contrib/solr-dataimporthandler/test/J0/solr/collection1/conf/dataimport.properties
   [junit4]   2> 450 T82 oas.SolrTestCaseJ4.tearDown ###Ending testCompositePk_DeltaImport_delete
   [junit4]   2> NOTE: reproduce with: ant test  -Dtestcase=TestSqlEntityProcessorDelta3 -Dtests.method=testCompositePk_DeltaImport_delete -Dtests.seed=1C8C5AF1930C8ED -Dtests.multiplier=3 -Dtests.slow=true -Dtests.locale=sk_SK -Dtests.timezone=Israel -Dargs="-Dfile.encoding=UTF-8"
   [junit4]   2>
   [junit4] ERROR   0.02s J0 | TestSqlEntityProcessorDelta3.testCompositePk_DeltaImport_add
   [junit4]    > Throwable #1: org.apache.solr.common.SolrException: org.apache.lucene.store.AlreadyClosedException: this IndexWriter is closed
   [junit4]    > 	at __randomizedtesting.SeedInfo.seed([1C8C5AF1930C8ED:D32E10F5A31A1BA6]:0)
   [junit4]    > 	at org.apache.solr.util.TestHarness.update(TestHarness.java:233)
   [junit4]    > 	at org.apache.solr.util.TestHarness.checkUpdateStatus(TestHarness.java:277)
   [junit4]    > 	at org.apache.solr.util.TestHarness.validateUpdate(TestHarness.java:247)
   [junit4]    > 	at org.apache.solr.SolrTestCaseJ4.checkUpdateU(SolrTestCaseJ4.java:415)
   [junit4]    > 	at org.apache.solr.SolrTestCaseJ4.assertU(SolrTestCaseJ4.java:394)
   [junit4]    > 	at org.apache.solr.SolrTestCaseJ4.assertU(SolrTestCaseJ4.java:388)
   [junit4]    > 	at org.apache.solr.SolrTestCaseJ4.clearIndex(SolrTestCaseJ4.java:760)
   [junit4]    > 	at org.apache.solr.handler.dataimport.TestSqlEntityProcessorDelta3.setUp(TestSqlEntityProcessorDelta3.java:67)
   [junit4]    > 	at sun.reflect.NativeMethodAccessorImpl.invoke0(Native Method)
   [junit4]    > 	at sun.reflect.NativeMethodAccessorImpl.invoke(NativeMethodAccessorImpl.java:39)
   [junit4]    > 	at sun.reflect.DelegatingMethodAccessorImpl.invoke(DelegatingMethodAccessorImpl.java:25)
   [junit4]    > 	at java.lang.reflect.Method.invoke(Method.java:597)
   [junit4]    > 	at com.carrotsearch.randomizedtesting.RandomizedRunner.invoke(RandomizedRunner.java:1969)
   [junit4]    > 	at com.carrotsearch.randomizedtesting.RandomizedRunner.access$1100(RandomizedRunner.java:132)
   [junit4]    > 	at com.carrotsearch.randomizedtesting.RandomizedRunner$7.evaluate(RandomizedRunner.java:873)
   [junit4]    > 	at com.carrotsearch.randomizedtesting.RandomizedRunner$8.evaluate(RandomizedRunner.java:889)
   [junit4]    > 	at com.carrotsearch.randomizedtesting.rules.SystemPropertiesRestoreRule$1.evaluate(SystemPropertiesRestoreRule.java:53)
   [junit4]    > 	at org.apache.lucene.util.TestRuleSetupTeardownChained$1.evaluate(TestRuleSetupTeardownChained.java:50)
   [junit4]    > 	at org.apache.lucene.util.TestRuleFieldCacheSanity$1.evaluate(TestRuleFieldCacheSanity.java:32)
   [junit4]    > 	at org.apache.lucene.util.AbstractBeforeAfterRule$1.evaluate(AbstractBeforeAfterRule.java:45)
   [junit4]    > 	at com.carrotsearch.randomizedtesting.rules.SystemPropertiesInvariantRule$1.evaluate(SystemPropertiesInvariantRule.java:55)
   [junit4]    > 	at org.apache.lucene.util.TestRuleReportUncaughtExceptions$1.evaluate(TestRuleReportUncaughtExceptions.java:68)
   [junit4]    > 	at org.apache.lucene.util.TestRuleThreadAndTestName$1.evaluate(TestRuleThreadAndTestName.java:48)
   [junit4]    > 	at org.apache.lucene.util.TestRuleIgnoreAfterMaxFailures$1.evaluate(TestRuleIgnoreAfterMaxFailures.java:70)
   [junit4]    > 	at org.apache.lucene.util.TestRuleMarkFailure$1.evaluate(TestRuleMarkFailure.java:48)
   [junit4]    > 	at com.carrotsearch.randomizedtesting.RandomizedRunner.runSingleTest(RandomizedRunner.java:821)
   [junit4]    > 	at com.carrotsearch.randomizedtesting.RandomizedRunner.access$700(RandomizedRunner.java:132)
   [junit4]    > 	at com.carrotsearch.randomizedtesting.RandomizedRunner$3$1.run(RandomizedRunner.java:669)
   [junit4]    > 	at com.carrotsearch.randomizedtesting.RandomizedRunner$3.evaluate(RandomizedRunner.java:695)
   [junit4]    > 	at com.carrotsearch.randomizedtesting.RandomizedRunner$4.evaluate(RandomizedRunner.java:734)
   [junit4]    > 	at com.carrotsearch.randomizedtesting.RandomizedRunner$5.evaluate(RandomizedRunner.java:745)
   [junit4]    > 	at com.carrotsearch.randomizedtesting.rules.SystemPropertiesRestoreRule$1.evaluate(SystemPropertiesRestoreRule.java:53)
   [junit4]    > 	at org.apache.lucene.util.AbstractBeforeAfterRule$1.evaluate(AbstractBeforeAfterRule.java:45)
   [junit4]    > 	at org.apache.lucene.util.TestRuleReportUncaughtExceptions$1.evaluate(TestRuleReportUncaughtExceptions.java:68)
   [junit4]    > 	at org.apache.lucene.util.TestRuleStoreClassName$1.evaluate(TestRuleStoreClassName.java:38)
   [junit4]    > 	at org.apache.lucene.util.TestRuleIcuHack$1.evaluate(TestRuleIcuHack.java:51)
   [junit4]    > 	at com.carrotsearch.randomizedtesting.rules.SystemPropertiesInvariantRule$1.evaluate(SystemPropertiesInvariantRule.java:55)
   [junit4]    > 	at org.apache.lucene.util.TestRuleNoInstanceHooksOverrides$1.evaluate(TestRuleNoInstanceHooksOverrides.java:53)
   [junit4]    > 	at org.apache.lucene.util.TestRuleNoStaticHooksShadowing$1.evaluate(TestRuleNoStaticHooksShadowing.java:52)
   [junit4]    > 	at org.apache.lucene.util.TestRuleAssertionsRequired$1.evaluate(TestRuleAssertionsRequired.java:36)
   [junit4]    > 	at org.apache.lucene.util.TestRuleMarkFailure$1.evaluate(TestRuleMarkFailure.java:48)
   [junit4]    > 	at org.apache.lucene.util.TestRuleIgnoreAfterMaxFailures$1.evaluate(TestRuleIgnoreAfterMaxFailures.java:70)
   [junit4]    > 	at org.apache.lucene.util.TestRuleIgnoreTestSuites$1.evaluate(TestRuleIgnoreTestSuites.java:55)
   [junit4]    > 	at com.carrotsearch.randomizedtesting.RandomizedRunner.runSuite(RandomizedRunner.java:605)
   [junit4]    > 	at com.carrotsearch.randomizedtesting.RandomizedRunner.access$400(RandomizedRunner.java:132)
   [junit4]    > 	at com.carrotsearch.randomizedtesting.RandomizedRunner$2.run(RandomizedRunner.java:551)
   [junit4]    > Caused by: org.apache.lucene.store.AlreadyClosedException: this IndexWriter is closed
   [junit4]    > 	at org.apache.lucene.index.IndexWriter.ensureOpen(IndexWriter.java:551)
   [junit4]    > 	at org.apache.lucene.index.IndexWriter.ensureOpen(IndexWriter.java:556)
   [junit4]    > 	at org.apache.lucene.index.IndexWriter.deleteAll(IndexWriter.java:1880)
   [junit4]    > 	at org.apache.solr.update.DirectUpdateHandler2.deleteAll(DirectUpdateHandler2.java:138)
   [junit4]    > 	at org.apache.solr.update.DirectUpdateHandler2.deleteByQuery(DirectUpdateHandler2.java:290)
   [junit4]    > 	at org.apache.solr.update.processor.RunUpdateProcessor.processDelete(RunUpdateProcessorFactory.java:67)
   [junit4]    > 	at org.apache.solr.update.processor.UpdateRequestProcessor.processDelete(UpdateRequestProcessor.java:55)
   [junit4]    > 	at org.apache.solr.update.processor.DistributedUpdateProcessor.doDeleteByQuery(DistributedUpdateProcessor.java:719)
   [junit4]    > 	at org.apache.solr.update.processor.DistributedUpdateProcessor.processDelete(DistributedUpdateProcessor.java:592)
   [junit4]    > 	at org.apache.solr.update.processor.UpdateRequestProcessor.processDelete(UpdateRequestProcessor.java:55)
   [junit4]    > 	at org.apache.solr.handler.dataimport.AbstractDataImportHandlerTestCase$TestUpdateRequestProcessor.processDelete(AbstractDataImportHandlerTestCase.java:364)
   [junit4]    > 	at org.apache.solr.handler.loader.XMLLoader.processDelete(XMLLoader.java:330)
   [junit4]    > 	at org.apache.solr.handler.loader.XMLLoader.processUpdate(XMLLoader.java:261)
   [junit4]    > 	at org.apache.solr.handler.loader.XMLLoader.load(XMLLoader.java:157)
   [junit4]    > 	at org.apache.solr.handler.UpdateRequestHandler$1.load(UpdateRequestHandler.java:92)
   [junit4]    > 	at org.apache.solr.handler.ContentStreamHandlerBase.handleRequestBody(ContentStreamHandlerBase.java:74)
   [junit4]    > 	at org.apache.solr.handler.RequestHandlerBase.handleRequest(RequestHandlerBase.java:129)
   [junit4]    > 	at org.apache.solr.core.SolrCore.execute(SolrCore.java:1599)
   [junit4]    > 	at org.apache.solr.servlet.DirectSolrConnection.request(DirectSolrConnection.java:131)
   [junit4]    > 	at org.apache.solr.util.TestHarness.update(TestHarness.java:229)
   [junit4]    > 	... 45 more
   [junit4]    > 
   [junit4]   2> 481 T82 oas.SolrTestCaseJ4.setUp ###Starting testCompositePk_DeltaImport_add
   [junit4]   2> 487 T82 C11 oasu.DirectUpdateHandler2.deleteAll [collection1] REMOVING ALL DOCUMENTS FROM INDEX
   [junit4]   2> 487 T82 C11 UPDATE [collection1] webapp=null path=null params={} {} 0 1
   [junit4]   2> 488 T82 C11 oasc.SolrException.log SEVERE org.apache.lucene.store.AlreadyClosedException: this IndexWriter is closed
   [junit4]   2> 		at org.apache.lucene.index.IndexWriter.ensureOpen(IndexWriter.java:551)
   [junit4]   2> 		at org.apache.lucene.index.IndexWriter.ensureOpen(IndexWriter.java:556)
   [junit4]   2> 		at org.apache.lucene.index.IndexWriter.deleteAll(IndexWriter.java:1880)
   [junit4]   2> 		at org.apache.solr.update.DirectUpdateHandler2.deleteAll(DirectUpdateHandler2.java:138)
   [junit4]   2> 		at org.apache.solr.update.DirectUpdateHandler2.deleteByQuery(DirectUpdateHandler2.java:290)
   [junit4]   2> 		at org.apache.solr.update.processor.RunUpdateProcessor.processDelete(RunUpdateProcessorFactory.java:67)
   [junit4]   2> 		at org.apache.solr.update.processor.UpdateRequestProcessor.processDelete(UpdateRequestProcessor.java:55)
   [junit4]   2> 		at org.apache.solr.update.processor.DistributedUpdateProcessor.doDeleteByQuery(DistributedUpdateProcessor.java:719)
   [junit4]   2> 		at org.apache.solr.update.processor.DistributedUpdateProcessor.processDelete(DistributedUpdateProcessor.java:592)
   [junit4]   2> 		at org.apache.solr.update.processor.UpdateRequestProcessor.processDelete(UpdateRequestProcessor.java:55)
   [junit4]   2> 		at org.apache.solr.handler.dataimport.AbstractDataImportHandlerTestCase$TestUpdateRequestProcessor.processDelete(AbstractDataImportHandlerTestCase.java:364)
   [junit4]   2> 		at org.apache.solr.handler.loader.XMLLoader.processDelete(XMLLoader.java:330)
   [junit4]   2> 		at org.apache.solr.handler.loader.XMLLoader.processUpdate(XMLLoader.java:261)
   [junit4]   2> 		at org.apache.solr.handler.loader.XMLLoader.load(XMLLoader.java:157)
   [junit4]   2> 		at org.apache.solr.handler.UpdateRequestHandler$1.load(UpdateRequestHandler.java:92)
   [junit4]   2> 		at org.apache.solr.handler.ContentStreamHandlerBase.handleRequestBody(ContentStreamHandlerBase.java:74)
   [junit4]   2> 		at org.apache.solr.handler.RequestHandlerBase.handleRequest(RequestHandlerBase.java:129)
   [junit4]   2> 		at org.apache.solr.core.SolrCore.execute(SolrCore.java:1599)
   [junit4]   2> 		at org.apache.solr.servlet.DirectSolrConnection.request(DirectSolrConnection.java:131)
   [junit4]   2> 		at org.apache.solr.util.TestHarness.update(TestHarness.java:229)
   [junit4]   2> 		at org.apache.solr.util.TestHarness.checkUpdateStatus(TestHarness.java:277)
   [junit4]   2> 		at org.apache.solr.util.TestHarness.validateUpdate(TestHarness.java:247)
   [junit4]   2> 		at org.apache.solr.SolrTestCaseJ4.checkUpdateU(SolrTestCaseJ4.java:415)
   [junit4]   2> 		at org.apache.solr.SolrTestCaseJ4.assertU(SolrTestCaseJ4.java:394)
   [junit4]   2> 		at org.apache.solr.SolrTestCaseJ4.assertU(SolrTestCaseJ4.java:388)
   [junit4]   2> 		at org.apache.solr.SolrTestCaseJ4.clearIndex(SolrTestCaseJ4.java:760)
   [junit4]   2> 		at org.apache.solr.handler.dataimport.TestSqlEntityProcessorDelta3.setUp(TestSqlEntityProcessorDelta3.java:67)
   [junit4]   2> 		at sun.reflect.NativeMethodAccessorImpl.invoke0(Native Method)
   [junit4]   2> 		at sun.reflect.NativeMethodAccessorImpl.invoke(NativeMethodAccessorImpl.java:39)
   [junit4]   2> 		at sun.reflect.DelegatingMethodAccessorImpl.invoke(DelegatingMethodAccessorImpl.java:25)
   [junit4]   2> 		at java.lang.reflect.Method.invoke(Method.java:597)
   [junit4]   2> 		at com.carrotsearch.randomizedtesting.RandomizedRunner.invoke(RandomizedRunner.java:1969)
   [junit4]   2> 		at com.carrotsearch.randomizedtesting.RandomizedRunner.access$1100(RandomizedRunner.java:132)
   [junit4]   2> 		at com.carrotsearch.randomizedtesting.RandomizedRunner$7.evaluate(RandomizedRunner.java:873)
   [junit4]   2> 		at com.carrotsearch.randomizedtesting.RandomizedRunner$8.evaluate(RandomizedRunner.java:889)
   [junit4]   2> 		at com.carrotsearch.randomizedtesting.rules.SystemPropertiesRestoreRule$1.evaluate(SystemPropertiesRestoreRule.java:53)
   [junit4]   2> 		at org.apache.lucene.util.TestRuleSetupTeardownChained$1.evaluate(TestRuleSetupTeardownChained.java:50)
   [junit4]   2> 		at org.apache.lucene.util.TestRuleFieldCacheSanity$1.evaluate(TestRuleFieldCacheSanity.java:32)
   [junit4]   2> 		at org.apache.lucene.util.AbstractBeforeAfterRule$1.evaluate(AbstractBeforeAfterRule.java:45)
   [junit4]   2> 		at com.carrotsearch.randomizedtesting.rules.SystemPropertiesInvariantRule$1.evaluate(SystemPropertiesInvariantRule.java:55)
   [junit4]   2> 		at org.apache.lucene.util.TestRuleReportUncaughtExceptions$1.evaluate(TestRuleReportUncaughtExceptions.java:68)
   [junit4]   2> 		at org.apache.lucene.util.TestRuleThreadAndTestName$1.evaluate(TestRuleThreadAndTestName.java:48)
   [junit4]   2> 		at org.apache.lucene.util.TestRuleIgnoreAfterMaxFailures$1.evaluate(TestRuleIgnoreAfterMaxFailures.java:70)
   [junit4]   2> 		at org.apache.lucene.util.TestRuleMarkFailure$1.evaluate(TestRuleMarkFailure.java:48)
   [junit4]   2> 		at com.carrotsearch.randomizedtesting.RandomizedRunner.runSingleTest(RandomizedRunner.java:821)
   [junit4]   2> 		at com.carrotsearch.randomizedtesting.RandomizedRunner.access$700(RandomizedRunner.java:132)
   [junit4]   2> 		at com.carrotsearch.randomizedtesting.RandomizedRunner$3$1.run(RandomizedRunner.java:669)
   [junit4]   2> 		at com.carrotsearch.randomizedtesting.RandomizedRunner$3.evaluate(RandomizedRunner.java:695)
   [junit4]   2> 		at com.carrotsearch.randomizedtesting.RandomizedRunner$4.evaluate(RandomizedRunner.java:734)
   [junit4]   2> 		at com.carrotsearch.randomizedtesting.RandomizedRunner$5.evaluate(RandomizedRunner.java:745)
   [junit4]   2> 		at com.carrotsearch.randomizedtesting.rules.SystemPropertiesRestoreRule$1.evaluate(SystemPropertiesRestoreRule.java:53)
   [junit4]   2> 		at org.apache.lucene.util.AbstractBeforeAfterRule$1.evaluate(AbstractBeforeAfterRule.java:45)
   [junit4]   2> 		at org.apache.lucene.util.TestRuleReportUncaughtExceptions$1.evaluate(TestRuleReportUncaughtExceptions.java:68)
   [junit4]   2> 		at org.apache.lucene.util.TestRuleStoreClassName$1.evaluate(TestRuleStoreClassName.java:38)
   [junit4]   2> 		at org.apache.lucene.util.TestRuleIcuHack$1.evaluate(TestRuleIcuHack.java:51)
   [junit4]   2> 		at com.carrotsearch.randomizedtesting.rules.SystemPropertiesInvariantRule$1.evaluate(SystemPropertiesInvariantRule.java:55)
   [junit4]   2> 		at org.apache.lucene.util.TestRuleNoInstanceHooksOverrides$1.evaluate(TestRuleNoInstanceHooksOverrides.java:53)
   [junit4]   2> 		at org.apache.lucene.util.TestRuleNoStaticHooksShadowing$1.evaluate(TestRuleNoStaticHooksShadowing.java:52)
   [junit4]   2> 		at org.apache.lucene.util.TestRuleAssertionsRequired$1.evaluate(TestRuleAssertionsRequired.java:36)
   [junit4]   2> 		at org.apache.lucene.util.TestRuleMarkFailure$1.evaluate(TestRuleMarkFailure.java:48)
   [junit4]   2> 		at org.apache.lucene.util.TestRuleIgnoreAfterMaxFailures$1.evaluate(TestRuleIgnoreAfterMaxFailures.java:70)
   [junit4]   2> 		at org.apache.lucene.util.TestRuleIgnoreTestSuites$1.evaluate(TestRuleIgnoreTestSuites.java:55)
   [junit4]   2> 		at com.carrotsearch.randomizedtesting.RandomizedRunner.runSuite(RandomizedRunner.java:605)
   [junit4]   2> 		at com.carrotsearch.randomizedtesting.RandomizedRunner.access$400(RandomizedRunner.java:132)
   [junit4]   2> 		at com.carrotsearch.randomizedtesting.RandomizedRunner$2.run(RandomizedRunner.java:551)
   [junit4]   2> 	
   [junit4]   2> 489 T82 oashd.AbstractDataImportHandlerTestCase.tearDown Looking for dataimport.properties at: /mnt/ssd/jenkins/workspace/Lucene-Solr-trunk-Linux-Java6-64/checkout/solr/build/contrib/solr-dataimporthandler/test/J0/solr/collection1/conf/dataimport.properties
   [junit4]   2> 489 T82 oas.SolrTestCaseJ4.tearDown ###Ending testCompositePk_DeltaImport_add
   [junit4]   2> NOTE: reproduce with: ant test  -Dtestcase=TestSqlEntityProcessorDelta3 -Dtests.method=testCompositePk_DeltaImport_add -Dtests.seed=1C8C5AF1930C8ED -Dtests.multiplier=3 -Dtests.slow=true -Dtests.locale=sk_SK -Dtests.timezone=Israel -Dargs="-Dfile.encoding=UTF-8"
   [junit4]   2>
   [junit4] ERROR   0.02s J0 | TestSqlEntityProcessorDelta3.testCompositePk_DeltaImport_empty
   [junit4]    > Throwable #1: org.apache.solr.common.SolrException: org.apache.lucene.store.AlreadyClosedException: this IndexWriter is closed
   [junit4]    > 	at __randomizedtesting.SeedInfo.seed([1C8C5AF1930C8ED:C6CB5EC0B8A595EF]:0)
   [junit4]    > 	at org.apache.solr.util.TestHarness.update(TestHarness.java:233)
   [junit4]    > 	at org.apache.solr.util.TestHarness.checkUpdateStatus(TestHarness.java:277)
   [junit4]    > 	at org.apache.solr.util.TestHarness.validateUpdate(TestHarness.java:247)
   [junit4]    > 	at org.apache.solr.SolrTestCaseJ4.checkUpdateU(SolrTestCaseJ4.java:415)
   [junit4]    > 	at org.apache.solr.SolrTestCaseJ4.assertU(SolrTestCaseJ4.java:394)
   [junit4]    > 	at org.apache.solr.SolrTestCaseJ4.assertU(SolrTestCaseJ4.java:388)
   [junit4]    > 	at org.apache.solr.SolrTestCaseJ4.clearIndex(SolrTestCaseJ4.java:760)
   [junit4]    > 	at org.apache.solr.handler.dataimport.TestSqlEntityProcessorDelta3.setUp(TestSqlEntityProcessorDelta3.java:67)
   [junit4]    > 	at sun.reflect.NativeMethodAccessorImpl.invoke0(Native Method)
   [junit4]    > 	at sun.reflect.NativeMethodAccessorImpl.invoke(NativeMethodAccessorImpl.java:39)
   [junit4]    > 	at sun.reflect.DelegatingMethodAccessorImpl.invoke(DelegatingMethodAccessorImpl.java:25)
   [junit4]    > 	at java.lang.reflect.Method.invoke(Method.java:597)
   [junit4]    > 	at com.carrotsearch.randomizedtesting.RandomizedRunner.invoke(RandomizedRunner.java:1969)
   [junit4]    > 	at com.carrotsearch.randomizedtesting.RandomizedRunner.access$1100(RandomizedRunner.java:132)
   [junit4]    > 	at com.carrotsearch.randomizedtesting.RandomizedRunner$7.evaluate(RandomizedRunner.java:873)
   [junit4]    > 	at com.carrotsearch.randomizedtesting.RandomizedRunner$8.evaluate(RandomizedRunner.java:889)
   [junit4]    > 	at com.carrotsearch.randomizedtesting.rules.SystemPropertiesRestoreRule$1.evaluate(SystemPropertiesRestoreRule.java:53)
   [junit4]    > 	at org.apache.lucene.util.TestRuleSetupTeardownChained$1.evaluate(TestRuleSetupTeardownChained.java:50)
   [junit4]    > 	at org.apache.lucene.util.TestRuleFieldCacheSanity$1.evaluate(TestRuleFieldCacheSanity.java:32)
   [junit4]    > 	at org.apache.lucene.util.AbstractBeforeAfterRule$1.evaluate(AbstractBeforeAfterRule.java:45)
   [junit4]    > 	at com.carrotsearch.randomizedtesting.rules.SystemPropertiesInvariantRule$1.evaluate(SystemPropertiesInvariantRule.java:55)
   [junit4]    > 	at org.apache.lucene.util.TestRuleReportUncaughtExceptions$1.evaluate(TestRuleReportUncaughtExceptions.java:68)
   [junit4]    > 	at org.apache.lucene.util.TestRuleThreadAndTestName$1.evaluate(TestRuleThreadAndTestName.java:48)
   [junit4]    > 	at org.apache.lucene.util.TestRuleIgnoreAfterMaxFailures$1.evaluate(TestRuleIgnoreAfterMaxFailures.java:70)
   [junit4]    > 	at org.apache.lucene.util.TestRuleMarkFailure$1.evaluate(TestRuleMarkFailure.java:48)
   [junit4]    > 	at com.carrotsearch.randomizedtesting.RandomizedRunner.runSingleTest(RandomizedRunner.java:821)
   [junit4]    > 	at com.carrotsearch.randomizedtesting.RandomizedRunner.access$700(RandomizedRunner.java:132)
   [junit4]    > 	at com.carrotsearch.randomizedtesting.RandomizedRunner$3$1.run(RandomizedRunner.java:669)
   [junit4]    > 	at com.carrotsearch.randomizedtesting.RandomizedRunner$3.evaluate(RandomizedRunner.java:695)
   [junit4]    > 	at com.carrotsearch.randomizedtesting.RandomizedRunner$4.evaluate(RandomizedRunner.java:734)
   [junit4]    > 	at com.carrotsearch.randomizedtesting.RandomizedRunner$5.evaluate(RandomizedRunner.java:745)
   [junit4]    > 	at com.carrotsearch.randomizedtesting.rules.SystemPropertiesRestoreRule$1.evaluate(SystemPropertiesRestoreRule.java:53)
   [junit4]    > 	at org.apache.lucene.util.AbstractBeforeAfterRule$1.evaluate(AbstractBeforeAfterRule.java:45)
   [junit4]    > 	at org.apache.lucene.util.TestRuleReportUncaughtExceptions$1.evaluate(TestRuleReportUncaughtExceptions.java:68)
   [junit4]    > 	at org.apache.lucene.util.TestRuleStoreClassName$1.evaluate(TestRuleStoreClassName.java:38)
   [junit4]    > 	at org.apache.lucene.util.TestRuleIcuHack$1.evaluate(TestRuleIcuHack.java:51)
   [junit4]    > 	at com.carrotsearch.randomizedtesting.rules.SystemPropertiesInvariantRule$1.evaluate(SystemPropertiesInvariantRule.java:55)
   [junit4]    > 	at org.apache.lucene.util.TestRuleNoInstanceHooksOverrides$1.evaluate(TestRuleNoInstanceHooksOverrides.java:53)
   [junit4]    > 	at org.apache.lucene.util.TestRuleNoStaticHooksShadowing$1.evaluate(TestRuleNoStaticHooksShadowing.java:52)
   [junit4]    > 	at org.apache.lucene.util.TestRuleAssertionsRequired$1.evaluate(TestRuleAssertionsRequired.java:36)
   [junit4]    > 	at org.apache.lucene.util.TestRuleMarkFailure$1.evaluate(TestRuleMarkFailure.java:48)
   [junit4]    > 	at org.apache.lucene.util.TestRuleIgnoreAfterMaxFailures$1.evaluate(TestRuleIgnoreAfterMaxFailures.java:70)
   [junit4]    > 	at org.apache.lucene.util.TestRuleIgnoreTestSuites$1.evaluate(TestRuleIgnoreTestSuites.java:55)
   [junit4]    > 	at com.carrotsearch.randomizedtesting.RandomizedRunner.runSuite(RandomizedRunner.java:605)
   [junit4]    > 	at com.carrotsearch.randomizedtesting.RandomizedRunner.access$400(RandomizedRunner.java:132)
   [junit4]    > 	at com.carrotsearch.randomizedtesting.RandomizedRunner$2.run(RandomizedRunner.java:551)
   [junit4]    > Caused by: org.apache.lucene.store.AlreadyClosedException: this IndexWriter is closed
   [junit4]    > 	at org.apache.lucene.index.IndexWriter.ensureOpen(IndexWriter.java:551)
   [junit4]    > 	at org.apache.lucene.index.IndexWriter.ensureOpen(IndexWriter.java:556)
   [junit4]    > 	at org.apache.lucene.index.IndexWriter.deleteAll(IndexWriter.java:1880)
   [junit4]    > 	at org.apache.solr.update.DirectUpdateHandler2.deleteAll(DirectUpdateHandler2.java:138)
   [junit4]    > 	at org.apache.solr.update.DirectUpdateHandler2.deleteByQuery(DirectUpdateHandler2.java:290)
   [junit4]    > 	at org.apache.solr.update.processor.RunUpdateProcessor.processDelete(RunUpdateProcessorFactory.java:67)
   [junit4]    > 	at org.apache.solr.update.processor.UpdateRequestProcessor.processDelete(UpdateRequestProcessor.java:55)
   [junit4]    > 	at org.apache.solr.update.processor.DistributedUpdateProcessor.doDeleteByQuery(DistributedUpdateProcessor.java:719)
   [junit4]    > 	at org.apache.solr.update.processor.DistributedUpdateProcessor.processDelete(DistributedUpdateProcessor.java:592)
   [junit4]    > 	at org.apache.solr.update.processor.UpdateRequestProcessor.processDelete(UpdateRequestProcessor.java:55)
   [junit4]    > 	at org.apache.solr.handler.dataimport.AbstractDataImportHandlerTestCase$TestUpdateRequestProcessor.processDelete(AbstractDataImportHandlerTestCase.java:364)
   [junit4]    > 	at org.apache.solr.handler.loader.XMLLoader.processDelete(XMLLoader.java:330)
   [junit4]    > 	at org.apache.solr.handler.loader.XMLLoader.processUpdate(XMLLoader.java:261)
   [junit4]    > 	at org.apache.solr.handler.loader.XMLLoader.load(XMLLoader.java:157)
   [junit4]    > 	at org.apache.solr.handler.UpdateRequestHandler$1.load(UpdateRequestHandler.java:92)
   [junit4]    > 	at org.apache.solr.handler.ContentStreamHandlerBase.handleRequestBody(ContentStreamHandlerBase.java:74)
   [junit4]    > 	at org.apache.solr.handler.RequestHandlerBase.handleRequest(RequestHandlerBase.java:129)
   [junit4]    > 	at org.apache.solr.core.SolrCore.execute(SolrCore.java:1599)
   [junit4]    > 	at org.apache.solr.servlet.DirectSolrConnection.request(DirectSolrConnection.java:131)
   [junit4]    > 	at org.apache.solr.util.TestHarness.update(TestHarness.java:229)
   [junit4]    > 	... 45 more
   [junit4]    > 
   [junit4]   2> 504 T82 oas.SolrTestCaseJ4.setUp ###Starting testCompositePk_DeltaImport_empty
   [junit4]   2> 507 T82 C11 oasu.DirectUpdateHandler2.deleteAll [collection1] REMOVING ALL DOCUMENTS FROM INDEX
   [junit4]   2> 507 T82 C11 UPDATE [collection1] webapp=null path=null params={} {} 0 0
   [junit4]   2> 508 T82 C11 oasc.SolrException.log SEVERE org.apache.lucene.store.AlreadyClosedException: this IndexWriter is closed
   [junit4]   2> 		at org.apache.lucene.index.IndexWriter.ensureOpen(IndexWriter.java:551)
   [junit4]   2> 		at org.apache.lucene.index.IndexWriter.ensureOpen(IndexWriter.java:556)
   [junit4]   2> 		at org.apache.lucene.index.IndexWriter.deleteAll(IndexWriter.java:1880)
   [junit4]   2> 		at org.apache.solr.update.DirectUpdateHandler2.deleteAll(DirectUpdateHandler2.java:138)
   [junit4]   2> 		at org.apache.solr.update.DirectUpdateHandler2.deleteByQuery(DirectUpdateHandler2.java:290)
   [junit4]   2> 		at org.apache.solr.update.processor.RunUpdateProcessor.processDelete(RunUpdateProcessorFactory.java:67)
   [junit4]   2> 		at org.apache.solr.update.processor.UpdateRequestProcessor.processDelete(UpdateRequestProcessor.java:55)
   [junit4]   2> 		at org.apache.solr.update.processor.DistributedUpdateProcessor.doDeleteByQuery(DistributedUpdateProcessor.java:719)
   [junit4]   2> 		at org.apache.solr.update.processor.DistributedUpdateProcessor.processDelete(DistributedUpdateProcessor.java:592)
   [junit4]   2> 		at org.apache.solr.update.processor.UpdateRequestProcessor.processDelete(UpdateRequestProcessor.java:55)
   [junit4]   2> 		at org.apache.solr.handler.dataimport.AbstractDataImportHandlerTestCase$TestUpdateRequestProcessor.processDelete(AbstractDataImportHandlerTestCase.java:364)
   [junit4]   2> 		at org.apache.solr.handler.loader.XMLLoader.processDelete(XMLLoader.java:330)
   [junit4]   2> 		at org.apache.solr.handler.loader.XMLLoader.processUpdate(XMLLoader.java:261)
   [junit4]   2> 		at org.apache.solr.handler.loader.XMLLoader.load(XMLLoader.java:157)
   [junit4]   2> 		at org.apache.solr.handler.UpdateRequestHandler$1.load(UpdateRequestHandler.java:92)
   [junit4]   2> 		at org.apache.solr.handler.ContentStreamHandlerBase.handleRequestBody(ContentStreamHandlerBase.java:74)
   [junit4]   2> 		at org.apache.solr.handler.RequestHandlerBase.handleRequest(RequestHandlerBase.java:129)
   [junit4]   2> 		at org.apache.solr.core.SolrCore.execute(SolrCore.java:1599)
   [junit4]   2> 		at org.apache.solr.servlet.DirectSolrConnection.request(DirectSolrConnection.java:131)
   [junit4]   2> 		at org.apache.solr.util.TestHarness.update(TestHarness.java:229)
   [junit4]   2> 		at org.apache.solr.util.TestHarness.checkUpdateStatus(TestHarness.java:277)
   [junit4]   2> 		at org.apache.solr.util.TestHarness.validateUpdate(TestHarness.java:247)
   [junit4]   2> 		at org.apache.solr.SolrTestCaseJ4.checkUpdateU(SolrTestCaseJ4.java:415)
   [junit4]   2> 		at org.apache.solr.SolrTestCaseJ4.assertU(SolrTestCaseJ4.java:394)
   [junit4]   2> 		at org.apache.solr.SolrTestCaseJ4.assertU(SolrTestCaseJ4.java:388)
   [junit4]   2> 		at org.apache.solr.SolrTestCaseJ4.clearIndex(SolrTestCaseJ4.java:760)
   [junit4]   2> 		at org.apache.solr.handler.dataimport.TestSqlEntityProcessorDelta3.setUp(TestSqlEntityProcessorDelta3.java:67)
   [junit4]   2> 		at sun.reflect.NativeMethodAccessorImpl.invoke0(Native Method)
   [junit4]   2> 		at sun.reflect.NativeMethodAccessorImpl.invoke(NativeMethodAccessorImpl.java:39)
   [junit4]   2> 		at sun.reflect.DelegatingMethodAccessorImpl.invoke(DelegatingMethodAccessorImpl.java:25)
   [junit4]   2> 		at java.lang.reflect.Method.invoke(Method.java:597)
   [junit4]   2> 		at com.carrotsearch.randomizedtesting.RandomizedRunner.invoke(RandomizedRunner.java:1969)
   [junit4]   2> 		at com.carrotsearch.randomizedtesting.RandomizedRunner.access$1100(RandomizedRunner.java:132)
   [junit4]   2> 		at com.carrotsearch.randomizedtesting.RandomizedRunner$7.evaluate(RandomizedRunner.java:873)
   [junit4]   2> 		at com.carrotsearch.randomizedtesting.RandomizedRunner$8.evaluate(RandomizedRunner.java:889)
   [junit4]   2> 		at com.carrotsearch.randomizedtesting.rules.SystemPropertiesRestoreRule$1.evaluate(SystemPropertiesRestoreRule.java:53)
   [junit4]   2> 		at org.apache.lucene.util.TestRuleSetupTeardownChained$1.evaluate(TestRuleSetupTeardownChained.java:50)
   [junit4]   2> 		at org.apache.lucene.util.TestRuleFieldCacheSanity$1.evaluate(TestRuleFieldCacheSanity.java:32)
   [junit4]   2> 		at org.apache.lucene.util.AbstractBeforeAfterRule$1.evaluate(AbstractBeforeAfterRule.java:45)
   [junit4]   2> 		at com.carrotsearch.randomizedtesting.rules.SystemPropertiesInvariantRule$1.evaluate(SystemPropertiesInvariantRule.java:55)
   [junit4]   2> 		at org.apache.lucene.util.TestRuleReportUncaughtExceptions$1.evaluate(TestRuleReportUncaughtExceptions.java:68)
   [junit4]   2> 		at org.apache.lucene.util.TestRuleThreadAndTestName$1.evaluate(TestRuleThreadAndTestName.java:48)
   [junit4]   2> 		at org.apache.lucene.util.TestRuleIgnoreAfterMaxFailures$1.evaluate(TestRuleIgnoreAfterMaxFailures.java:70)
   [junit4]   2> 		at org.apache.lucene.util.TestRuleMarkFailure$1.evaluate(TestRuleMarkFailure.java:48)
   [junit4]   2> 		at com.carrotsearch.randomizedtesting.RandomizedRunner.runSingleTest(RandomizedRunner.java:821)
   [junit4]   2> 		at com.carrotsearch.randomizedtesting.RandomizedRunner.access$700(RandomizedRunner.java:132)
   [junit4]   2> 		at com.carrotsearch.randomizedtesting.RandomizedRunner$3$1.run(RandomizedRunner.java:669)
   [junit4]   2> 		at com.carrotsearch.randomizedtesting.RandomizedRunner$3.evaluate(RandomizedRunner.java:695)
   [junit4]   2> 		at com.carrotsearch.randomizedtesting.RandomizedRunner$4.evaluate(RandomizedRunner.java:734)
   [junit4]   2> 		at com.carrotsearch.randomizedtesting.RandomizedRunner$5.evaluate(RandomizedRunner.java:745)
   [junit4]   2> 		at com.carrotsearch.randomizedtesting.rules.SystemPropertiesRestoreRule$1.evaluate(SystemPropertiesRestoreRule.java:53)
   [junit4]   2> 		at org.apache.lucene.util.AbstractBeforeAfterRule$1.evaluate(AbstractBeforeAfterRule.java:45)
   [junit4]   2> 		at org.apache.lucene.util.TestRuleReportUncaughtExceptions$1.evaluate(TestRuleReportUncaughtExceptions.java:68)
   [junit4]   2> 		at org.apache.lucene.util.TestRuleStoreClassName$1.evaluate(TestRuleStoreClassName.java:38)
   [junit4]   2> 		at org.apache.lucene.util.TestRuleIcuHack$1.evaluate(TestRuleIcuHack.java:51)
   [junit4]   2> 		at com.carrotsearch.randomizedtesting.rules.SystemPropertiesInvariantRule$1.evaluate(SystemPropertiesInvariantRule.java:55)
   [junit4]   2> 		at org.apache.lucene.util.TestRuleNoInstanceHooksOverrides$1.evaluate(TestRuleNoInstanceHooksOverrides.java:53)
   [junit4]   2> 		at org.apache.lucene.util.TestRuleNoStaticHooksShadowing$1.evaluate(TestRuleNoStaticHooksShadowing.java:52)
   [junit4]   2> 		at org.apache.lucene.util.TestRuleAssertionsRequired$1.evaluate(TestRuleAssertionsRequired.java:36)
   [junit4]   2> 		at org.apache.lucene.util.TestRuleMarkFailure$1.evaluate(TestRuleMarkFailure.java:48)
   [junit4]   2> 		at org.apache.lucene.util.TestRuleIgnoreAfterMaxFailures$1.evaluate(TestRuleIgnoreAfterMaxFailures.java:70)
   [junit4]   2> 		at org.apache.lucene.util.TestRuleIgnoreTestSuites$1.evaluate(TestRuleIgnoreTestSuites.java:55)
   [junit4]   2> 		at com.carrotsearch.randomizedtesting.RandomizedRunner.runSuite(RandomizedRunner.java:605)
   [junit4]   2> 		at com.carrotsearch.randomizedtesting.RandomizedRunner.access$400(RandomizedRunner.java:132)
   [junit4]   2> 		at com.carrotsearch.randomizedtesting.RandomizedRunner$2.run(RandomizedRunner.java:551)
   [junit4]   2> 	
   [junit4]   2> 509 T82 oashd.AbstractDataImportHandlerTestCase.tearDown Looking for dataimport.properties at: /mnt/ssd/jenkins/workspace/Lucene-Solr-trunk-Linux-Java6-64/checkout/solr/build/contrib/solr-dataimporthandler/test/J0/solr/collection1/conf/dataimport.properties
   [junit4]   2> 510 T82 oas.SolrTestCaseJ4.tearDown ###Ending testCompositePk_DeltaImport_empty
   [junit4]   2> NOTE: reproduce with: ant test  -Dtestcase=TestSqlEntityProcessorDelta3 -Dtests.method=testCompositePk_DeltaImport_empty -Dtests.seed=1C8C5AF1930C8ED -Dtests.multiplier=3 -Dtests.slow=true -Dtests.locale=sk_SK -Dtests.timezone=Israel -Dargs="-Dfile.encoding=UTF-8"
   [junit4]   2>
   [junit4] ERROR   0.02s J0 | TestSqlEntityProcessorDelta3.testCompositePk_FullImport
   [junit4]    > Throwable #1: org.apache.solr.common.SolrException: org.apache.lucene.store.AlreadyClosedException: this IndexWriter is closed
   [junit4]    > 	at __randomizedtesting.SeedInfo.seed([1C8C5AF1930C8ED:5FA18B98C368983B]:0)
   [junit4]    > 	at org.apache.solr.util.TestHarness.update(TestHarness.java:233)
   [junit4]    > 	at org.apache.solr.util.TestHarness.checkUpdateStatus(TestHarness.java:277)
   [junit4]    > 	at org.apache.solr.util.TestHarness.validateUpdate(TestHarness.java:247)
   [junit4]    > 	at org.apache.solr.SolrTestCaseJ4.checkUpdateU(SolrTestCaseJ4.java:415)
   [junit4]    > 	at org.apache.solr.SolrTestCaseJ4.assertU(SolrTestCaseJ4.java:394)
   [junit4]    > 	at org.apache.solr.SolrTestCaseJ4.assertU(SolrTestCaseJ4.java:388)
   [junit4]    > 	at org.apache.solr.SolrTestCaseJ4.clearIndex(SolrTestCaseJ4.java:760)
   [junit4]    > 	at org.apache.solr.handler.dataimport.TestSqlEntityProcessorDelta3.setUp(TestSqlEntityProcessorDelta3.java:67)
   [junit4]    > 	at sun.reflect.NativeMethodAccessorImpl.invoke0(Native Method)
   [junit4]    > 	at sun.reflect.NativeMethodAccessorImpl.invoke(NativeMethodAccessorImpl.java:39)
   [junit4]    > 	at sun.reflect.DelegatingMethodAccessorImpl.invoke(DelegatingMethodAccessorImpl.java:25)
   [junit4]    > 	at java.lang.reflect.Method.invoke(Method.java:597)
   [junit4]    > 	at com.carrotsearch.randomizedtesting.RandomizedRunner.invoke(RandomizedRunner.java:1969)
   [junit4]    > 	at com.carrotsearch.randomizedtesting.RandomizedRunner.access$1100(RandomizedRunner.java:132)
   [junit4]    > 	at com.carrotsearch.randomizedtesting.RandomizedRunner$7.evaluate(RandomizedRunner.java:873)
   [junit4]    > 	at com.carrotsearch.randomizedtesting.RandomizedRunner$8.evaluate(RandomizedRunner.java:889)
   [junit4]    > 	at com.carrotsearch.randomizedtesting.rules.SystemPropertiesRestoreRule$1.evaluate(SystemPropertiesRestoreRule.java:53)
   [junit4]    > 	at org.apache.lucene.util.TestRuleSetupTeardownChained$1.evaluate(TestRuleSetupTeardownChained.java:50)
   [junit4]    > 	at org.apache.lucene.util.TestRuleFieldCacheSanity$1.evaluate(TestRuleFieldCacheSanity.java:32)
   [junit4]    > 	at org.apache.lucene.util.AbstractBeforeAfterRule$1.evaluate(AbstractBeforeAfterRule.java:45)
   [junit4]    > 	at com.carrotsearch.randomizedtesting.rules.SystemPropertiesInvariantRule$1.evaluate(SystemPropertiesInvariantRule.java:55)
   [junit4]    > 	at org.apache.lucene.util.TestRuleReportUncaughtExceptions$1.evaluate(TestRuleReportUncaughtExceptions.java:68)
   [junit4]    > 	at org.apache.lucene.util.TestRuleThreadAndTestName$1.evaluate(TestRuleThreadAndTestName.java:48)
   [junit4]    > 	at org.apache.lucene.util.TestRuleIgnoreAfterMaxFailures$1.evaluate(TestRuleIgnoreAfterMaxFailures.java:70)
   [junit4]    > 	at org.apache.lucene.util.TestRuleMarkFailure$1.evaluate(TestRuleMarkFailure.java:48)
   [junit4]    > 	at com.carrotsearch.randomizedtesting.RandomizedRunner.runSingleTest(RandomizedRunner.java:821)
   [junit4]    > 	at com.carrotsearch.randomizedtesting.RandomizedRunner.access$700(RandomizedRunner.java:132)
   [junit4]    > 	at com.carrotsearch.randomizedtesting.RandomizedRunner$3$1.run(RandomizedRunner.java:669)
   [junit4]    > 	at com.carrotsearch.randomizedtesting.RandomizedRunner$3.evaluate(RandomizedRunner.java:695)
   [junit4]    > 	at com.carrotsearch.randomizedtesting.RandomizedRunner$4.evaluate(RandomizedRunner.java:734)
   [junit4]    > 	at com.carrotsearch.randomizedtesting.RandomizedRunner$5.evaluate(RandomizedRunner.java:745)
   [junit4]    > 	at com.carrotsearch.randomizedtesting.rules.SystemPropertiesRestoreRule$1.evaluate(SystemPropertiesRestoreRule.java:53)
   [junit4]    > 	at org.apache.lucene.util.AbstractBeforeAfterRule$1.evaluate(AbstractBeforeAfterRule.java:45)
   [junit4]    > 	at org.apache.lucene.util.TestRuleReportUncaughtExceptions$1.evaluate(TestRuleReportUncaughtExceptions.java:68)
   [junit4]    > 	at org.apache.lucene.util.TestRuleStoreClassName$1.evaluate(TestRuleStoreClassName.java:38)
   [junit4]    > 	at org.apache.lucene.util.TestRuleIcuHack$1.evaluate(TestRuleIcuHack.java:51)
   [junit4]    > 	at com.carrotsearch.randomizedtesting.rules.SystemPropertiesInvariantRule$1.evaluate(SystemPropertiesInvariantRule.java:55)
   [junit4]    > 	at org.apache.lucene.util.TestRuleNoInstanceHooksOverrides$1.evaluate(TestRuleNoInstanceHooksOverrides.java:53)
   [junit4]    > 	at org.apache.lucene.util.TestRuleNoStaticHooksShadowing$1.evaluate(TestRuleNoStaticHooksShadowing.java:52)
   [junit4]    > 	at org.apache.lucene.util.TestRuleAssertionsRequired$1.evaluate(TestRuleAssertionsRequired.java:36)
   [junit4]    > 	at org.apache.lucene.util.TestRuleMarkFailure$1.evaluate(TestRuleMarkFailure.java:48)
   [junit4]    > 	at org.apache.lucene.util.TestRuleIgnoreAfterMaxFailures$1.evaluate(TestRuleIgnoreAfterMaxFailures.java:70)
   [junit4]    > 	at org.apache.lucene.util.TestRuleIgnoreTestSuites$1.evaluate(TestRuleIgnoreTestSuites.java:55)
   [junit4]    > 	at com.carrotsearch.randomizedtesting.RandomizedRunner.runSuite(RandomizedRunner.java:605)
   [junit4]    > 	at com.carrotsearch.randomizedtesting.RandomizedRunner.access$400(RandomizedRunner.java:132)
   [junit4]    > 	at com.carrotsearch.randomizedtesting.RandomizedRunner$2.run(RandomizedRunner.java:551)
   [junit4]    > Caused by: org.apache.lucene.store.AlreadyClosedException: this IndexWriter is closed
   [junit4]    > 	at org.apache.lucene.index.IndexWriter.ensureOpen(IndexWriter.java:551)
   [junit4]    > 	at org.apache.lucene.index.IndexWriter.ensureOpen(IndexWriter.java:556)
   [junit4]    > 	at org.apache.lucene.index.IndexWriter.deleteAll(IndexWriter.java:1880)
   [junit4]    > 	at org.apache.solr.update.DirectUpdateHandler2.deleteAll(DirectUpdateHandler2.java:138)
   [junit4]    > 	at org.apache.solr.update.DirectUpdateHandler2.deleteByQuery(DirectUpdateHandler2.java:290)
   [junit4]    > 	at org.apache.solr.update.processor.RunUpdateProcessor.processDelete(RunUpdateProcessorFactory.java:67)
   [junit4]    > 	at org.apache.solr.update.processor.UpdateRequestProcessor.processDelete(UpdateRequestProcessor.java:55)
   [junit4]    > 	at org.apache.solr.update.processor.DistributedUpdateProcessor.doDeleteByQuery(DistributedUpdateProcessor.java:719)
   [junit4]    > 	at org.apache.solr.update.processor.DistributedUpdateProcessor.processDelete(DistributedUpdateProcessor.java:592)
   [junit4]    > 	at org.apache.solr.update.processor.UpdateRequestProcessor.processDelete(UpdateRequestProcessor.java:55)
   [junit4]    > 	at org.apache.solr.handler.dataimport.AbstractDataImportHandlerTestCase$TestUpdateRequestProcessor.processDelete(AbstractDataImportHandlerTestCase.java:364)
   [junit4]    > 	at org.apache.solr.handler.loader.XMLLoader.processDelete(XMLLoader.java:330)
   [junit4]    > 	at org.apache.solr.handler.loader.XMLLoader.processUpdate(XMLLoader.java:261)
   [junit4]    > 	at org.apache.solr.handler.loader.XMLLoader.load(XMLLoader.java:157)
   [junit4]    > 	at org.apache.solr.handler.UpdateRequestHandler$1.load(UpdateRequestHandler.java:92)
   [junit4]    > 	at org.apache.solr.handler.ContentStreamHandlerBase.handleRequestBody(ContentStreamHandlerBase.java:74)
   [junit4]    > 	at org.apache.solr.handler.RequestHandlerBase.handleRequest(RequestHandlerBase.java:129)
   [junit4]    > 	at org.apache.solr.core.SolrCore.execute(SolrCore.java:1599)
   [junit4]    > 	at org.apache.solr.servlet.DirectSolrConnection.request(DirectSolrConnection.java:131)
   [junit4]    > 	at org.apache.solr.util.TestHarness.update(TestHarness.java:229)
   [junit4]    > 	... 45 more
   [junit4]    > 
   [junit4]   2> 524 T82 oas.SolrTestCaseJ4.setUp ###Starting testCompositePk_FullImport
   [junit4]   2> 530 T82 C11 oasu.DirectUpdateHandler2.deleteAll [collection1] REMOVING ALL DOCUMENTS FROM INDEX
   [junit4]   2> 530 T82 C11 UPDATE [collection1] webapp=null path=null params={} {} 0 1
   [junit4]   2> 531 T82 C11 oasc.SolrException.log SEVERE org.apache.lucene.store.AlreadyClosedException: this IndexWriter is closed
   [junit4]   2> 		at org.apache.lucene.index.IndexWriter.ensureOpen(IndexWriter.java:551)
   [junit4]   2> 		at org.apache.lucene.index.IndexWriter.ensureOpen(IndexWriter.java:556)
   [junit4]   2> 		at org.apache.lucene.index.IndexWriter.deleteAll(IndexWriter.java:1880)
   [junit4]   2> 		at org.apache.solr.update.DirectUpdateHandler2.deleteAll(DirectUpdateHandler2.java:138)
   [junit4]   2> 		at org.apache.solr.update.DirectUpdateHandler2.deleteByQuery(DirectUpdateHandler2.java:290)
   [junit4]   2> 		at org.apache.solr.update.processor.RunUpdateProcessor.processDelete(RunUpdateProcessorFactory.java:67)
   [junit4]   2> 		at org.apache.solr.update.processor.UpdateRequestProcessor.processDelete(UpdateRequestProcessor.java:55)
   [junit4]   2> 		at org.apache.solr.update.processor.DistributedUpdateProcessor.doDeleteByQuery(DistributedUpdateProcessor.java:719)
   [junit4]   2> 		at org.apache.solr.update.processor.DistributedUpdateProcessor.processDelete(DistributedUpdateProcessor.java:592)
   [junit4]   2> 		at org.apache.solr.update.processor.UpdateRequestProcessor.processDelete(UpdateRequestProcessor.java:55)
   [junit4]   2> 		at org.apache.solr.handler.dataimport.AbstractDataImportHandlerTestCase$TestUpdateRequestProcessor.processDelete(AbstractDataImportHandlerTestCase.java:364)
   [junit4]   2> 		at org.apache.solr.handler.loader.XMLLoader.processDelete(XMLLoader.java:330)
   [junit4]   2> 		at org.apache.solr.handler.loader.XMLLoader.processUpdate(XMLLoader.java:261)
   [junit4]   2> 		at org.apache.solr.handler.loader.XMLLoader.load(XMLLoader.java:157)
   [junit4]   2> 		at org.apache.solr.handler.UpdateRequestHandler$1.load(UpdateRequestHandler.java:92)
   [junit4]   2> 		at org.apache.solr.handler.ContentStreamHandlerBase.handleRequestBody(ContentStreamHandlerBase.java:74)
   [junit4]   2> 		at org.apache.solr.handler.RequestHandlerBase.handleRequest(RequestHandlerBase.java:129)
   [junit4]   2> 		at org.apache.solr.core.SolrCore.execute(SolrCore.java:1599)
   [junit4]   2> 		at org.apache.solr.servlet.DirectSolrConnection.request(DirectSolrConnection.java:131)
   [junit4]   2> 		at org.apache.solr.util.TestHarness.update(TestHarness.java:229)
   [junit4]   2> 		at org.apache.solr.util.TestHarness.checkUpdateStatus(TestHarness.java:277)
   [junit4]   2> 		at org.apache.solr.util.TestHarness.validateUpdate(TestHarness.java:247)
   [junit4]   2> 		at org.apache.solr.SolrTestCaseJ4.checkUpdateU(SolrTestCaseJ4.java:415)
   [junit4]   2> 		at org.apache.solr.SolrTestCaseJ4.assertU(SolrTestCaseJ4.java:394)
   [junit4]   2> 		at org.apache.solr.SolrTestCaseJ4.assertU(SolrTestCaseJ4.java:388)
   [junit4]   2> 		at org.apache.solr.SolrTestCaseJ4.clearIndex(SolrTestCaseJ4.java:760)
   [junit4]   2> 		at org.apache.solr.handler.dataimport.TestSqlEntityProcessorDelta3.setUp(TestSqlEntityProcessorDelta3.java:67)
   [junit4]   2> 		at sun.reflect.NativeMethodAccessorImpl.invoke0(Native Method)
   [junit4]   2> 		at sun.reflect.NativeMethodAccessorImpl.invoke(NativeMethodAccessorImpl.java:39)
   [junit4]   2> 		at sun.reflect.DelegatingMethodAccessorImpl.invoke(DelegatingMethodAccessorImpl.java:25)
   [junit4]   2> 		at java.lang.reflect.Method.invoke(Method.java:597)
   [junit4]   2> 		at com.carrotsearch.randomizedtesting.RandomizedRunner.invoke(RandomizedRunner.java:1969)
   [junit4]   2> 		at com.carrotsearch.randomizedtesting.RandomizedRunner.access$1100(RandomizedRunner.java:132)
   [junit4]   2> 		at com.carrotsearch.randomizedtesting.RandomizedRunner$7.evaluate(RandomizedRunner.java:873)
   [junit4]   2> 		at com.carrotsearch.randomizedtesting.RandomizedRunner$8.evaluate(RandomizedRunner.java:889)
   [junit4]   2> 		at com.carrotsearch.randomizedtesting.rules.SystemPropertiesRestoreRule$1.evaluate(SystemPropertiesRestoreRule.java:53)
   [junit4]   2> 		at org.apache.lucene.util.TestRuleSetupTeardownChained$1.evaluate(TestRuleSetupTeardownChained.java:50)
   [junit4]   2> 		at org.apache.lucene.util.TestRuleFieldCacheSanity$1.evaluate(TestRuleFieldCacheSanity.java:32)
   [junit4]   2> 		at org.apache.lucene.util.AbstractBeforeAfterRule$1.evaluate(AbstractBeforeAfterRule.java:45)
   [junit4]   2> 		at com.carrotsearch.randomizedtesting.rules.SystemPropertiesInvariantRule$1.evaluate(SystemPropertiesInvariantRule.java:55)
   [junit4]   2> 		at org.apache.lucene.util.TestRuleReportUncaughtExceptions$1.evaluate(TestRuleReportUncaughtExceptions.java:68)
   [junit4]   2> 		at org.apache.lucene.util.TestRuleThreadAndTestName$1.evaluate(TestRuleThreadAndTestName.java:48)
   [junit4]   2> 		at org.apache.lucene.util.TestRuleIgnoreAfterMaxFailures$1.evaluate(TestRuleIgnoreAfterMaxFailures.java:70)
   [junit4]   2> 		at org.apache.lucene.util.TestRuleMarkFailure$1.evaluate(TestRuleMarkFailure.java:48)
   [junit4]   2> 		at com.carrotsearch.randomizedtesting.RandomizedRunner.runSingleTest(RandomizedRunner.java:821)
   [junit4]   2> 		at com.carrotsearch.randomizedtesting.RandomizedRunner.access$700(RandomizedRunner.java:132)
   [junit4]   2> 		at com.carrotsearch.randomizedtesting.RandomizedRunner$3$1.run(RandomizedRunner.java:669)
   [junit4]   2> 		at com.carrotsearch.randomizedtesting.RandomizedRunner$3.evaluate(RandomizedRunner.java:695)
   [junit4]   2> 		at com.carrotsearch.randomizedtesting.RandomizedRunner$4.evaluate(RandomizedRunner.java:734)
   [junit4]   2> 		at com.carrotsearch.randomizedtesting.RandomizedRunner$5.evaluate(RandomizedRunner.java:745)
   [junit4]   2> 		at com.carrotsearch.randomizedtesting.rules.SystemPropertiesRestoreRule$1.evaluate(SystemPropertiesRestoreRule.java:53)
   [junit4]   2> 		at org.apache.lucene.util.AbstractBeforeAfterRule$1.evaluate(AbstractBeforeAfterRule.java:45)
   [junit4]   2> 		at org.apache.lucene.util.TestRuleReportUncaughtExceptions$1.evaluate(TestRuleReportUncaughtExceptions.java:68)
   [junit4]   2> 		at org.apache.lucene.util.TestRuleStoreClassName$1.evaluate(TestRuleStoreClassName.java:38)
   [junit4]   2> 		at org.apache.lucene.util.TestRuleIcuHack$1.evaluate(TestRuleIcuHack.java:51)
   [junit4]   2> 		at com.carrotsearch.randomizedtesting.rules.SystemPropertiesInvariantRule$1.evaluate(SystemPropertiesInvariantRule.java:55)
   [junit4]   2> 		at org.apache.lucene.util.TestRuleNoInstanceHooksOverrides$1.evaluate(TestRuleNoInstanceHooksOverrides.java:53)
   [junit4]   2> 		at org.apache.lucene.util.TestRuleNoStaticHooksShadowing$1.evaluate(TestRuleNoStaticHooksShadowing.java:52)
   [junit4]   2> 		at org.apache.lucene.util.TestRuleAssertionsRequired$1.evaluate(TestRuleAssertionsRequired.java:36)
   [junit4]   2> 		at org.apache.lucene.util.TestRuleMarkFailure$1.evaluate(TestRuleMarkFailure.java:48)
   [junit4]   2> 		at org.apache.lucene.util.TestRuleIgnoreAfterMaxFailures$1.evaluate(TestRuleIgnoreAfterMaxFailures.java:70)
   [junit4]   2> 		at org.apache.lucene.util.TestRuleIgnoreTestSuites$1.evaluate(TestRuleIgnoreTestSuites.java:55)
   [junit4]   2> 		at com.carrotsearch.randomizedtesting.RandomizedRunner.runSuite(RandomizedRunner.java:605)
   [junit4]   2> 		at com.carrotsearch.randomizedtesting.RandomizedRunner.access$400(RandomizedRunner.java:132)
   [junit4]   2> 		at com.carrotsearch.randomizedtesting.RandomizedRunner$2.run(RandomizedRunner.java:551)
   [junit4]   2> 	
   [junit4]   2> 533 T82 oashd.AbstractDataImportHandlerTestCase.tearDown Looking for dataimport.properties at: /mnt/ssd/jenkins/workspace/Lucene-Solr-trunk-Linux-Java6-64/checkout/solr/build/contrib/solr-dataimporthandler/test/J0/solr/collection1/conf/dataimport.properties
   [junit4]   2> 533 T82 oas.SolrTestCaseJ4.tearDown ###Ending testCompositePk_FullImport
   [junit4]   2> NOTE: reproduce with: ant test  -Dtestcase=TestSqlEntityProcessorDelta3 -Dtests.method=testCompositePk_FullImport -Dtests.seed=1C8C5AF1930C8ED -Dtests.multiplier=3 -Dtests.slow=true -Dtests.locale=sk_SK -Dtests.timezone=Israel -Dargs="-Dfile.encoding=UTF-8"
   [junit4]   2>
   [junit4] ERROR   0.02s J0 | TestSqlEntityProcessorDelta3.testCompositePk_DeltaImport_nodelta
   [junit4]    > Throwable #1: org.apache.solr.common.SolrException: org.apache.lucene.store.AlreadyClosedException: this IndexWriter is closed
   [junit4]    > 	at __randomizedtesting.SeedInfo.seed([1C8C5AF1930C8ED:D231315D7A7D3E71]:0)
   [junit4]    > 	at org.apache.solr.util.TestHarness.update(TestHarness.java:233)
   [junit4]    > 	at org.apache.solr.util.TestHarness.checkUpdateStatus(TestHarness.java:277)
   [junit4]    > 	at org.apache.solr.util.TestHarness.validateUpdate(TestHarness.java:247)
   [junit4]    > 	at org.apache.solr.SolrTestCaseJ4.checkUpdateU(SolrTestCaseJ4.java:415)
   [junit4]    > 	at org.apache.solr.SolrTestCaseJ4.assertU(SolrTestCaseJ4.java:394)
   [junit4]    > 	at org.apache.solr.SolrTestCaseJ4.assertU(SolrTestCaseJ4.java:388)
   [junit4]    > 	at org.apache.solr.SolrTestCaseJ4.clearIndex(SolrTestCaseJ4.java:760)
   [junit4]    > 	at org.apache.solr.handler.dataimport.TestSqlEntityProcessorDelta3.setUp(TestSqlEntityProcessorDelta3.java:67)
   [junit4]    > 	at sun.reflect.NativeMethodAccessorImpl.invoke0(Native Method)
   [junit4]    > 	at sun.reflect.NativeMethodAccessorImpl.invoke(NativeMethodAccessorImpl.java:39)
   [junit4]    > 	at sun.reflect.DelegatingMethodAccessorImpl.invoke(DelegatingMethodAccessorImpl.java:25)
   [junit4]    > 	at java.lang.reflect.Method.invoke(Method.java:597)
   [junit4]    > 	at com.carrotsearch.randomizedtesting.RandomizedRunner.invoke(RandomizedRunner.java:1969)
   [junit4]    > 	at com.carrotsearch.randomizedtesting.RandomizedRunner.access$1100(RandomizedRunner.java:132)
   [junit4]    > 	at com.carrotsearch.randomizedtesting.RandomizedRunner$7.evaluate(RandomizedRunner.java:873)
   [junit4]    > 	at com.carrotsearch.randomizedtesting.RandomizedRunner$8.evaluate(RandomizedRunner.java:889)
   [junit4]    > 	at com.carrotsearch.randomizedtesting.rules.SystemPropertiesRestoreRule$1.evaluate(SystemPropertiesRestoreRule.java:53)
   [junit4]    > 	at org.apache.lucene.util.TestRuleSetupTeardownChained$1.evaluate(TestRuleSetupTeardownChained.java:50)
   [junit4]    > 	at org.apache.lucene.util.TestRuleFieldCacheSanity$1.evaluate(TestRuleFieldCacheSanity.java:32)
   [junit4]    > 	at org.apache.lucene.util.AbstractBeforeAfterRule$1.evaluate(AbstractBeforeAfterRule.java:45)
   [junit4]    > 	at com.carrotsearch.randomizedtesting.rules.SystemPropertiesInvariantRule$1.evaluate(SystemPropertiesInvariantRule.java:55)
   [junit4]    > 	at org.apache.lucene.util.TestRuleReportUncaughtExceptions$1.evaluate(TestRuleReportUncaughtExceptions.java:68)
   [junit4]    > 	at org.apache.lucene.util.TestRuleThreadAndTestName$1.evaluate(TestRuleThreadAndTestName.java:48)
   [junit4]    > 	at org.apache.lucene.util.TestRuleIgnoreAfterMaxFailures$1.evaluate(TestRuleIgnoreAfterMaxFailures.java:70)
   [junit4]    > 	at org.apache.lucene.util.TestRuleMarkFailure$1.evaluate(TestRuleMarkFailure.java:48)
   [junit4]    > 	at com.carrotsearch.randomizedtesting.RandomizedRunner.runSingleTest(RandomizedRunner.java:821)
   [junit4]    > 	at com.carrotsearch.randomizedtesting.RandomizedRunner.access$700(RandomizedRunner.java:132)
   [junit4]    > 	at com.carrotsearch.randomizedtesting.RandomizedRunner$3$1.run(RandomizedRunner.java:669)
   [junit4]    > 	at com.carrotsearch.randomizedtesting.RandomizedRunner$3.evaluate(RandomizedRunner.java:695)
   [junit4]    > 	at com.carrotsearch.randomizedtesting.RandomizedRunner$4.evaluate(RandomizedRunner.java:734)
   [junit4]    > 	at com.carrotsearch.randomizedtesting.RandomizedRunner$5.evaluate(RandomizedRunner.java:745)
   [junit4]    > 	at com.carrotsearch.randomizedtesting.rules.SystemPropertiesRestoreRule$1.evaluate(SystemPropertiesRestoreRule.java:53)
   [junit4]    > 	at org.apache.lucene.util.AbstractBeforeAfterRule$1.evaluate(AbstractBeforeAfterRule.java:45)
   [junit4]    > 	at org.apache.lucene.util.TestRuleReportUncaughtExceptions$1.evaluate(TestRuleReportUncaughtExceptions.java:68)
   [junit4]    > 	at org.apache.lucene.util.TestRuleStoreClassName$1.evaluate(TestRuleStoreClassName.java:38)
   [junit4]    > 	at org.apache.lucene.util.TestRuleIcuHack$1.evaluate(TestRuleIcuHack.java:51)
   [junit4]    > 	at com.carrotsearch.randomizedtesting.rules.SystemPropertiesInvariantRule$1.evaluate(SystemPropertiesInvariantRule.java:55)
   [junit4]    > 	at org.apache.lucene.util.TestRuleNoInstanceHooksOverrides$1.evaluate(TestRuleNoInstanceHooksOverrides.java:53)
   [junit4]    > 	at org.apache.lucene.util.TestRuleNoStaticHooksShadowing$1.evaluate(TestRuleNoStaticHooksShadowing.java:52)
   [junit4]    > 	at org.apache.lucene.util.TestRuleAssertionsRequired$1.evaluate(TestRuleAssertionsRequired.java:36)
   [junit4]    > 	at org.apache.lucene.util.TestRuleMarkFailure$1.evaluate(TestRuleMarkFailure.java:48)
   [junit4]    > 	at org.apache.lucene.util.TestRuleIgnoreAfterMaxFailures$1.evaluate(TestRuleIgnoreAfterMaxFailures.java:70)
   [junit4]    > 	at org.apache.lucene.util.TestRuleIgnoreTestSuites$1.evaluate(TestRuleIgnoreTestSuites.java:55)
   [junit4]    > 	at com.carrotsearch.randomizedtesting.RandomizedRunner.runSuite(RandomizedRunner.java:605)
   [junit4]    > 	at com.carrotsearch.randomizedtesting.RandomizedRunner.access$400(RandomizedRunner.java:132)
   [junit4]    > 	at com.carrotsearch.randomizedtesting.RandomizedRunner$2.run(RandomizedRunner.java:551)
   [junit4]    > Caused by: org.apache.lucene.store.AlreadyClosedException: this IndexWriter is closed
   [junit4]    > 	at org.apache.lucene.index.IndexWriter.ensureOpen(IndexWriter.java:551)
   [junit4]    > 	at org.apache.lucene.index.IndexWriter.ensureOpen(IndexWriter.java:556)
   [junit4]    > 	at org.apache.lucene.index.IndexWriter.deleteAll(IndexWriter.java:1880)
   [junit4]    > 	at org.apache.solr.update.DirectUpdateHandler2.deleteAll(DirectUpdateHandler2.java:138)
   [junit4]    > 	at org.apache.solr.update.DirectUpdateHandler2.deleteByQuery(DirectUpdateHandler2.java:290)
   [junit4]    > 	at org.apache.solr.update.processor.RunUpdateProcessor.processDelete(RunUpdateProcessorFactory.java:67)
   [junit4]    > 	at org.apache.solr.update.processor.UpdateRequestProcessor.processDelete(UpdateRequestProcessor.java:55)
   [junit4]    > 	at org.apache.solr.update.processor.DistributedUpdateProcessor.doDeleteByQuery(DistributedUpdateProcessor.java:719)
   [junit4]    > 	at org.apache.solr.update.processor.DistributedUpdateProcessor.processDelete(DistributedUpdateProcessor.java:592)
   [junit4]    > 	at org.apache.solr.update.processor.UpdateRequestProcessor.processDelete(UpdateRequestProcessor.java:55)
   [junit4]    > 	at org.apache.solr.handler.dataimport.AbstractDataImportHandlerTestCase$TestUpdateRequestProcessor.processDelete(AbstractDataImportHandlerTestCase.java:364)
   [junit4]    > 	at org.apache.solr.handler.loader.XMLLoader.processDelete(XMLLoader.java:330)
   [junit4]    > 	at org.apache.solr.handler.loader.XMLLoader.processUpdate(XMLLoader.java:261)
   [junit4]    > 	at org.apache.solr.handler.loader.XMLLoader.load(XMLLoader.java:157)
   [junit4]    > 	at org.apache.solr.handler.UpdateRequestHandler$1.load(UpdateRequestHandler.java:92)
   [junit4]    > 	at org.apache.solr.handler.ContentStreamHandlerBase.handleRequestBody(ContentStreamHandlerBase.java:74)
   [junit4]    > 	at org.apache.solr.handler.RequestHandlerBase.handleRequest(RequestHandlerBase.java:129)
   [junit4]    > 	at org.apache.solr.core.SolrCore.execute(SolrCore.java:1599)
   [junit4]    > 	at org.apache.solr.servlet.DirectSolrConnection.request(DirectSolrConnection.java:131)
   [junit4]    > 	at org.apache.solr.util.TestHarness.update(TestHarness.java:229)
   [junit4]    > 	... 45 more
   [junit4]    > 
   [junit4]   2> 547 T82 oas.SolrTestCaseJ4.setUp ###Starting testCompositePk_DeltaImport_nodelta
   [junit4]   2> 552 T82 C11 oasu.DirectUpdateHandler2.deleteAll [collection1] REMOVING ALL DOCUMENTS FROM INDEX
   [junit4]   2> 553 T82 C11 UPDATE [collection1] webapp=null path=null params={} {} 0 1
   [junit4]   2> 554 T82 C11 oasc.SolrException.log SEVERE org.apache.lucene.store.AlreadyClosedException: this IndexWriter is closed
   [junit4]   2> 		at org.apache.lucene.index.IndexWriter.ensureOpen(IndexWriter.java:551)
   [junit4]   2> 		at org.apache.lucene.index.IndexWriter.ensureOpen(IndexWriter.java:556)
   [junit4]   2> 		at org.apache.lucene.index.IndexWriter.deleteAll(IndexWriter.java:1880)
   [junit4]   2> 		at org.apache.solr.update.DirectUpdateHandler2.deleteAll(DirectUpdateHandler2.java:138)
   [junit4]   2> 		at org.apache.solr.update.DirectUpdateHandler2.deleteByQuery(DirectUpdateHandler2.java:290)
   [junit4]   2> 		at org.apache.solr.update.processor.RunUpdateProcessor.processDelete(RunUpdateProcessorFactory.java:67)
   [junit4]   2> 		at org.apache.solr.update.processor.UpdateRequestProcessor.processDelete(UpdateRequestProcessor.java:55)
   [junit4]   2> 		at org.apache.solr.update.processor.DistributedUpdateProcessor.doDeleteByQuery(DistributedUpdateProcessor.java:719)
   [junit4]   2> 		at org.apache.solr.update.processor.DistributedUpdateProcessor.processDelete(DistributedUpdateProcessor.java:592)
   [junit4]   2> 		at org.apache.solr.update.processor.UpdateRequestProcessor.processDelete(UpdateRequestProcessor.java:55)
   [junit4]   2> 		at org.apache.solr.handler.dataimport.AbstractDataImportHandlerTestCase$TestUpdateRequestProcessor.processDelete(AbstractDataImportHandlerTestCase.java:364)
   [junit4]   2> 		at org.apache.solr.handler.loader.XMLLoader.processDelete(XMLLoader.java:330)
   [junit4]   2> 		at org.apache.solr.handler.loader.XMLLoader.processUpdate(XMLLoader.java:261)
   [junit4]   2> 		at org.apache.solr.handler.loader.XMLLoader.load(XMLLoader.java:157)
   [junit4]   2> 		at org.apache.solr.handler.UpdateRequestHandler$1.load(UpdateRequestHandler.java:92)
   [junit4]   2> 		at org.apache.solr.handler.ContentStreamHandlerBase.handleRequestBody(ContentStreamHandlerBase.java:74)
   [junit4]   2> 		at org.apache.solr.handler.RequestHandlerBase.handleRequest(RequestHandlerBase.java:129)
   [junit4]   2> 		at org.apache.solr.core.SolrCore.execute(SolrCore.java:1599)
   [junit4]   2> 		at org.apache.solr.servlet.DirectSolrConnection.request(DirectSolrConnection.java:131)
   [junit4]   2> 		at org.apache.solr.util.TestHarness.update(TestHarness.java:229)
   [junit4]   2> 		at org.apache.solr.util.TestHarness.checkUpdateStatus(TestHarness.java:277)
   [junit4]   2> 		at org.apache.solr.util.TestHarness.validateUpdate(TestHarness.java:247)
   [junit4]   2> 		at org.apache.solr.SolrTestCaseJ4.checkUpdateU(SolrTestCaseJ4.java:415)
   [junit4]   2> 		at org.apache.solr.SolrTestCaseJ4.assertU(SolrTestCaseJ4.java:394)
   [junit4]   2> 		at org.apache.solr.SolrTestCaseJ4.assertU(SolrTestCaseJ4.java:388)
   [junit4]   2> 		at org.apache.solr.SolrTestCaseJ4.clearIndex(SolrTestCaseJ4.java:760)
   [junit4]   2> 		at org.apache.solr.handler.dataimport.TestSqlEntityProcessorDelta3.setUp(TestSqlEntityProcessorDelta3.java:67)
   [junit4]   2> 		at sun.reflect.NativeMethodAccessorImpl.invoke0(Native Method)
   [junit4]   2> 		at sun.reflect.NativeMethodAccessorImpl.invoke(NativeMethodAccessorImpl.java:39)
   [junit4]   2> 		at sun.reflect.DelegatingMethodAccessorImpl.invoke(DelegatingMethodAccessorImpl.java:25)
   [junit4]   2> 		at java.lang.reflect.Method.invoke(Method.java:597)
   [junit4]   2> 		at com.carrotsearch.randomizedtesting.RandomizedRunner.invoke(RandomizedRunner.java:1969)
   [junit4]   2> 		at com.carrotsearch.randomizedtesting.RandomizedRunner.access$1100(RandomizedRunner.java:132)
   [junit4]   2> 		at com.carrotsearch.randomizedtesting.RandomizedRunner$7.evaluate(RandomizedRunner.java:873)
   [junit4]   2> 		at com.carrotsearch.randomizedtesting.RandomizedRunner$8.evaluate(RandomizedRunner.java:889)
   [junit4]   2> 		at com.carrotsearch.randomizedtesting.rules.SystemPropertiesRestoreRule$1.evaluate(SystemPropertiesRestoreRule.java:53)
   [junit4]   2> 		at org.apache.lucene.util.TestRuleSetupTeardownChained$1.evaluate(TestRuleSetupTeardownChained.java:50)
   [junit4]   2> 		at org.apache.lucene.util.TestRuleFieldCacheSanity$1.evaluate(TestRuleFieldCacheSanity.java:32)
   [junit4]   2> 		at org.apache.lucene.util.AbstractBeforeAfterRule$1.evaluate(AbstractBeforeAfterRule.java:45)
   [junit4]   2> 		at com.carrotsearch.randomizedtesting.rules.SystemPropertiesInvariantRule$1.evaluate(SystemPropertiesInvariantRule.java:55)
   [junit4]   2> 		at org.apache.lucene.util.TestRuleReportUncaughtExceptions$1.evaluate(TestRuleReportUncaughtExceptions.java:68)
   [junit4]   2> 		at org.apache.lucene.util.TestRuleThreadAndTestName$1.evaluate(TestRuleThreadAndTestName.java:48)
   [junit4]   2> 		at org.apache.lucene.util.TestRuleIgnoreAfterMaxFailures$1.evaluate(TestRuleIgnoreAfterMaxFailures.java:70)
   [junit4]   2> 		at org.apache.lucene.util.TestRuleMarkFailure$1.evaluate(TestRuleMarkFailure.java:48)
   [junit4]   2> 		at com.carrotsearch.randomizedtesting.RandomizedRunner.runSingleTest(RandomizedRunner.java:821)
   [junit4]   2> 		at com.carrotsearch.randomizedtesting.RandomizedRunner.access$700(RandomizedRunner.java:132)
   [junit4]   2> 		at com.carrotsearch.randomizedtesting.RandomizedRunner$3$1.run(RandomizedRunner.java:669)
   [junit4]   2> 		at com.carrotsearch.randomizedtesting.RandomizedRunner$3.evaluate(RandomizedRunner.java:695)
   [junit4]   2> 		at com.carrotsearch.randomizedtesting.RandomizedRunner$4.evaluate(RandomizedRunner.java:734)
   [junit4]   2> 		at com.carrotsearch.randomizedtesting.RandomizedRunner$5.evaluate(RandomizedRunner.java:745)
   [junit4]   2> 		at com.carrotsearch.randomizedtesting.rules.SystemPropertiesRestoreRule$1.evaluate(SystemPropertiesRestoreRule.java:53)
   [junit4]   2> 		at org.apache.lucene.util.AbstractBeforeAfterRule$1.evaluate(AbstractBeforeAfterRule.java:45)
   [junit4]   2> 		at org.apache.lucene.util.TestRuleReportUncaughtExceptions$1.evaluate(TestRuleReportUncaughtExceptions.java:68)
   [junit4]   2> 		at org.apache.lucene.util.TestRuleStoreClassName$1.evaluate(TestRuleStoreClassName.java:38)
   [junit4]   2> 		at org.apache.lucene.util.TestRuleIcuHack$1.evaluate(TestRuleIcuHack.java:51)
   [junit4]   2> 		at com.carrotsearch.randomizedtesting.rules.SystemPropertiesInvariantRule$1.evaluate(SystemPropertiesInvariantRule.java:55)
   [junit4]   2> 		at org.apache.lucene.util.TestRuleNoInstanceHooksOverrides$1.evaluate(TestRuleNoInstanceHooksOverrides.java:53)
   [junit4]   2> 		at org.apache.lucene.util.TestRuleNoStaticHooksShadowing$1.evaluate(TestRuleNoStaticHooksShadowing.java:52)
   [junit4]   2> 		at org.apache.lucene.util.TestRuleAssertionsRequired$1.evaluate(TestRuleAssertionsRequired.java:36)
   [junit4]   2> 		at org.apache.lucene.util.TestRuleMarkFailure$1.evaluate(TestRuleMarkFailure.java:48)
   [junit4]   2> 		at org.apache.lucene.util.TestRuleIgnoreAfterMaxFailures$1.evaluate(TestRuleIgnoreAfterMaxFailures.java:70)
   [junit4]   2> 		at org.apache.lucene.util.TestRuleIgnoreTestSuites$1.evaluate(TestRuleIgnoreTestSuites.java:55)
   [junit4]   2> 		at com.carrotsearch.randomizedtesting.RandomizedRunner.runSuite(RandomizedRunner.java:605)
   [junit4]   2> 		at com.carrotsearch.randomizedtesting.RandomizedRunner.access$400(RandomizedRunner.java:132)
   [junit4]   2> 		at com.carrotsearch.randomizedtesting.RandomizedRunner$2.run(RandomizedRunner.java:551)
   [junit4]   2> 	
   [junit4]   2> 555 T82 oashd.AbstractDataImportHandlerTestCase.tearDown Looking for dataimport.properties at: /mnt/ssd/jenkins/workspace/Lucene-Solr-trunk-Linux-Java6-64/checkout/solr/build/contrib/solr-dataimporthandler/test/J0/solr/collection1/conf/dataimport.properties
   [junit4]   2> 555 T82 oas.SolrTestCaseJ4.tearDown ###Ending testCompositePk_DeltaImport_nodelta
   [junit4]   2> NOTE: reproduce with: ant test  -Dtestcase=TestSqlEntityProcessorDelta3 -Dtests.method=testCompositePk_DeltaImport_nodelta -Dtests.seed=1C8C5AF1930C8ED -Dtests.multiplier=3 -Dtests.slow=true -Dtests.locale=sk_SK -Dtests.timezone=Israel -Dargs="-Dfile.encoding=UTF-8"
   [junit4]   2>
   [junit4]    > (@AfterClass output)
   [junit4]   2> 564 T82 oas.SolrTestCaseJ4.deleteCore ###deleteCore
   [junit4]   2> 564 T82 oasc.CoreContainer.shutdown Shutting down CoreContainer instance=124163361
   [junit4]   2> 564 T82 oasc.SolrCore.close [collection1]  CLOSING SolrCore org.apache.solr.core.SolrCore@430a14ad
   [junit4]   2> 565 T82 oasc.SolrCore.closeSearcher [collection1] Closing main searcher on request.
   [junit4]   2> 581 T82 oasu.DirectUpdateHandler2.close closing DirectUpdateHandler2{commits=5,autocommits=0,soft autocommits=0,optimizes=0,rollbacks=1,expungeDeletes=0,docsPending=0,adds=0,deletesById=0,deletesByQuery=4,errors=5,cumulative_adds=3,cumulative_deletesById=0,cumulative_deletesByQuery=8,cumulative_errors=4}
   [junit4]   2> 581 T82 oasu.DefaultSolrCoreState.decref SEVERE Error during shutdown of writer. java.lang.IllegalArgumentException: Unknown directory: MockDirWrapper(org.apache.lucene.store.MMapDirectory@/mnt/ssd/jenkins/workspace/Lucene-Solr-trunk-Linux-Java6-64/checkout/solr/build/contrib/solr-dataimporthandler/test/J0/index1798717987tmp lockFactory=org.apache.lucene.store.NativeFSLockFactory@3850620f) {MockDirWrapper(NRTCachingDirectory(org.apache.lucene.store.RAMDirectory@65087be0 lockFactory=org.apache.lucene.store.NativeFSLockFactory@7ce9927a; maxCacheMB=0.2607421875 maxMergeSizeMB=0.6806640625))=org.apache.solr.core.CachingDirectoryFactory$CacheValue@1367f48c}
   [junit4]   2> 	at org.apache.solr.core.CachingDirectoryFactory.close(CachingDirectoryFactory.java:77)
   [junit4]   2> 	at org.apache.solr.core.CachingDirectoryFactory.release(CachingDirectoryFactory.java:184)
   [junit4]   2> 	at org.apache.solr.update.SolrIndexWriter.close(SolrIndexWriter.java:131)
   [junit4]   2> 	at org.apache.solr.update.DirectUpdateHandler2.closeWriter(DirectUpdateHandler2.java:611)
   [junit4]   2> 	at org.apache.solr.update.DefaultSolrCoreState.decref(DefaultSolrCoreState.java:72)
   [junit4]   2> 	at org.apache.solr.update.DirectUpdateHandler2.close(DirectUpdateHandler2.java:540)
   [junit4]   2> 	at org.apache.solr.core.SolrCore.close(SolrCore.java:823)
   [junit4]   2> 	at org.apache.solr.core.CoreContainer.shutdown(CoreContainer.java:563)
   [junit4]   2> 	at org.apache.solr.util.TestHarness.close(TestHarness.java:407)
   [junit4]   2> 	at org.apache.solr.SolrTestCaseJ4.deleteCore(SolrTestCaseJ4.java:361)
   [junit4]   2> 	at org.apache.solr.SolrTestCaseJ4.afterClass(SolrTestCaseJ4.java:80)
   [junit4]   2> 	at sun.reflect.NativeMethodAccessorImpl.invoke0(Native Method)
   [junit4]   2> 	at sun.reflect.NativeMethodAccessorImpl.invoke(NativeMethodAccessorImpl.java:39)
   [junit4]   2> 	at sun.reflect.DelegatingMethodAccessorImpl.invoke(DelegatingMethodAccessorImpl.java:25)
   [junit4]   2> 	at java.lang.reflect.Method.invoke(Method.java:597)
   [junit4]   2> 	at com.carrotsearch.randomizedtesting.RandomizedRunner.invoke(RandomizedRunner.java:1969)
   [junit4]   2> 	at com.carrotsearch.randomizedtesting.RandomizedRunner.access$1100(RandomizedRunner.java:132)
   [junit4]   2> 	at com.carrotsearch.randomizedtesting.RandomizedRunner$5.evaluate(RandomizedRunner.java:752)
   [junit4]   2> 	at com.carrotsearch.randomizedtesting.rules.SystemPropertiesRestoreRule$1.evaluate(SystemPropertiesRestoreRule.java:53)
   [junit4]   2> 	at org.apache.lucene.util.AbstractBeforeAfterRule$1.evaluate(AbstractBeforeAfterRule.java:45)
   [junit4]   2> 	at org.apache.lucene.util.TestRuleReportUncaughtExceptions$1.evaluate(TestRuleReportUncaughtExceptions.java:68)
   [junit4]   2> 	at org.apache.lucene.util.TestRuleStoreClassName$1.evaluate(TestRuleStoreClassName.java:38)
   [junit4]   2> 	at org.apache.lucene.util.TestRuleIcuHack$1.evaluate(TestRuleIcuHack.java:51)
   [junit4]   2> 	at com.carrotsearch.randomizedtesting.rules.SystemPropertiesInvariantRule$1.evaluate(SystemPropertiesInvariantRule.java:55)
   [junit4]   2> 	at org.apache.lucene.util.TestRuleNoInstanceHooksOverrides$1.evaluate(TestRuleNoInstanceHooksOverrides.java:53)
   [junit4]   2> 	at org.apache.lucene.util.TestRuleNoStaticHooksShadowing$1.evaluate(TestRuleNoStaticHooksShadowing.java:52)
   [junit4]   2> 	at org.apache.lucene.util.TestRuleAssertionsRequired$1.evaluate(TestRuleAssertionsRequired.java:36)
   [junit4]   2> 	at org.apache.lucene.util.TestRuleMarkFailure$1.evaluate(TestRuleMarkFailure.java:48)
   [junit4]   2> 	at org.apache.lucene.util.TestRuleIgnoreAfterMaxFailures$1.evaluate(TestRuleIgnoreAfterMaxFailures.java:70)
   [junit4]   2> 	at org.apache.lucene.util.TestRuleIgnoreTestSuites$1.evaluate(TestRuleIgnoreTestSuites.java:55)
   [junit4]   2> 	at com.carrotsearch.randomizedtesting.RandomizedRunner.runSuite(RandomizedRunner.java:605)
   [junit4]   2> 	at com.carrotsearch.randomizedtesting.RandomizedRunner.access$400(RandomizedRunner.java:132)
   [junit4]   2> 	at com.carrotsearch.randomizedtesting.RandomizedRunner$2.run(RandomizedRunner.java:551)
   [junit4]   2> 
   [junit4]   2> NOTE: test params are: codec=SimpleText, sim=DefaultSimilarity, locale=sk_SK, timezone=Israel
   [junit4]   2> NOTE: Linux 2.6.32-41-server amd64/Sun Microsystems Inc. 1.6.0_32 (64-bit)/cpus=8,threads=1,free=161904960,total=240386048
   [junit4]   2> NOTE: All tests run in this JVM: [TestVariableResolver, TestSolrEntityProcessorEndToEnd, TestPlainTextEntityProcessor, TestDocBuilder, TestURLDataSource, TestSqlEntityProcessorDelta3]
   [junit4]   2> 
   [junit4] Completed on J0 in 0.61s, 6 tests, 5 errors <<< FAILURES!

[...truncated 59 lines...]
BUILD FAILED
/mnt/ssd/jenkins/workspace/Lucene-Solr-trunk-Linux-Java6-64/checkout/build.xml:29: The following error occurred while executing this line:
/mnt/ssd/jenkins/workspace/Lucene-Solr-trunk-Linux-Java6-64/checkout/solr/build.xml:163: The following error occurred while executing this line:
/mnt/ssd/jenkins/workspace/Lucene-Solr-trunk-Linux-Java6-64/checkout/solr/common-build.xml:358: The following error occurred while executing this line:
/mnt/ssd/jenkins/workspace/Lucene-Solr-trunk-Linux-Java6-64/checkout/lucene/module-build.xml:62: The following error occurred while executing this line:
/mnt/ssd/jenkins/workspace/Lucene-Solr-trunk-Linux-Java6-64/checkout/lucene/common-build.xml:1047: The following error occurred while executing this line:
/mnt/ssd/jenkins/workspace/Lucene-Solr-trunk-Linux-Java6-64/checkout/lucene/common-build.xml:760: There were test failures: 36 suites, 167 tests, 5 errors, 5 ignored

Total time: 22 minutes 8 seconds
Build step 'Execute shell' marked build as failure
Archiving artifacts
Recording test results
Email was triggered for: Failure
Sending email for trigger: Failure




Mime
View raw message