lucene-dev mailing list archives

Site index · List index
Message view « Date » · « Thread »
Top « Date » · « Thread »
From Policeman Jenkins Server <jenk...@sd-datasolutions.de>
Subject [JENKINS] Lucene-Solr-trunk-Linux-Java7-64 - Build # 722 - Failure!
Date Fri, 27 Jul 2012 14:12:42 GMT
Build: http://jenkins.sd-datasolutions.de/job/Lucene-Solr-trunk-Linux-Java7-64/722/

1 tests failed.
REGRESSION:  org.apache.solr.core.CoreContainerCoreInitFailuresTest.testFlowBadFromStart

Error Message:
reload exception doesn't mention bad prolog: El contenido no está permitido en el prólogo.

Stack Trace:
java.lang.AssertionError: reload exception doesn't mention bad prolog: El contenido no está
permitido en el prólogo.
	at __randomizedtesting.SeedInfo.seed([3B0A7CB954F1A5B:994A6C3371B0945F]:0)
	at org.junit.Assert.fail(Assert.java:93)
	at org.junit.Assert.assertTrue(Assert.java:43)
	at org.apache.solr.core.CoreContainerCoreInitFailuresTest.testFlowBadFromStart(CoreContainerCoreInitFailuresTest.java:255)
	at sun.reflect.NativeMethodAccessorImpl.invoke0(Native Method)
	at sun.reflect.NativeMethodAccessorImpl.invoke(NativeMethodAccessorImpl.java:57)
	at sun.reflect.DelegatingMethodAccessorImpl.invoke(DelegatingMethodAccessorImpl.java:43)
	at java.lang.reflect.Method.invoke(Method.java:601)
	at com.carrotsearch.randomizedtesting.RandomizedRunner.invoke(RandomizedRunner.java:1995)
	at com.carrotsearch.randomizedtesting.RandomizedRunner.access$1100(RandomizedRunner.java:132)
	at com.carrotsearch.randomizedtesting.RandomizedRunner$6.evaluate(RandomizedRunner.java:818)
	at com.carrotsearch.randomizedtesting.RandomizedRunner$7.evaluate(RandomizedRunner.java:877)
	at com.carrotsearch.randomizedtesting.RandomizedRunner$8.evaluate(RandomizedRunner.java:891)
	at com.carrotsearch.randomizedtesting.rules.SystemPropertiesRestoreRule$1.evaluate(SystemPropertiesRestoreRule.java:53)
	at org.apache.lucene.util.TestRuleSetupTeardownChained$1.evaluate(TestRuleSetupTeardownChained.java:50)
	at org.apache.lucene.util.TestRuleFieldCacheSanity$1.evaluate(TestRuleFieldCacheSanity.java:32)
	at org.apache.lucene.util.AbstractBeforeAfterRule$1.evaluate(AbstractBeforeAfterRule.java:45)
	at com.carrotsearch.randomizedtesting.rules.SystemPropertiesInvariantRule$1.evaluate(SystemPropertiesInvariantRule.java:55)
	at org.apache.lucene.util.TestRuleReportUncaughtExceptions$1.evaluate(TestRuleReportUncaughtExceptions.java:68)
	at org.apache.lucene.util.TestRuleThreadAndTestName$1.evaluate(TestRuleThreadAndTestName.java:48)
	at org.apache.lucene.util.TestRuleIgnoreAfterMaxFailures$1.evaluate(TestRuleIgnoreAfterMaxFailures.java:70)
	at org.apache.lucene.util.TestRuleMarkFailure$1.evaluate(TestRuleMarkFailure.java:48)
	at com.carrotsearch.randomizedtesting.RandomizedRunner.runSingleTest(RandomizedRunner.java:825)
	at com.carrotsearch.randomizedtesting.RandomizedRunner.access$700(RandomizedRunner.java:132)
	at com.carrotsearch.randomizedtesting.RandomizedRunner$3$1.run(RandomizedRunner.java:671)
	at com.carrotsearch.randomizedtesting.RandomizedRunner$3.evaluate(RandomizedRunner.java:697)
	at com.carrotsearch.randomizedtesting.RandomizedRunner$4.evaluate(RandomizedRunner.java:736)
	at com.carrotsearch.randomizedtesting.RandomizedRunner$5.evaluate(RandomizedRunner.java:747)
	at com.carrotsearch.randomizedtesting.rules.SystemPropertiesRestoreRule$1.evaluate(SystemPropertiesRestoreRule.java:53)
	at org.apache.lucene.util.AbstractBeforeAfterRule$1.evaluate(AbstractBeforeAfterRule.java:45)
	at org.apache.lucene.util.TestRuleReportUncaughtExceptions$1.evaluate(TestRuleReportUncaughtExceptions.java:68)
	at org.apache.lucene.util.TestRuleStoreClassName$1.evaluate(TestRuleStoreClassName.java:38)
	at com.carrotsearch.randomizedtesting.rules.SystemPropertiesInvariantRule$1.evaluate(SystemPropertiesInvariantRule.java:55)
	at org.apache.lucene.util.TestRuleNoInstanceHooksOverrides$1.evaluate(TestRuleNoInstanceHooksOverrides.java:53)
	at org.apache.lucene.util.TestRuleNoStaticHooksShadowing$1.evaluate(TestRuleNoStaticHooksShadowing.java:52)
	at org.apache.lucene.util.TestRuleAssertionsRequired$1.evaluate(TestRuleAssertionsRequired.java:36)
	at org.apache.lucene.util.TestRuleMarkFailure$1.evaluate(TestRuleMarkFailure.java:48)
	at org.apache.lucene.util.TestRuleIgnoreAfterMaxFailures$1.evaluate(TestRuleIgnoreAfterMaxFailures.java:70)
	at org.apache.lucene.util.TestRuleIgnoreTestSuites$1.evaluate(TestRuleIgnoreTestSuites.java:55)
	at com.carrotsearch.randomizedtesting.RandomizedRunner.runSuite(RandomizedRunner.java:605)
	at com.carrotsearch.randomizedtesting.RandomizedRunner.access$400(RandomizedRunner.java:132)
	at com.carrotsearch.randomizedtesting.RandomizedRunner$2.run(RandomizedRunner.java:551)




Build Log:
[...truncated 7115 lines...]
[junit4:junit4] Suite: org.apache.solr.core.CoreContainerCoreInitFailuresTest
[junit4:junit4] FAILURE 0.41s J1 | CoreContainerCoreInitFailuresTest.testFlowBadFromStart
[junit4:junit4]    > Throwable #1: java.lang.AssertionError: reload exception doesn't mention
bad prolog: El contenido no está permitido en el prólogo.
[junit4:junit4]    > 	at __randomizedtesting.SeedInfo.seed([3B0A7CB954F1A5B:994A6C3371B0945F]:0)
[junit4:junit4]    > 	at org.junit.Assert.fail(Assert.java:93)
[junit4:junit4]    > 	at org.junit.Assert.assertTrue(Assert.java:43)
[junit4:junit4]    > 	at org.apache.solr.core.CoreContainerCoreInitFailuresTest.testFlowBadFromStart(CoreContainerCoreInitFailuresTest.java:255)
[junit4:junit4]    > 	at sun.reflect.NativeMethodAccessorImpl.invoke0(Native Method)
[junit4:junit4]    > 	at sun.reflect.NativeMethodAccessorImpl.invoke(NativeMethodAccessorImpl.java:57)
[junit4:junit4]    > 	at sun.reflect.DelegatingMethodAccessorImpl.invoke(DelegatingMethodAccessorImpl.java:43)
[junit4:junit4]    > 	at java.lang.reflect.Method.invoke(Method.java:601)
[junit4:junit4]    > 	at com.carrotsearch.randomizedtesting.RandomizedRunner.invoke(RandomizedRunner.java:1995)
[junit4:junit4]    > 	at com.carrotsearch.randomizedtesting.RandomizedRunner.access$1100(RandomizedRunner.java:132)
[junit4:junit4]    > 	at com.carrotsearch.randomizedtesting.RandomizedRunner$6.evaluate(RandomizedRunner.java:818)
[junit4:junit4]    > 	at com.carrotsearch.randomizedtesting.RandomizedRunner$7.evaluate(RandomizedRunner.java:877)
[junit4:junit4]    > 	at com.carrotsearch.randomizedtesting.RandomizedRunner$8.evaluate(RandomizedRunner.java:891)
[junit4:junit4]    > 	at com.carrotsearch.randomizedtesting.rules.SystemPropertiesRestoreRule$1.evaluate(SystemPropertiesRestoreRule.java:53)
[junit4:junit4]    > 	at org.apache.lucene.util.TestRuleSetupTeardownChained$1.evaluate(TestRuleSetupTeardownChained.java:50)
[junit4:junit4]    > 	at org.apache.lucene.util.TestRuleFieldCacheSanity$1.evaluate(TestRuleFieldCacheSanity.java:32)
[junit4:junit4]    > 	at org.apache.lucene.util.AbstractBeforeAfterRule$1.evaluate(AbstractBeforeAfterRule.java:45)
[junit4:junit4]    > 	at com.carrotsearch.randomizedtesting.rules.SystemPropertiesInvariantRule$1.evaluate(SystemPropertiesInvariantRule.java:55)
[junit4:junit4]    > 	at org.apache.lucene.util.TestRuleReportUncaughtExceptions$1.evaluate(TestRuleReportUncaughtExceptions.java:68)
[junit4:junit4]    > 	at org.apache.lucene.util.TestRuleThreadAndTestName$1.evaluate(TestRuleThreadAndTestName.java:48)
[junit4:junit4]    > 	at org.apache.lucene.util.TestRuleIgnoreAfterMaxFailures$1.evaluate(TestRuleIgnoreAfterMaxFailures.java:70)
[junit4:junit4]    > 	at org.apache.lucene.util.TestRuleMarkFailure$1.evaluate(TestRuleMarkFailure.java:48)
[junit4:junit4]    > 	at com.carrotsearch.randomizedtesting.RandomizedRunner.runSingleTest(RandomizedRunner.java:825)
[junit4:junit4]    > 	at com.carrotsearch.randomizedtesting.RandomizedRunner.access$700(RandomizedRunner.java:132)
[junit4:junit4]    > 	at com.carrotsearch.randomizedtesting.RandomizedRunner$3$1.run(RandomizedRunner.java:671)
[junit4:junit4]    > 	at com.carrotsearch.randomizedtesting.RandomizedRunner$3.evaluate(RandomizedRunner.java:697)
[junit4:junit4]    > 	at com.carrotsearch.randomizedtesting.RandomizedRunner$4.evaluate(RandomizedRunner.java:736)
[junit4:junit4]    > 	at com.carrotsearch.randomizedtesting.RandomizedRunner$5.evaluate(RandomizedRunner.java:747)
[junit4:junit4]    > 	at com.carrotsearch.randomizedtesting.rules.SystemPropertiesRestoreRule$1.evaluate(SystemPropertiesRestoreRule.java:53)
[junit4:junit4]    > 	at org.apache.lucene.util.AbstractBeforeAfterRule$1.evaluate(AbstractBeforeAfterRule.java:45)
[junit4:junit4]    > 	at org.apache.lucene.util.TestRuleReportUncaughtExceptions$1.evaluate(TestRuleReportUncaughtExceptions.java:68)
[junit4:junit4]    > 	at org.apache.lucene.util.TestRuleStoreClassName$1.evaluate(TestRuleStoreClassName.java:38)
[junit4:junit4]    > 	at com.carrotsearch.randomizedtesting.rules.SystemPropertiesInvariantRule$1.evaluate(SystemPropertiesInvariantRule.java:55)
[junit4:junit4]    > 	at org.apache.lucene.util.TestRuleNoInstanceHooksOverrides$1.evaluate(TestRuleNoInstanceHooksOverrides.java:53)
[junit4:junit4]    > 	at org.apache.lucene.util.TestRuleNoStaticHooksShadowing$1.evaluate(TestRuleNoStaticHooksShadowing.java:52)
[junit4:junit4]    > 	at org.apache.lucene.util.TestRuleAssertionsRequired$1.evaluate(TestRuleAssertionsRequired.java:36)
[junit4:junit4]    > 	at org.apache.lucene.util.TestRuleMarkFailure$1.evaluate(TestRuleMarkFailure.java:48)
[junit4:junit4]    > 	at org.apache.lucene.util.TestRuleIgnoreAfterMaxFailures$1.evaluate(TestRuleIgnoreAfterMaxFailures.java:70)
[junit4:junit4]    > 	at org.apache.lucene.util.TestRuleIgnoreTestSuites$1.evaluate(TestRuleIgnoreTestSuites.java:55)
[junit4:junit4]    > 	at com.carrotsearch.randomizedtesting.RandomizedRunner.runSuite(RandomizedRunner.java:605)
[junit4:junit4]    > 	at com.carrotsearch.randomizedtesting.RandomizedRunner.access$400(RandomizedRunner.java:132)
[junit4:junit4]    > 	at com.carrotsearch.randomizedtesting.RandomizedRunner$2.run(RandomizedRunner.java:551)
[junit4:junit4]    > 
[junit4:junit4]   2> 2 T101 oas.SolrTestCaseJ4.setUp ###Starting testFlowBadFromStart
[junit4:junit4]   2> 3 T101 oasc.CoreContainer.<init> New CoreContainer 1369197050
[junit4:junit4]   2> 9 T101 oasc.CoreContainer.load Loading CoreContainer using Solr Home:
'/mnt/ssd/jenkins/workspace/Lucene-Solr-trunk-Linux-Java7-64/checkout/solr/build/solr-core/test/J1/./org.apache.solr.core.CoreContainerCoreInitFailuresTest_bad_flow'
[junit4:junit4]   2> 10 T101 oasc.SolrResourceLoader.<init> new SolrResourceLoader
for directory: '/mnt/ssd/jenkins/workspace/Lucene-Solr-trunk-Linux-Java7-64/checkout/solr/build/solr-core/test/J1/./org.apache.solr.core.CoreContainerCoreInitFailuresTest_bad_flow/'
[junit4:junit4]   2> 33 T101 oasc.CoreContainer.load Registering Log Listener
[junit4:junit4]   2> 56 T101 oasc.CoreContainer.create Creating SolrCore 'col_ok' using
instanceDir: /mnt/ssd/jenkins/workspace/Lucene-Solr-trunk-Linux-Java7-64/checkout/solr/build/solr-core/test/J1/./org.apache.solr.core.CoreContainerCoreInitFailuresTest_bad_flow/col_ok
[junit4:junit4]   2> 56 T101 oasc.SolrResourceLoader.<init> new SolrResourceLoader
for directory: '/mnt/ssd/jenkins/workspace/Lucene-Solr-trunk-Linux-Java7-64/checkout/solr/build/solr-core/test/J1/./org.apache.solr.core.CoreContainerCoreInitFailuresTest_bad_flow/col_ok/'
[junit4:junit4]   2> 88 T101 oasc.SolrConfig.<init> Using Lucene MatchVersion: LUCENE_50
[junit4:junit4]   2> 133 T101 oasc.SolrConfig.<init> Loaded SolrConfig: solrconfig.xml
[junit4:junit4]   2> 133 T101 oass.IndexSchema.readSchema Reading Solr Schema
[junit4:junit4]   2> 136 T101 oass.IndexSchema.readSchema Schema name=minimal
[junit4:junit4]   2> 150 T101 oass.IndexSchema.readSchema WARNING no uniqueKey specified
in schema.
[junit4:junit4]   2> 152 T101 oasc.SolrCore.<init> [col_ok] Opening new SolrCore
at /mnt/ssd/jenkins/workspace/Lucene-Solr-trunk-Linux-Java7-64/checkout/solr/build/solr-core/test/J1/./org.apache.solr.core.CoreContainerCoreInitFailuresTest_bad_flow/col_ok/,
dataDir=/mnt/ssd/jenkins/workspace/Lucene-Solr-trunk-Linux-Java7-64/checkout/solr/build/solr-core/test/J1/./org.apache.solr.core.CoreContainerCoreInitFailuresTest_bad_flow/col_ok/data/
[junit4:junit4]   2> 152 T101 oasc.SolrCore.<init> JMX monitoring not detected for
core: col_ok
[junit4:junit4]   2> 152 T101 oasc.SolrCore.getNewIndexDir WARNING New index directory
detected: old=null new=/mnt/ssd/jenkins/workspace/Lucene-Solr-trunk-Linux-Java7-64/checkout/solr/build/solr-core/test/J1/./org.apache.solr.core.CoreContainerCoreInitFailuresTest_bad_flow/col_ok/data/index/
[junit4:junit4]   2> 153 T101 oasc.SolrCore.initIndex WARNING [col_ok] Solr index directory
'/mnt/ssd/jenkins/workspace/Lucene-Solr-trunk-Linux-Java7-64/checkout/solr/build/solr-core/test/J1/./org.apache.solr.core.CoreContainerCoreInitFailuresTest_bad_flow/col_ok/data/index'
doesn't exist. Creating new index...
[junit4:junit4]   2> 155 T101 oasc.SolrDeletionPolicy.onCommit SolrDeletionPolicy.onCommit:
commits:num=1
[junit4:junit4]   2> 		commit{dir=BaseDirectoryWrapper(org.apache.lucene.store.RAMDirectory@5ab8195d
lockFactory=org.apache.lucene.store.NativeFSLockFactory@2cbbcb49),segFN=segments_1,generation=1,filenames=[segments_1]
[junit4:junit4]   2> 155 T101 oasc.SolrDeletionPolicy.updateCommits newest commit = 1
[junit4:junit4]   2> 156 T101 oasc.RequestHandlers.initHandlersFromConfig created standard:
solr.StandardRequestHandler
[junit4:junit4]   2> 159 T101 oass.SolrIndexSearcher.<init> Opening Searcher@275474c3
main
[junit4:junit4]   2> 159 T101 oass.SolrIndexSearcher.getIndexDir WARNING WARNING: Directory
impl does not support setting indexDir: org.apache.lucene.store.BaseDirectoryWrapper
[junit4:junit4]   2> 160 T101 oasu.CommitTracker.<init> Hard AutoCommit: disabled
[junit4:junit4]   2> 160 T101 oasu.CommitTracker.<init> Soft AutoCommit: disabled
[junit4:junit4]   2> 160 T101 oashc.HttpShardHandlerFactory.getParameter Setting socketTimeout
to: 0
[junit4:junit4]   2> 160 T101 oashc.HttpShardHandlerFactory.getParameter Setting urlScheme
to: http://
[junit4:junit4]   2> 161 T101 oashc.HttpShardHandlerFactory.getParameter Setting connTimeout
to: 0
[junit4:junit4]   2> 161 T101 oashc.HttpShardHandlerFactory.getParameter Setting maxConnectionsPerHost
to: 20
[junit4:junit4]   2> 161 T101 oashc.HttpShardHandlerFactory.getParameter Setting corePoolSize
to: 0
[junit4:junit4]   2> 161 T101 oashc.HttpShardHandlerFactory.getParameter Setting maximumPoolSize
to: 2147483647
[junit4:junit4]   2> 162 T101 oashc.HttpShardHandlerFactory.getParameter Setting maxThreadIdleTime
to: 5
[junit4:junit4]   2> 162 T101 oashc.HttpShardHandlerFactory.getParameter Setting sizeOfQueue
to: -1
[junit4:junit4]   2> 162 T101 oashc.HttpShardHandlerFactory.getParameter Setting fairnessPolicy
to: false
[junit4:junit4]   2> 162 T101 oascsi.HttpClientUtil.createClient Creating new http client,
config:maxConnectionsPerHost=20&maxConnections=10000&socketTimeout=0&connTimeout=0&retry=false
[junit4:junit4]   2> 167 T102 oasc.SolrCore.registerSearcher [col_ok] Registered new searcher
Searcher@275474c3 main{StandardDirectoryReader(segments_1:1)}
[junit4:junit4]   2> 167 T101 oasc.CoreContainer.register registering core: col_ok
[junit4:junit4]   2> 168 T101 oasc.CoreContainer.create Creating SolrCore 'col_bad' using
instanceDir: /mnt/ssd/jenkins/workspace/Lucene-Solr-trunk-Linux-Java7-64/checkout/solr/build/solr-core/test/J1/./org.apache.solr.core.CoreContainerCoreInitFailuresTest_bad_flow/col_bad
[junit4:junit4]   2> 169 T101 oasc.SolrResourceLoader.<init> new SolrResourceLoader
for directory: '/mnt/ssd/jenkins/workspace/Lucene-Solr-trunk-Linux-Java7-64/checkout/solr/build/solr-core/test/J1/./org.apache.solr.core.CoreContainerCoreInitFailuresTest_bad_flow/col_bad/'
[junit4:junit4]   2> 196 T101 oasc.SolrConfig.<init> Using Lucene MatchVersion: LUCENE_50
[junit4:junit4]   2> 224 T101 oasc.SolrConfig.<init> Loaded SolrConfig: solrconfig.xml
[junit4:junit4]   2> 224 T101 oass.IndexSchema.readSchema Reading Solr Schema
[junit4:junit4]   2> 226 T101 oass.IndexSchema.readSchema Schema name=minimal
[junit4:junit4]   2> 234 T101 oass.IndexSchema.readSchema WARNING no uniqueKey specified
in schema.
[junit4:junit4]   2> 235 T101 oasc.SolrCore.<init> [col_bad] Opening new SolrCore
at /mnt/ssd/jenkins/workspace/Lucene-Solr-trunk-Linux-Java7-64/checkout/solr/build/solr-core/test/J1/./org.apache.solr.core.CoreContainerCoreInitFailuresTest_bad_flow/col_bad/,
dataDir=/mnt/ssd/jenkins/workspace/Lucene-Solr-trunk-Linux-Java7-64/checkout/solr/build/solr-core/test/J1/./org.apache.solr.core.CoreContainerCoreInitFailuresTest_bad_flow/col_bad/data/
[junit4:junit4]   2> 235 T101 oasc.SolrCore.<init> JMX monitoring not detected for
core: col_bad
[junit4:junit4]   2> 235 T101 oasc.SolrCore.getNewIndexDir WARNING New index directory
detected: old=null new=/mnt/ssd/jenkins/workspace/Lucene-Solr-trunk-Linux-Java7-64/checkout/solr/build/solr-core/test/J1/./org.apache.solr.core.CoreContainerCoreInitFailuresTest_bad_flow/col_bad/data/index/
[junit4:junit4]   2> 236 T101 oasc.SolrCore.initIndex WARNING [col_bad] Solr index directory
'/mnt/ssd/jenkins/workspace/Lucene-Solr-trunk-Linux-Java7-64/checkout/solr/build/solr-core/test/J1/./org.apache.solr.core.CoreContainerCoreInitFailuresTest_bad_flow/col_bad/data/index'
doesn't exist. Creating new index...
[junit4:junit4]   2> 238 T101 oasc.SolrException.log Ignoring exception matching \QDummyMergePolicy\E
[junit4:junit4]   2> 239 T101 oasc.CoreContainer.create Creating SolrCore 'col_bad' using
instanceDir: /mnt/ssd/jenkins/workspace/Lucene-Solr-trunk-Linux-Java7-64/checkout/solr/build/solr-core/test/J1/./org.apache.solr.core.CoreContainerCoreInitFailuresTest_bad_flow/col_bad
[junit4:junit4]   2> 239 T101 oasc.SolrResourceLoader.<init> new SolrResourceLoader
for directory: '/mnt/ssd/jenkins/workspace/Lucene-Solr-trunk-Linux-Java7-64/checkout/solr/build/solr-core/test/J1/./org.apache.solr.core.CoreContainerCoreInitFailuresTest_bad_flow/col_bad/'
[junit4:junit4]   2> 258 T101 oasc.SolrConfig.<init> Using Lucene MatchVersion: LUCENE_50
[junit4:junit4]   2> 292 T101 oasc.SolrConfig.<init> Loaded SolrConfig: solrconfig.xml
[junit4:junit4]   2> 293 T101 oass.IndexSchema.readSchema Reading Solr Schema
[junit4:junit4]   2> 295 T101 oass.IndexSchema.readSchema Schema name=minimal
[junit4:junit4]   2> 302 T101 oass.IndexSchema.readSchema WARNING no uniqueKey specified
in schema.
[junit4:junit4]   2> 304 T101 oasc.SolrCore.<init> [col_bad] Opening new SolrCore
at /mnt/ssd/jenkins/workspace/Lucene-Solr-trunk-Linux-Java7-64/checkout/solr/build/solr-core/test/J1/./org.apache.solr.core.CoreContainerCoreInitFailuresTest_bad_flow/col_bad/,
dataDir=/mnt/ssd/jenkins/workspace/Lucene-Solr-trunk-Linux-Java7-64/checkout/solr/build/solr-core/test/J1/./org.apache.solr.core.CoreContainerCoreInitFailuresTest_bad_flow/col_bad/data/
[junit4:junit4]   2> 304 T101 oasc.SolrCore.<init> JMX monitoring not detected for
core: col_bad
[junit4:junit4]   2> 304 T101 oasc.SolrCore.getNewIndexDir WARNING New index directory
detected: old=null new=/mnt/ssd/jenkins/workspace/Lucene-Solr-trunk-Linux-Java7-64/checkout/solr/build/solr-core/test/J1/./org.apache.solr.core.CoreContainerCoreInitFailuresTest_bad_flow/col_bad/data/index/
[junit4:junit4]   2> 304 T101 oasc.SolrCore.initIndex WARNING [col_bad] Solr index directory
'/mnt/ssd/jenkins/workspace/Lucene-Solr-trunk-Linux-Java7-64/checkout/solr/build/solr-core/test/J1/./org.apache.solr.core.CoreContainerCoreInitFailuresTest_bad_flow/col_bad/data/index'
doesn't exist. Creating new index...
[junit4:junit4]   2> 306 T101 oasc.SolrDeletionPolicy.onCommit SolrDeletionPolicy.onCommit:
commits:num=1
[junit4:junit4]   2> 		commit{dir=BaseDirectoryWrapper(org.apache.lucene.store.RAMDirectory@4e3eecd4
lockFactory=org.apache.lucene.store.NativeFSLockFactory@2e67ce6a),segFN=segments_1,generation=1,filenames=[segments_1]
[junit4:junit4]   2> 306 T101 oasc.SolrDeletionPolicy.updateCommits newest commit = 1
[junit4:junit4]   2> 306 T101 oasc.RequestHandlers.initHandlersFromConfig created standard:
solr.StandardRequestHandler
[junit4:junit4]   2> 308 T101 oass.SolrIndexSearcher.<init> Opening Searcher@1f84b826
main
[junit4:junit4]   2> 308 T101 oass.SolrIndexSearcher.getIndexDir WARNING WARNING: Directory
impl does not support setting indexDir: org.apache.lucene.store.BaseDirectoryWrapper
[junit4:junit4]   2> 309 T101 oasu.CommitTracker.<init> Hard AutoCommit: disabled
[junit4:junit4]   2> 309 T101 oasu.CommitTracker.<init> Soft AutoCommit: disabled
[junit4:junit4]   2> 309 T101 oasc.CoreContainer.register registering core: col_bad
[junit4:junit4]   2> 309 T103 oasc.SolrCore.registerSearcher [col_bad] Registered new searcher
Searcher@1f84b826 main{StandardDirectoryReader(segments_1:1)}
[junit4:junit4]   2> 309 T101 oasc.CoreContainer.create Creating SolrCore 'bogus' using
instanceDir: /mnt/ssd/jenkins/workspace/Lucene-Solr-trunk-Linux-Java7-64/checkout/solr/build/solr-core/test/J1/./org.apache.solr.core.CoreContainerCoreInitFailuresTest_bad_flow/bogus_path
[junit4:junit4]   2> 310 T101 oasc.SolrResourceLoader.<init> new SolrResourceLoader
for directory: '/mnt/ssd/jenkins/workspace/Lucene-Solr-trunk-Linux-Java7-64/checkout/solr/build/solr-core/test/J1/./org.apache.solr.core.CoreContainerCoreInitFailuresTest_bad_flow/bogus_path/'
[junit4:junit4]   2> 315 T101 oasc.CoreContainer.register registering core: bogus
[junit4:junit4]   2> 316 T101 oasc.CoreContainer.reload Reloading SolrCore 'col_bad' using
instanceDir: /mnt/ssd/jenkins/workspace/Lucene-Solr-trunk-Linux-Java7-64/checkout/solr/build/solr-core/test/J1/./org.apache.solr.core.CoreContainerCoreInitFailuresTest_bad_flow/col_bad
[junit4:junit4]   2> 316 T101 oasc.SolrResourceLoader.<init> new SolrResourceLoader
for directory: '/mnt/ssd/jenkins/workspace/Lucene-Solr-trunk-Linux-Java7-64/checkout/solr/build/solr-core/test/J1/./org.apache.solr.core.CoreContainerCoreInitFailuresTest_bad_flow/col_bad/'
[junit4:junit4]   2> 336 T101 oasc.SolrException.log SEVERE Exception during parsing file:
solrconfig.xml:org.xml.sax.SAXParseException; systemId: solrres:/solrconfig.xml; lineNumber:
1; columnNumber: 1; El contenido no está permitido en el prólogo.
[junit4:junit4]   2> 		at com.sun.org.apache.xerces.internal.util.ErrorHandlerWrapper.createSAXParseException(ErrorHandlerWrapper.java:198)
[junit4:junit4]   2> 		at com.sun.org.apache.xerces.internal.util.ErrorHandlerWrapper.fatalError(ErrorHandlerWrapper.java:177)
[junit4:junit4]   2> 		at com.sun.org.apache.xerces.internal.impl.XMLErrorReporter.reportError(XMLErrorReporter.java:441)
[junit4:junit4]   2> 		at com.sun.org.apache.xerces.internal.impl.XMLErrorReporter.reportError(XMLErrorReporter.java:368)
[junit4:junit4]   2> 		at com.sun.org.apache.xerces.internal.impl.XMLScanner.reportFatalError(XMLScanner.java:1388)
[junit4:junit4]   2> 		at com.sun.org.apache.xerces.internal.impl.XMLDocumentScannerImpl$PrologDriver.next(XMLDocumentScannerImpl.java:996)
[junit4:junit4]   2> 		at com.sun.org.apache.xerces.internal.impl.XMLDocumentScannerImpl.next(XMLDocumentScannerImpl.java:607)
[junit4:junit4]   2> 		at com.sun.org.apache.xerces.internal.impl.XMLNSDocumentScannerImpl.next(XMLNSDocumentScannerImpl.java:116)
[junit4:junit4]   2> 		at com.sun.org.apache.xerces.internal.impl.XMLDocumentFragmentScannerImpl.scanDocument(XMLDocumentFragmentScannerImpl.java:488)
[junit4:junit4]   2> 		at com.sun.org.apache.xerces.internal.parsers.XML11Configuration.parse(XML11Configuration.java:835)
[junit4:junit4]   2> 		at com.sun.org.apache.xerces.internal.parsers.XML11Configuration.parse(XML11Configuration.java:764)
[junit4:junit4]   2> 		at com.sun.org.apache.xerces.internal.parsers.XMLParser.parse(XMLParser.java:123)
[junit4:junit4]   2> 		at com.sun.org.apache.xerces.internal.parsers.DOMParser.parse(DOMParser.java:237)
[junit4:junit4]   2> 		at com.sun.org.apache.xerces.internal.jaxp.DocumentBuilderImpl.parse(DocumentBuilderImpl.java:300)
[junit4:junit4]   2> 		at org.apache.solr.core.Config.<init>(Config.java:129)
[junit4:junit4]   2> 		at org.apache.solr.core.Config.<init>(Config.java:78)
[junit4:junit4]   2> 		at org.apache.solr.core.SolrConfig.<init>(SolrConfig.java:117)
[junit4:junit4]   2> 		at org.apache.solr.core.SolrCore.reload(SolrCore.java:364)
[junit4:junit4]   2> 		at org.apache.solr.core.CoreContainer.reload(CoreContainer.java:1015)
[junit4:junit4]   2> 		at org.apache.solr.core.CoreContainerCoreInitFailuresTest.testFlowBadFromStart(CoreContainerCoreInitFailuresTest.java:250)
[junit4:junit4]   2> 		at sun.reflect.NativeMethodAccessorImpl.invoke0(Native Method)
[junit4:junit4]   2> 		at sun.reflect.NativeMethodAccessorImpl.invoke(NativeMethodAccessorImpl.java:57)
[junit4:junit4]   2> 		at sun.reflect.DelegatingMethodAccessorImpl.invoke(DelegatingMethodAccessorImpl.java:43)
[junit4:junit4]   2> 		at java.lang.reflect.Method.invoke(Method.java:601)
[junit4:junit4]   2> 		at com.carrotsearch.randomizedtesting.RandomizedRunner.invoke(RandomizedRunner.java:1995)
[junit4:junit4]   2> 		at com.carrotsearch.randomizedtesting.RandomizedRunner.access$1100(RandomizedRunner.java:132)
[junit4:junit4]   2> 		at com.carrotsearch.randomizedtesting.RandomizedRunner$6.evaluate(RandomizedRunner.java:818)
[junit4:junit4]   2> 		at com.carrotsearch.randomizedtesting.RandomizedRunner$7.evaluate(RandomizedRunner.java:877)
[junit4:junit4]   2> 		at com.carrotsearch.randomizedtesting.RandomizedRunner$8.evaluate(RandomizedRunner.java:891)
[junit4:junit4]   2> 		at com.carrotsearch.randomizedtesting.rules.SystemPropertiesRestoreRule$1.evaluate(SystemPropertiesRestoreRule.java:53)
[junit4:junit4]   2> 		at org.apache.lucene.util.TestRuleSetupTeardownChained$1.evaluate(TestRuleSetupTeardownChained.java:50)
[junit4:junit4]   2> 		at org.apache.lucene.util.TestRuleFieldCacheSanity$1.evaluate(TestRuleFieldCacheSanity.java:32)
[junit4:junit4]   2> 		at org.apache.lucene.util.AbstractBeforeAfterRule$1.evaluate(AbstractBeforeAfterRule.java:45)
[junit4:junit4]   2> 		at com.carrotsearch.randomizedtesting.rules.SystemPropertiesInvariantRule$1.evaluate(SystemPropertiesInvariantRule.java:55)
[junit4:junit4]   2> 		at org.apache.lucene.util.TestRuleReportUncaughtExceptions$1.evaluate(TestRuleReportUncaughtExceptions.java:68)
[junit4:junit4]   2> 		at org.apache.lucene.util.TestRuleThreadAndTestName$1.evaluate(TestRuleThreadAndTestName.java:48)
[junit4:junit4]   2> 		at org.apache.lucene.util.TestRuleIgnoreAfterMaxFailures$1.evaluate(TestRuleIgnoreAfterMaxFailures.java:70)
[junit4:junit4]   2> 		at org.apache.lucene.util.TestRuleMarkFailure$1.evaluate(TestRuleMarkFailure.java:48)
[junit4:junit4]   2> 		at com.carrotsearch.randomizedtesting.RandomizedRunner.runSingleTest(RandomizedRunner.java:825)
[junit4:junit4]   2> 		at com.carrotsearch.randomizedtesting.RandomizedRunner.access$700(RandomizedRunner.java:132)
[junit4:junit4]   2> 		at com.carrotsearch.randomizedtesting.RandomizedRunner$3$1.run(RandomizedRunner.java:671)
[junit4:junit4]   2> 		at com.carrotsearch.randomizedtesting.RandomizedRunner$3.evaluate(RandomizedRunner.java:697)
[junit4:junit4]   2> 		at com.carrotsearch.randomizedtesting.RandomizedRunner$4.evaluate(RandomizedRunner.java:736)
[junit4:junit4]   2> 		at com.carrotsearch.randomizedtesting.RandomizedRunner$5.evaluate(RandomizedRunner.java:747)
[junit4:junit4]   2> 		at com.carrotsearch.randomizedtesting.rules.SystemPropertiesRestoreRule$1.evaluate(SystemPropertiesRestoreRule.java:53)
[junit4:junit4]   2> 		at org.apache.lucene.util.AbstractBeforeAfterRule$1.evaluate(AbstractBeforeAfterRule.java:45)
[junit4:junit4]   2> 		at org.apache.lucene.util.TestRuleReportUncaughtExceptions$1.evaluate(TestRuleReportUncaughtExceptions.java:68)
[junit4:junit4]   2> 		at org.apache.lucene.util.TestRuleStoreClassName$1.evaluate(TestRuleStoreClassName.java:38)
[junit4:junit4]   2> 		at com.carrotsearch.randomizedtesting.rules.SystemPropertiesInvariantRule$1.evaluate(SystemPropertiesInvariantRule.java:55)
[junit4:junit4]   2> 		at org.apache.lucene.util.TestRuleNoInstanceHooksOverrides$1.evaluate(TestRuleNoInstanceHooksOverrides.java:53)
[junit4:junit4]   2> 		at org.apache.lucene.util.TestRuleNoStaticHooksShadowing$1.evaluate(TestRuleNoStaticHooksShadowing.java:52)
[junit4:junit4]   2> 		at org.apache.lucene.util.TestRuleAssertionsRequired$1.evaluate(TestRuleAssertionsRequired.java:36)
[junit4:junit4]   2> 		at org.apache.lucene.util.TestRuleMarkFailure$1.evaluate(TestRuleMarkFailure.java:48)
[junit4:junit4]   2> 		at org.apache.lucene.util.TestRuleIgnoreAfterMaxFailures$1.evaluate(TestRuleIgnoreAfterMaxFailures.java:70)
[junit4:junit4]   2> 		at org.apache.lucene.util.TestRuleIgnoreTestSuites$1.evaluate(TestRuleIgnoreTestSuites.java:55)
[junit4:junit4]   2> 		at com.carrotsearch.randomizedtesting.RandomizedRunner.runSuite(RandomizedRunner.java:605)
[junit4:junit4]   2> 		at com.carrotsearch.randomizedtesting.RandomizedRunner.access$400(RandomizedRunner.java:132)
[junit4:junit4]   2> 		at com.carrotsearch.randomizedtesting.RandomizedRunner$2.run(RandomizedRunner.java:551)
[junit4:junit4]   2> 	
[junit4:junit4]   2> 338 T101 oasc.CoreContainer.shutdown Shutting down CoreContainer instance=1369197050
[junit4:junit4]   2> 338 T101 oasc.SolrCore.close [col_bad]  CLOSING SolrCore org.apache.solr.core.SolrCore@17cbfeb9
[junit4:junit4]   2> 339 T101 oasc.SolrCore.closeSearcher [col_bad] Closing main searcher
on request.
[junit4:junit4]   2> 339 T101 oasu.DirectUpdateHandler2.close closing DirectUpdateHandler2{commits=0,autocommits=0,soft
autocommits=0,optimizes=0,rollbacks=0,expungeDeletes=0,docsPending=0,adds=0,deletesById=0,deletesByQuery=0,errors=0,cumulative_adds=0,cumulative_deletesById=0,cumulative_deletesByQuery=0,cumulative_errors=0}
[junit4:junit4]   2> 340 T101 oasc.SolrCore.close [bogus]  CLOSING SolrCore org.apache.solr.core.SolrCore@3ce914bc
[junit4:junit4]   2> 340 T101 oasc.SolrCore.closeSearcher [bogus] Closing main searcher
on request.
[junit4:junit4]   2> 340 T101 oasu.DirectUpdateHandler2.close closing DirectUpdateHandler2{commits=0,autocommits=0,soft
autocommits=0,optimizes=0,rollbacks=0,expungeDeletes=0,docsPending=0,adds=0,deletesById=0,deletesByQuery=0,errors=0,cumulative_adds=0,cumulative_deletesById=0,cumulative_deletesByQuery=0,cumulative_errors=0}
[junit4:junit4]   2> 345 T101 oas.SolrTestCaseJ4.tearDown ###Ending testFlowBadFromStart
[junit4:junit4]   2> NOTE: reproduce with: ant test  -Dtestcase=CoreContainerCoreInitFailuresTest
-Dtests.method=testFlowBadFromStart -Dtests.seed=3B0A7CB954F1A5B -Dtests.multiplier=3 -Dtests.slow=true
-Dtests.locale=es_EC -Dtests.timezone=America/Guatemala -Dtests.file.encoding=ISO-8859-1
[junit4:junit4]   2>
[junit4:junit4]    > (@AfterClass output)
[junit4:junit4]   2> 448 T101 oas.SolrTestCaseJ4.deleteCore ###deleteCore
[junit4:junit4]   2> NOTE: test params are: codec=Lucene40: {}, sim=DefaultSimilarity,
locale=es_EC, timezone=America/Guatemala
[junit4:junit4]   2> NOTE: Linux 3.2.0-26-generic amd64/Oracle Corporation 1.7.0_05 (64-bit)/cpus=8,threads=1,free=79454224,total=452984832
[junit4:junit4]   2> NOTE: All tests run in this JVM: [TestQueryTypes, FieldAnalysisRequestHandlerTest,
TestRealTimeGet, SpellingQueryConverterTest, TestGroupingSearch, CoreContainerCoreInitFailuresTest]
[junit4:junit4]   2> 
[junit4:junit4] Completed on J1 in 0.46s, 2 tests, 1 failure <<< FAILURES!

[...truncated 651 lines...]
BUILD FAILED
/mnt/ssd/jenkins/workspace/Lucene-Solr-trunk-Linux-Java7-64/checkout/build.xml:29: The following
error occurred while executing this line:
/mnt/ssd/jenkins/workspace/Lucene-Solr-trunk-Linux-Java7-64/checkout/solr/build.xml:144: The
following error occurred while executing this line:
/mnt/ssd/jenkins/workspace/Lucene-Solr-trunk-Linux-Java7-64/checkout/lucene/module-build.xml:62:
The following error occurred while executing this line:
/mnt/ssd/jenkins/workspace/Lucene-Solr-trunk-Linux-Java7-64/checkout/lucene/common-build.xml:1094:
The following error occurred while executing this line:
/mnt/ssd/jenkins/workspace/Lucene-Solr-trunk-Linux-Java7-64/checkout/lucene/common-build.xml:789:
There were test failures: 222 suites, 897 tests, 1 failure, 5 ignored

Total time: 19 minutes 42 seconds
Build step 'Execute shell' marked build as failure
Archiving artifacts
Recording test results
Email was triggered for: Failure
Sending email for trigger: Failure




Mime
View raw message