lucene-dev mailing list archives

Site index · List index
Message view « Date » · « Thread »
Top « Date » · « Thread »
From Apache Jenkins Server <jenk...@builds.apache.org>
Subject [JENKINS] Lucene-Solr-tests-only-4.x - Build # 327 - Still Failing
Date Tue, 24 Jul 2012 18:20:04 GMT
Build: https://builds.apache.org/job/Lucene-Solr-tests-only-4.x/327/

1 tests failed.
FAILED:  junit.framework.TestSuite.org.apache.solr.cloud.SyncSliceTest

Error Message:
ERROR: SolrIndexSearcher opens=28 closes=27

Stack Trace:
java.lang.AssertionError: ERROR: SolrIndexSearcher opens=28 closes=27
	at __randomizedtesting.SeedInfo.seed([575EFA7F42E6D217]:0)
	at org.junit.Assert.fail(Assert.java:93)
	at org.apache.solr.SolrTestCaseJ4.endTrackingSearchers(SolrTestCaseJ4.java:216)
	at org.apache.solr.SolrTestCaseJ4.afterClass(SolrTestCaseJ4.java:82)
	at sun.reflect.GeneratedMethodAccessor16.invoke(Unknown Source)
	at sun.reflect.DelegatingMethodAccessorImpl.invoke(DelegatingMethodAccessorImpl.java:43)
	at java.lang.reflect.Method.invoke(Method.java:616)
	at com.carrotsearch.randomizedtesting.RandomizedRunner.invoke(RandomizedRunner.java:1995)
	at com.carrotsearch.randomizedtesting.RandomizedRunner.access$1100(RandomizedRunner.java:132)
	at com.carrotsearch.randomizedtesting.RandomizedRunner$5.evaluate(RandomizedRunner.java:754)
	at com.carrotsearch.randomizedtesting.rules.SystemPropertiesRestoreRule$1.evaluate(SystemPropertiesRestoreRule.java:53)
	at org.apache.lucene.util.AbstractBeforeAfterRule$1.evaluate(AbstractBeforeAfterRule.java:45)
	at org.apache.lucene.util.TestRuleReportUncaughtExceptions$1.evaluate(TestRuleReportUncaughtExceptions.java:68)
	at org.apache.lucene.util.TestRuleStoreClassName$1.evaluate(TestRuleStoreClassName.java:38)
	at org.apache.lucene.util.TestRuleIcuHack$1.evaluate(TestRuleIcuHack.java:51)
	at com.carrotsearch.randomizedtesting.rules.SystemPropertiesInvariantRule$1.evaluate(SystemPropertiesInvariantRule.java:55)
	at org.apache.lucene.util.TestRuleNoInstanceHooksOverrides$1.evaluate(TestRuleNoInstanceHooksOverrides.java:53)
	at org.apache.lucene.util.TestRuleNoStaticHooksShadowing$1.evaluate(TestRuleNoStaticHooksShadowing.java:52)
	at org.apache.lucene.util.TestRuleAssertionsRequired$1.evaluate(TestRuleAssertionsRequired.java:36)
	at org.apache.lucene.util.TestRuleMarkFailure$1.evaluate(TestRuleMarkFailure.java:48)
	at org.apache.lucene.util.TestRuleIgnoreAfterMaxFailures$1.evaluate(TestRuleIgnoreAfterMaxFailures.java:70)
	at org.apache.lucene.util.TestRuleIgnoreTestSuites$1.evaluate(TestRuleIgnoreTestSuites.java:55)
	at com.carrotsearch.randomizedtesting.RandomizedRunner.runSuite(RandomizedRunner.java:605)
	at com.carrotsearch.randomizedtesting.RandomizedRunner.access$400(RandomizedRunner.java:132)
	at com.carrotsearch.randomizedtesting.RandomizedRunner$2.run(RandomizedRunner.java:551)




Build Log:
[...truncated 9799 lines...]
[junit4:junit4]    > (@AfterClass output)
[junit4:junit4]   2> 38386 T1828 oas.SolrTestCaseJ4.deleteCore ###deleteCore
[junit4:junit4]   2> 38425 T1927 oasc.Overseer$CloudStateUpdater.amILeader WARNING  org.apache.zookeeper.KeeperException$SessionExpiredException:
KeeperErrorCode = Session expired for /overseer_elect/leader
[junit4:junit4]   2> 	at org.apache.zookeeper.KeeperException.create(KeeperException.java:118)
[junit4:junit4]   2> 	at org.apache.zookeeper.KeeperException.create(KeeperException.java:42)
[junit4:junit4]   2> 	at org.apache.zookeeper.ZooKeeper.getData(ZooKeeper.java:927)
[junit4:junit4]   2> 	at org.apache.solr.common.cloud.SolrZkClient$7.execute(SolrZkClient.java:289)
[junit4:junit4]   2> 	at org.apache.solr.common.cloud.SolrZkClient$7.execute(SolrZkClient.java:286)
[junit4:junit4]   2> 	at org.apache.solr.common.cloud.ZkCmdExecutor.retryOperation(ZkCmdExecutor.java:67)
[junit4:junit4]   2> 	at org.apache.solr.common.cloud.SolrZkClient.getData(SolrZkClient.java:286)
[junit4:junit4]   2> 	at org.apache.solr.cloud.Overseer$CloudStateUpdater.amILeader(Overseer.java:187)
[junit4:junit4]   2> 	at org.apache.solr.cloud.Overseer$CloudStateUpdater.run(Overseer.java:113)
[junit4:junit4]   2> 	at java.lang.Thread.run(Thread.java:679)
[junit4:junit4]   2> 
[junit4:junit4]   2> 38425 T1927 oasc.Overseer$CloudStateUpdater.amILeader According to
ZK I (id=88024900920541189-127.0.0.1:43433_solr-n_0000000003) am no longer a leader.
[junit4:junit4]   2> 40616 T1831 oazs.SessionTrackerImpl.run SessionTrackerImpl exited
loop!
[junit4:junit4]   2> 48568 T1874 oasc.SyncStrategy.syncToMe Sync failed - asking replica
to recover.
[junit4:junit4]   2> 48568 T1874 oascsi.HttpClientUtil.createClient Creating new http client,
config:maxConnections=128&maxConnectionsPerHost=32&followRedirects=false
[junit4:junit4]   2> 93581 T1874 oasc.SyncStrategy.syncToMe Could not tell a replica to
recover org.apache.solr.client.solrj.SolrServerException: IOException occured when talking
to server at: http://127.0.0.1:22333/solr/collection1
[junit4:junit4]   2> 	at org.apache.solr.client.solrj.impl.HttpSolrServer.request(HttpSolrServer.java:414)
[junit4:junit4]   2> 	at org.apache.solr.client.solrj.impl.HttpSolrServer.request(HttpSolrServer.java:182)
[junit4:junit4]   2> 	at org.apache.solr.cloud.SyncStrategy.syncToMe(SyncStrategy.java:237)
[junit4:junit4]   2> 	at org.apache.solr.cloud.SyncStrategy.syncReplicas(SyncStrategy.java:119)
[junit4:junit4]   2> 	at org.apache.solr.cloud.SyncStrategy.sync(SyncStrategy.java:82)
[junit4:junit4]   2> 	at org.apache.solr.cloud.ShardLeaderElectionContext.runLeaderProcess(ElectionContext.java:158)
[junit4:junit4]   2> 	at org.apache.solr.cloud.LeaderElector.runIamLeaderProcess(LeaderElector.java:151)
[junit4:junit4]   2> 	at org.apache.solr.cloud.LeaderElector.checkIfIamLeader(LeaderElector.java:96)
[junit4:junit4]   2> 	at org.apache.solr.cloud.LeaderElector.access$000(LeaderElector.java:57)
[junit4:junit4]   2> 	at org.apache.solr.cloud.LeaderElector$1.process(LeaderElector.java:125)
[junit4:junit4]   2> 	at org.apache.zookeeper.ClientCnxn$EventThread.processEvent(ClientCnxn.java:526)
[junit4:junit4]   2> 	at org.apache.zookeeper.ClientCnxn$EventThread.run(ClientCnxn.java:502)
[junit4:junit4]   2> Caused by: org.apache.http.conn.ConnectTimeoutException: Connect to
127.0.0.1:22333 timed out
[junit4:junit4]   2> 	at org.apache.http.conn.scheme.PlainSocketFactory.connectSocket(PlainSocketFactory.java:125)
[junit4:junit4]   2> 	at org.apache.http.impl.conn.DefaultClientConnectionOperator.openConnection(DefaultClientConnectionOperator.java:148)
[junit4:junit4]   2> 	at org.apache.http.impl.conn.AbstractPoolEntry.open(AbstractPoolEntry.java:150)
[junit4:junit4]   2> 	at org.apache.http.impl.conn.AbstractPooledConnAdapter.open(AbstractPooledConnAdapter.java:121)
[junit4:junit4]   2> 	at org.apache.http.impl.client.DefaultRequestDirector.tryConnect(DefaultRequestDirector.java:575)
[junit4:junit4]   2> 	at org.apache.http.impl.client.DefaultRequestDirector.execute(DefaultRequestDirector.java:425)
[junit4:junit4]   2> 	at org.apache.http.impl.client.AbstractHttpClient.execute(AbstractHttpClient.java:820)
[junit4:junit4]   2> 	at org.apache.http.impl.client.AbstractHttpClient.execute(AbstractHttpClient.java:754)
[junit4:junit4]   2> 	at org.apache.http.impl.client.AbstractHttpClient.execute(AbstractHttpClient.java:732)
[junit4:junit4]   2> 	at org.apache.solr.client.solrj.impl.HttpSolrServer.request(HttpSolrServer.java:353)
[junit4:junit4]   2> 	... 11 more
[junit4:junit4]   2> 
[junit4:junit4]   2> 93582 T1874 oasc.RecoveryStrategy.close WARNING Stopping recovery
for core collection1 zkNodeName=127.0.0.1:41888_solr_collection1
[junit4:junit4]   2> 93582 T1874 oasc.LeaderElector$1.process WARNING  org.apache.zookeeper.KeeperException$SessionExpiredException:
KeeperErrorCode = Session expired for /overseer/queue/qn-
[junit4:junit4]   2> 	at org.apache.zookeeper.KeeperException.create(KeeperException.java:118)
[junit4:junit4]   2> 	at org.apache.zookeeper.KeeperException.create(KeeperException.java:42)
[junit4:junit4]   2> 	at org.apache.zookeeper.ZooKeeper.create(ZooKeeper.java:643)
[junit4:junit4]   2> 	at org.apache.solr.common.cloud.SolrZkClient$5.execute(SolrZkClient.java:244)
[junit4:junit4]   2> 	at org.apache.solr.common.cloud.SolrZkClient$5.execute(SolrZkClient.java:241)
[junit4:junit4]   2> 	at org.apache.solr.common.cloud.ZkCmdExecutor.retryOperation(ZkCmdExecutor.java:67)
[junit4:junit4]   2> 	at org.apache.solr.common.cloud.SolrZkClient.create(SolrZkClient.java:241)
[junit4:junit4]   2> 	at org.apache.solr.cloud.DistributedQueue.offer(DistributedQueue.java:236)
[junit4:junit4]   2> 	at org.apache.solr.cloud.ZkController.publish(ZkController.java:734)
[junit4:junit4]   2> 	at org.apache.solr.cloud.ShardLeaderElectionContext.runLeaderProcess(ElectionContext.java:168)
[junit4:junit4]   2> 	at org.apache.solr.cloud.LeaderElector.runIamLeaderProcess(LeaderElector.java:151)
[junit4:junit4]   2> 	at org.apache.solr.cloud.LeaderElector.checkIfIamLeader(LeaderElector.java:96)
[junit4:junit4]   2> 	at org.apache.solr.cloud.LeaderElector.access$000(LeaderElector.java:57)
[junit4:junit4]   2> 	at org.apache.solr.cloud.LeaderElector$1.process(LeaderElector.java:125)
[junit4:junit4]   2> 	at org.apache.zookeeper.ClientCnxn$EventThread.processEvent(ClientCnxn.java:526)
[junit4:junit4]   2> 	at org.apache.zookeeper.ClientCnxn$EventThread.run(ClientCnxn.java:502)
[junit4:junit4]   2> 
[junit4:junit4]   2> 93583 T1874 oascc.ZkStateReader$3.process Updating live nodes
[junit4:junit4]   2> 93583 T1874 oascc.ZkStateReader$3.process WARNING ZooKeeper watch
triggered, but Solr cannot talk to ZK
[junit4:junit4]   2> 93583 T1874 oasc.LeaderElector$1.process WARNING  org.apache.zookeeper.KeeperException$SessionExpiredException:
KeeperErrorCode = Session expired for /overseer_elect/election
[junit4:junit4]   2> 	at org.apache.zookeeper.KeeperException.create(KeeperException.java:118)
[junit4:junit4]   2> 	at org.apache.zookeeper.KeeperException.create(KeeperException.java:42)
[junit4:junit4]   2> 	at org.apache.zookeeper.ZooKeeper.getChildren(ZooKeeper.java:1249)
[junit4:junit4]   2> 	at org.apache.solr.common.cloud.SolrZkClient$6.execute(SolrZkClient.java:266)
[junit4:junit4]   2> 	at org.apache.solr.common.cloud.SolrZkClient$6.execute(SolrZkClient.java:263)
[junit4:junit4]   2> 	at org.apache.solr.common.cloud.ZkCmdExecutor.retryOperation(ZkCmdExecutor.java:67)
[junit4:junit4]   2> 	at org.apache.solr.common.cloud.SolrZkClient.getChildren(SolrZkClient.java:263)
[junit4:junit4]   2> 	at org.apache.solr.cloud.LeaderElector.checkIfIamLeader(LeaderElector.java:91)
[junit4:junit4]   2> 	at org.apache.solr.cloud.LeaderElector.access$000(LeaderElector.java:57)
[junit4:junit4]   2> 	at org.apache.solr.cloud.LeaderElector$1.process(LeaderElector.java:125)
[junit4:junit4]   2> 	at org.apache.zookeeper.ClientCnxn$EventThread.processEvent(ClientCnxn.java:526)
[junit4:junit4]   2> 	at org.apache.zookeeper.ClientCnxn$EventThread.run(ClientCnxn.java:502)
[junit4:junit4]   2> 
[junit4:junit4]   2> 93583 T1874 oaz.ClientCnxn$EventThread.run EventThread shut down
[junit4:junit4]   2> 93821 T1868 C119 P41888 oasc.SolrException.log SEVERE shard update
error StdNode: http://127.0.0.1:22333/solr/collection1/:org.apache.solr.client.solrj.SolrServerException:
Server refused connection at: http://127.0.0.1:22333/solr/collection1
[junit4:junit4]   2> 		at org.apache.solr.client.solrj.impl.HttpSolrServer.request(HttpSolrServer.java:407)
[junit4:junit4]   2> 		at org.apache.solr.client.solrj.impl.HttpSolrServer.request(HttpSolrServer.java:182)
[junit4:junit4]   2> 		at org.apache.solr.update.SolrCmdDistributor$1.call(SolrCmdDistributor.java:336)
[junit4:junit4]   2> 		at org.apache.solr.update.SolrCmdDistributor$1.call(SolrCmdDistributor.java:317)
[junit4:junit4]   2> 		at java.util.concurrent.FutureTask$Sync.innerRun(FutureTask.java:334)
[junit4:junit4]   2> 		at java.util.concurrent.FutureTask.run(FutureTask.java:166)
[junit4:junit4]   2> 		at java.util.concurrent.Executors$RunnableAdapter.call(Executors.java:471)
[junit4:junit4]   2> 		at java.util.concurrent.FutureTask$Sync.innerRun(FutureTask.java:334)
[junit4:junit4]   2> 		at java.util.concurrent.FutureTask.run(FutureTask.java:166)
[junit4:junit4]   2> 		at org.apache.solr.update.SolrCmdDistributor$BoundedExecutor$1.run(SolrCmdDistributor.java:538)
[junit4:junit4]   2> 		at java.util.concurrent.ThreadPoolExecutor.runWorker(ThreadPoolExecutor.java:1110)
[junit4:junit4]   2> 		at java.util.concurrent.ThreadPoolExecutor$Worker.run(ThreadPoolExecutor.java:603)
[junit4:junit4]   2> 		at java.lang.Thread.run(Thread.java:679)
[junit4:junit4]   2> 	Caused by: org.apache.http.conn.HttpHostConnectException: Connection
to http://127.0.0.1:22333 refused
[junit4:junit4]   2> 		at org.apache.http.impl.conn.DefaultClientConnectionOperator.openConnection(DefaultClientConnectionOperator.java:158)
[junit4:junit4]   2> 		at org.apache.http.impl.conn.AbstractPoolEntry.open(AbstractPoolEntry.java:150)
[junit4:junit4]   2> 		at org.apache.http.impl.conn.AbstractPooledConnAdapter.open(AbstractPooledConnAdapter.java:121)
[junit4:junit4]   2> 		at org.apache.http.impl.client.DefaultRequestDirector.tryConnect(DefaultRequestDirector.java:575)
[junit4:junit4]   2> 		at org.apache.http.impl.client.DefaultRequestDirector.execute(DefaultRequestDirector.java:425)
[junit4:junit4]   2> 		at org.apache.http.impl.client.AbstractHttpClient.execute(AbstractHttpClient.java:820)
[junit4:junit4]   2> 		at org.apache.http.impl.client.AbstractHttpClient.execute(AbstractHttpClient.java:754)
[junit4:junit4]   2> 		at org.apache.http.impl.client.AbstractHttpClient.execute(AbstractHttpClient.java:732)
[junit4:junit4]   2> 		at org.apache.solr.client.solrj.impl.HttpSolrServer.request(HttpSolrServer.java:353)
[junit4:junit4]   2> 		... 12 more
[junit4:junit4]   2> 	Caused by: java.net.ConnectException: Operation timed out
[junit4:junit4]   2> 		at java.net.PlainSocketImpl.socketConnect(Native Method)
[junit4:junit4]   2> 		at java.net.AbstractPlainSocketImpl.doConnect(AbstractPlainSocketImpl.java:327)
[junit4:junit4]   2> 		at java.net.AbstractPlainSocketImpl.connectToAddress(AbstractPlainSocketImpl.java:193)
[junit4:junit4]   2> 		at java.net.AbstractPlainSocketImpl.connect(AbstractPlainSocketImpl.java:180)
[junit4:junit4]   2> 		at java.net.SocksSocketImpl.connect(SocksSocketImpl.java:384)
[junit4:junit4]   2> 		at java.net.Socket.connect(Socket.java:546)
[junit4:junit4]   2> 		at org.apache.http.conn.scheme.PlainSocketFactory.connectSocket(PlainSocketFactory.java:123)
[junit4:junit4]   2> 		at org.apache.http.impl.conn.DefaultClientConnectionOperator.openConnection(DefaultClientConnectionOperator.java:148)
[junit4:junit4]   2> 		... 20 more
[junit4:junit4]   2> 	
[junit4:junit4]   2> 159507 T1828 oas.SolrTestCaseJ4.endTrackingSearchers SEVERE ERROR:
SolrIndexSearcher opens=28 closes=27
[junit4:junit4]   2> NOTE: test params are: codec=Lucene40: {range_facet_l=MockFixedIntBlock(blockSize=893),
text=PostingsFormat(name=Asserting), _version_=MockFixedIntBlock(blockSize=893), rnd_b=PostingsFormat(name=MockRandom),
intDefault=MockFixedIntBlock(blockSize=893), id=PostingsFormat(name=MockRandom), timestamp=MockFixedIntBlock(blockSize=893),
a_t=MockFixedIntBlock(blockSize=893), range_facet_sl=PostingsFormat(name=Asserting), range_facet_si=PostingsFormat(name=SimpleText),
other_tl1=MockFixedIntBlock(blockSize=893), multiDefault=PostingsFormat(name=SimpleText),
a_si=PostingsFormat(name=SimpleText)}, sim=DefaultSimilarity, locale=nl_BE, timezone=Africa/Kampala
[junit4:junit4]   2> NOTE: FreeBSD 9.0-RELEASE amd64/Sun Microsystems Inc. 1.6.0_32 (64-bit)/cpus=16,threads=7,free=188515584,total=316932096
[junit4:junit4]   2> NOTE: All tests run in this JVM: [FastVectorHighlighterTest, SolrIndexConfigTest,
TestWordDelimiterFilterFactory, TestHTMLStripCharFilterFactory, TestChineseFilterFactory,
BasicDistributedZkTest, TestSolrCoreProperties, TestSwedishLightStemFilterFactory, TestDistributedGrouping,
TestHashPartitioner, ZkNodePropsTest, TestRandomFaceting, TestPropInject, UpdateRequestProcessorFactoryTest,
TestFrenchLightStemFilterFactory, SolrInfoMBeanTest, TestItalianLightStemFilterFactory, SOLR749Test,
DirectUpdateHandlerTest, TestSurroundQueryParser, FullSolrCloudDistribCmdsTest, TestExtendedDismaxParser,
TestJmxIntegration, TestSolrQueryParser, HighlighterTest, DisMaxRequestHandlerTest, TestFaceting,
DirectUpdateHandlerOptimizeTest, EchoParamsTest, TestDistributedSearch, TestDelimitedPayloadTokenFilterFactory,
TestCapitalizationFilterFactory, PingRequestHandlerTest, TestRTGBase, StatelessScriptUpdateProcessorFactoryTest,
TestReversedWildcardFilterFactory, TestPortugueseMinimalStemFilterFactory, TestTrimFilterFactory,
CoreAdminHandlerTest, TestJapanesePartOfSpeechStopFilterFactory, TestBM25SimilarityFactory,
TestCodecSupport, ConvertedLegacyTest, TestFiltering, PreAnalyzedFieldTest, TestFrenchMinimalStemFilterFactory,
DOMUtilTest, TestFinnishLightStemFilterFactory, TermsComponentTest, TestBulgarianStemFilterFactory,
TestIndexingPerformance, CopyFieldTest, LukeRequestHandlerTest, JSONWriterTest, TestJapaneseBaseFormFilterFactory,
TestGalicianStemFilterFactory, BadComponentTest, SolrRequestParserTest, TestUpdate, TestDFRSimilarityFactory,
SolrCoreCheckLockOnStartupTest, DirectSolrSpellCheckerTest, SuggesterWFSTTest, PluginInfoTest,
TestJapaneseKatakanaStemFilterFactory, TestJapaneseIterationMarkCharFilterFactory, TestGermanLightStemFilterFactory,
RequiredFieldsTest, PrimitiveFieldTypeTest, TestSynonymFilterFactory, SyncSliceTest]
[junit4:junit4]   2> NOTE: reproduce with: ant test  -Dtestcase=SyncSliceTest -Dtests.seed=575EFA7F42E6D217
-Dtests.multiplier=3 -Dtests.slow=true -Dtests.locale=nl_BE -Dtests.timezone=Africa/Kampala
-Dtests.file.encoding=US-ASCII
[junit4:junit4]   2> 
[junit4:junit4] ERROR   0.00s J0 | SyncSliceTest (suite)
[junit4:junit4]    > Throwable #1: java.lang.AssertionError: ERROR: SolrIndexSearcher opens=28
closes=27
[junit4:junit4]    > 	at __randomizedtesting.SeedInfo.seed([575EFA7F42E6D217]:0)
[junit4:junit4]    > 	at org.junit.Assert.fail(Assert.java:93)
[junit4:junit4]    > 	at org.apache.solr.SolrTestCaseJ4.endTrackingSearchers(SolrTestCaseJ4.java:216)
[junit4:junit4]    > 	at org.apache.solr.SolrTestCaseJ4.afterClass(SolrTestCaseJ4.java:82)
[junit4:junit4]    > 	at sun.reflect.GeneratedMethodAccessor16.invoke(Unknown Source)
[junit4:junit4]    > 	at sun.reflect.DelegatingMethodAccessorImpl.invoke(DelegatingMethodAccessorImpl.java:43)
[junit4:junit4]    > 	at java.lang.reflect.Method.invoke(Method.java:616)
[junit4:junit4]    > 	at com.carrotsearch.randomizedtesting.RandomizedRunner.invoke(RandomizedRunner.java:1995)
[junit4:junit4]    > 	at com.carrotsearch.randomizedtesting.RandomizedRunner.access$1100(RandomizedRunner.java:132)
[junit4:junit4]    > 	at com.carrotsearch.randomizedtesting.RandomizedRunner$5.evaluate(RandomizedRunner.java:754)
[junit4:junit4]    > 	at com.carrotsearch.randomizedtesting.rules.SystemPropertiesRestoreRule$1.evaluate(SystemPropertiesRestoreRule.java:53)
[junit4:junit4]    > 	at org.apache.lucene.util.AbstractBeforeAfterRule$1.evaluate(AbstractBeforeAfterRule.java:45)
[junit4:junit4]    > 	at org.apache.lucene.util.TestRuleReportUncaughtExceptions$1.evaluate(TestRuleReportUncaughtExceptions.java:68)
[junit4:junit4]    > 	at org.apache.lucene.util.TestRuleStoreClassName$1.evaluate(TestRuleStoreClassName.java:38)
[junit4:junit4]    > 	at org.apache.lucene.util.TestRuleIcuHack$1.evaluate(TestRuleIcuHack.java:51)
[junit4:junit4]    > 	at com.carrotsearch.randomizedtesting.rules.SystemPropertiesInvariantRule$1.evaluate(SystemPropertiesInvariantRule.java:55)
[junit4:junit4]    > 	at org.apache.lucene.util.TestRuleNoInstanceHooksOverrides$1.evaluate(TestRuleNoInstanceHooksOverrides.java:53)
[junit4:junit4]    > 	at org.apache.lucene.util.TestRuleNoStaticHooksShadowing$1.evaluate(TestRuleNoStaticHooksShadowing.java:52)
[junit4:junit4]    > 	at org.apache.lucene.util.TestRuleAssertionsRequired$1.evaluate(TestRuleAssertionsRequired.java:36)
[junit4:junit4]    > 	at org.apache.lucene.util.TestRuleMarkFailure$1.evaluate(TestRuleMarkFailure.java:48)
[junit4:junit4]    > 	at org.apache.lucene.util.TestRuleIgnoreAfterMaxFailures$1.evaluate(TestRuleIgnoreAfterMaxFailures.java:70)
[junit4:junit4]    > 	at org.apache.lucene.util.TestRuleIgnoreTestSuites$1.evaluate(TestRuleIgnoreTestSuites.java:55)
[junit4:junit4]    > 	at com.carrotsearch.randomizedtesting.RandomizedRunner.runSuite(RandomizedRunner.java:605)
[junit4:junit4]    > 	at com.carrotsearch.randomizedtesting.RandomizedRunner.access$400(RandomizedRunner.java:132)
[junit4:junit4]    > 	at com.carrotsearch.randomizedtesting.RandomizedRunner$2.run(RandomizedRunner.java:551)
[junit4:junit4]    >
[junit4:junit4] Completed on J0 in 159.54s, 1 test, 1 failure <<< FAILURES!
[...truncated 42 lines...]

[...truncated 9992 lines...]

[...truncated 9992 lines...]

[...truncated 9992 lines...]

[...truncated 9992 lines...]

[...truncated 9915 lines...]
[junit4:junit4]   2> 159507 T1828 oas.SolrTestCaseJ4.endTrackingSearchers SEVERE ERROR:
SolrIndexSearcher opens=28 closes=27
[junit4:junit4]   2> NOTE: test params are: codec=Lucene40: {range_facet_l=MockFixedIntBlock(blockSize=893),
text=PostingsFormat(name=Asserting), _version_=MockFixedIntBlock(blockSize=893), rnd_b=PostingsFormat(name=MockRandom),
intDefault=MockFixedIntBlock(blockSize=893), id=PostingsFormat(name=MockRandom), timestamp=MockFixedIntBlock(blockSize=893),
a_t=MockFixedIntBlock(blockSize=893), range_facet_sl=PostingsFormat(name=Asserting), range_facet_si=PostingsFormat(name=SimpleText),
other_tl1=MockFixedIntBlock(blockSize=893), multiDefault=PostingsFormat(name=SimpleText),
a_si=PostingsFormat(name=SimpleText)}, sim=DefaultSimilarity, locale=nl_BE, timezone=Africa/Kampala
[junit4:junit4]   2> NOTE: FreeBSD 9.0-RELEASE amd64/Sun Microsystems Inc. 1.6.0_32 (64-bit)/cpus=16,threads=7,free=188515584,total=316932096
[junit4:junit4]   2> NOTE: All tests run in this JVM: [FastVectorHighlighterTest, SolrIndexConfigTest,
TestWordDelimiterFilterFactory, TestHTMLStripCharFilterFactory, TestChineseFilterFactory,
BasicDistributedZkTest, TestSolrCoreProperties, TestSwedishLightStemFilterFactory, TestDistributedGrouping,
TestHashPartitioner, ZkNodePropsTest, TestRandomFaceting, TestPropInject, UpdateRequestProcessorFactoryTest,
TestFrenchLightStemFilterFactory, SolrInfoMBeanTest, TestItalianLightStemFilterFactory, SOLR749Test,
DirectUpdateHandlerTest, TestSurroundQueryParser, FullSolrCloudDistribCmdsTest, TestExtendedDismaxParser,
TestJmxIntegration, TestSolrQueryParser, HighlighterTest, DisMaxRequestHandlerTest, TestFaceting,
DirectUpdateHandlerOptimizeTest, EchoParamsTest, TestDistributedSearch, TestDelimitedPayloadTokenFilterFactory,
TestCapitalizationFilterFactory, PingRequestHandlerTest, TestRTGBase, StatelessScriptUpdateProcessorFactoryTest,
TestReversedWildcardFilterFactory, TestPortugueseMinimalStemFilterFactory, TestTrimFilterFactory,
CoreAdminHandlerTest, TestJapanesePartOfSpeechStopFilterFactory, TestBM25SimilarityFactory,
TestCodecSupport, ConvertedLegacyTest, TestFiltering, PreAnalyzedFieldTest, TestFrenchMinimalStemFilterFactory,
DOMUtilTest, TestFinnishLightStemFilterFactory, TermsComponentTest, TestBulgarianStemFilterFactory,
TestIndexingPerformance, CopyFieldTest, LukeRequestHandlerTest, JSONWriterTest, TestJapaneseBaseFormFilterFactory,
TestGalicianStemFilterFactory, BadComponentTest, SolrRequestParserTest, TestUpdate, TestDFRSimilarityFactory,
SolrCoreCheckLockOnStartupTest, DirectSolrSpellCheckerTest, SuggesterWFSTTest, PluginInfoTest,
TestJapaneseKatakanaStemFilterFactory, TestJapaneseIterationMarkCharFilterFactory, TestGermanLightStemFilterFactory,
RequiredFieldsTest, PrimitiveFieldTypeTest, TestSynonymFilterFactory, SyncSliceTest]
[junit4:junit4]   2> NOTE: reproduce with: ant test  -Dtestcase=SyncSliceTest -Dtests.seed=575EFA7F42E6D217
-Dtests.multiplier=3 -Dtests.slow=true -Dtests.locale=nl_BE -Dtests.timezone=Africa/Kampala
-Dtests.file.encoding=US-ASCII
[junit4:junit4]   2> 
[junit4:junit4] ERROR   0.00s J0 | SyncSliceTest (suite)
[junit4:junit4]    > Throwable #1: java.lang.AssertionError: ERROR: SolrIndexSearcher opens=28
closes=27
[junit4:junit4]    > 	at __randomizedtesting.SeedInfo.seed([575EFA7F42E6D217]:0)
[junit4:junit4]    > 	at org.junit.Assert.fail(Assert.java:93)
[junit4:junit4]    > 	at org.apache.solr.SolrTestCaseJ4.endTrackingSearchers(SolrTestCaseJ4.java:216)
[junit4:junit4]    > 	at org.apache.solr.SolrTestCaseJ4.afterClass(SolrTestCaseJ4.java:82)
[junit4:junit4]    > 	at sun.reflect.GeneratedMethodAccessor16.invoke(Unknown Source)
[junit4:junit4]    > 	at sun.reflect.DelegatingMethodAccessorImpl.invoke(DelegatingMethodAccessorImpl.java:43)
[junit4:junit4]    > 	at java.lang.reflect.Method.invoke(Method.java:616)
[junit4:junit4]    > 	at com.carrotsearch.randomizedtesting.RandomizedRunner.invoke(RandomizedRunner.java:1995)
[junit4:junit4]    > 	at com.carrotsearch.randomizedtesting.RandomizedRunner.access$1100(RandomizedRunner.java:132)
[junit4:junit4]    > 	at com.carrotsearch.randomizedtesting.RandomizedRunner$5.evaluate(RandomizedRunner.java:754)
[junit4:junit4]    > 	at com.carrotsearch.randomizedtesting.rules.SystemPropertiesRestoreRule$1.evaluate(SystemPropertiesRestoreRule.java:53)
[junit4:junit4]    > 	at org.apache.lucene.util.AbstractBeforeAfterRule$1.evaluate(AbstractBeforeAfterRule.java:45)
[junit4:junit4]    > 	at org.apache.lucene.util.TestRuleReportUncaughtExceptions$1.evaluate(TestRuleReportUncaughtExceptions.java:68)
[junit4:junit4]    > 	at org.apache.lucene.util.TestRuleStoreClassName$1.evaluate(TestRuleStoreClassName.java:38)
[junit4:junit4]    > 	at org.apache.lucene.util.TestRuleIcuHack$1.evaluate(TestRuleIcuHack.java:51)
[junit4:junit4]    > 	at com.carrotsearch.randomizedtesting.rules.SystemPropertiesInvariantRule$1.evaluate(SystemPropertiesInvariantRule.java:55)
[junit4:junit4]    > 	at org.apache.lucene.util.TestRuleNoInstanceHooksOverrides$1.evaluate(TestRuleNoInstanceHooksOverrides.java:53)
[junit4:junit4]    > 	at org.apache.lucene.util.TestRuleNoStaticHooksShadowing$1.evaluate(TestRuleNoStaticHooksShadowing.java:52)
[junit4:junit4]    > 	at org.apache.lucene.util.TestRuleAssertionsRequired$1.evaluate(TestRuleAssertionsRequired.java:36)
[junit4:junit4]    > 	at org.apache.lucene.util.TestRuleMarkFailure$1.evaluate(TestRuleMarkFailure.java:48)
[junit4:junit4]    > 	at org.apache.lucene.util.TestRuleIgnoreAfterMaxFailures$1.evaluate(TestRuleIgnoreAfterMaxFailures.java:70)
[junit4:junit4]    > 	at org.apache.lucene.util.TestRuleIgnoreTestSuites$1.evaluate(TestRuleIgnoreTestSuites.java:55)
[junit4:junit4]    > 	at com.carrotsearch.randomizedtesting.RandomizedRunner.runSuite(RandomizedRunner.java:605)
[junit4:junit4]    > 	at com.carrotsearch.randomizedtesting.RandomizedRunner.access$400(RandomizedRunner.java:132)
[junit4:junit4]    > 	at com.carrotsearch.randomizedtesting.RandomizedRunner$2.run(RandomizedRunner.java:551)
[junit4:junit4]    >
[junit4:junit4] Completed on J0 in 159.54s, 1 test, 1 failure <<< FAILURES!
[junit4:junit4]  
[junit4:junit4] Suite: org.apache.solr.core.RequestHandlersTest
[junit4:junit4] Completed on J0 in 0.83s, 3 tests
[junit4:junit4]  
[junit4:junit4] Suite: org.apache.solr.analysis.TestHyphenationCompoundWordTokenFilterFactory
[junit4:junit4] Completed on J0 in 0.16s, 2 tests
[junit4:junit4]  
[junit4:junit4] Suite: org.apache.solr.analysis.TestBrazilianStemFilterFactory
[junit4:junit4] Completed on J0 in 0.01s, 1 test
[junit4:junit4]  
[junit4:junit4] Suite: org.apache.solr.search.TestStressReorder
[junit4:junit4] Completed on J0 in 7.61s, 1 test
[junit4:junit4]  
[junit4:junit4] Suite: org.apache.solr.search.TestStressVersions
[junit4:junit4] Completed on J0 in 9.79s, 1 test
[junit4:junit4]  
[junit4:junit4] Suite: org.apache.solr.update.processor.ScriptEngineTest
[junit4:junit4] Completed on J0 in 0.04s, 5 tests
[junit4:junit4]  
[junit4:junit4] Suite: org.apache.solr.search.TestStressRecovery
[junit4:junit4] Completed on J1 in 38.84s, 1 test
[junit4:junit4]  
[junit4:junit4] JVM J0:     0.88 ..   911.21 =   910.33s
[junit4:junit4] JVM J1:     0.88 ..  1168.25 =  1167.37s
[junit4:junit4] Execution time total: 19 minutes 28 seconds
[junit4:junit4] Tests summary: 305 suites, 1085 tests, 1 suite-level error, 5 ignored

BUILD FAILED
/usr/home/hudson/hudson-slave/workspace/Lucene-Solr-tests-only-4.x/checkout/build.xml:29:
The following error occurred while executing this line:
/usr/home/hudson/hudson-slave/workspace/Lucene-Solr-tests-only-4.x/checkout/solr/build.xml:144:
The following error occurred while executing this line:
/usr/home/hudson/hudson-slave/workspace/Lucene-Solr-tests-only-4.x/checkout/lucene/module-build.xml:62:
The following error occurred while executing this line:
/usr/home/hudson/hudson-slave/workspace/Lucene-Solr-tests-only-4.x/checkout/lucene/common-build.xml:1094:
The following error occurred while executing this line:
/usr/home/hudson/hudson-slave/workspace/Lucene-Solr-tests-only-4.x/checkout/lucene/common-build.xml:789:
There were test failures: 305 suites, 1085 tests, 1 suite-level error, 5 ignored

Total time: 32 minutes 8 seconds
Build step 'Execute shell' marked build as failure
Archiving artifacts
Recording test results
Publishing Clover coverage report...
No Clover report will be published due to a Build Failure
Email was triggered for: Failure
Sending email for trigger: Failure



Mime
View raw message