lucene-dev mailing list archives

Site index · List index
Message view « Date » · « Thread »
Top « Date » · « Thread »
From Policeman Jenkins Server <jenk...@sd-datasolutions.de>
Subject [JENKINS] Lucene-Solr-4.x-Linux-Java8-64 - Build # 8 - Still Failing!
Date Tue, 10 Jul 2012 16:13:40 GMT
Build: http://jenkins.sd-datasolutions.de/job/Lucene-Solr-4.x-Linux-Java8-64/8/

1 tests failed.
FAILED:  org.apache.solr.handler.component.DistributedQueryElevationComponentTest.testDistribSearch

Error Message:
Index: 18, Size: 18

Stack Trace:
java.lang.IndexOutOfBoundsException: Index: 18, Size: 18
	at __randomizedtesting.SeedInfo.seed([F4B13915C498CA56:7557B70DB3C7AA6A]:0)
	at java.util.ArrayList.rangeCheck(ArrayList.java:603)
	at java.util.ArrayList.get(ArrayList.java:381)
	at org.apache.solr.common.util.NamedList.getName(NamedList.java:127)
	at org.apache.solr.BaseDistributedSearchTestCase.compare(BaseDistributedSearchTestCase.java:466)
	at org.apache.solr.BaseDistributedSearchTestCase.compare(BaseDistributedSearchTestCase.java:612)
	at org.apache.solr.BaseDistributedSearchTestCase.compare(BaseDistributedSearchTestCase.java:500)
	at org.apache.solr.BaseDistributedSearchTestCase.compare(BaseDistributedSearchTestCase.java:612)
	at org.apache.solr.BaseDistributedSearchTestCase.compare(BaseDistributedSearchTestCase.java:500)
	at org.apache.solr.BaseDistributedSearchTestCase.compareResponses(BaseDistributedSearchTestCase.java:667)
	at org.apache.solr.BaseDistributedSearchTestCase.query(BaseDistributedSearchTestCase.java:392)
	at org.apache.solr.handler.component.DistributedQueryElevationComponentTest.doTest(DistributedQueryElevationComponentTest.java:81)
	at org.apache.solr.BaseDistributedSearchTestCase.testDistribSearch(BaseDistributedSearchTestCase.java:679)
	at sun.reflect.NativeMethodAccessorImpl.invoke0(Native Method)
	at sun.reflect.NativeMethodAccessorImpl.invoke(NativeMethodAccessorImpl.java:57)
	at sun.reflect.DelegatingMethodAccessorImpl.invoke(DelegatingMethodAccessorImpl.java:43)
	at java.lang.reflect.Method.invoke(Method.java:474)
	at com.carrotsearch.randomizedtesting.RandomizedRunner.invoke(RandomizedRunner.java:1995)
	at com.carrotsearch.randomizedtesting.RandomizedRunner.access$1100(RandomizedRunner.java:132)
	at com.carrotsearch.randomizedtesting.RandomizedRunner$6.evaluate(RandomizedRunner.java:818)
	at com.carrotsearch.randomizedtesting.RandomizedRunner$7.evaluate(RandomizedRunner.java:877)
	at com.carrotsearch.randomizedtesting.RandomizedRunner$8.evaluate(RandomizedRunner.java:891)
	at com.carrotsearch.randomizedtesting.rules.SystemPropertiesRestoreRule$1.evaluate(SystemPropertiesRestoreRule.java:53)
	at org.apache.lucene.util.TestRuleSetupTeardownChained$1.evaluate(TestRuleSetupTeardownChained.java:50)
	at org.apache.lucene.util.TestRuleFieldCacheSanity$1.evaluate(TestRuleFieldCacheSanity.java:32)
	at org.apache.lucene.util.AbstractBeforeAfterRule$1.evaluate(AbstractBeforeAfterRule.java:45)
	at com.carrotsearch.randomizedtesting.rules.SystemPropertiesInvariantRule$1.evaluate(SystemPropertiesInvariantRule.java:55)
	at org.apache.lucene.util.TestRuleReportUncaughtExceptions$1.evaluate(TestRuleReportUncaughtExceptions.java:68)
	at org.apache.lucene.util.TestRuleThreadAndTestName$1.evaluate(TestRuleThreadAndTestName.java:48)
	at org.apache.lucene.util.TestRuleIgnoreAfterMaxFailures$1.evaluate(TestRuleIgnoreAfterMaxFailures.java:70)
	at org.apache.lucene.util.TestRuleMarkFailure$1.evaluate(TestRuleMarkFailure.java:48)
	at com.carrotsearch.randomizedtesting.RandomizedRunner.runSingleTest(RandomizedRunner.java:825)
	at com.carrotsearch.randomizedtesting.RandomizedRunner.access$700(RandomizedRunner.java:132)
	at com.carrotsearch.randomizedtesting.RandomizedRunner$3$1.run(RandomizedRunner.java:671)
	at com.carrotsearch.randomizedtesting.RandomizedRunner$3.evaluate(RandomizedRunner.java:697)
	at com.carrotsearch.randomizedtesting.RandomizedRunner$4.evaluate(RandomizedRunner.java:736)
	at com.carrotsearch.randomizedtesting.RandomizedRunner$5.evaluate(RandomizedRunner.java:747)
	at com.carrotsearch.randomizedtesting.rules.SystemPropertiesRestoreRule$1.evaluate(SystemPropertiesRestoreRule.java:53)
	at org.apache.lucene.util.AbstractBeforeAfterRule$1.evaluate(AbstractBeforeAfterRule.java:45)
	at org.apache.lucene.util.TestRuleReportUncaughtExceptions$1.evaluate(TestRuleReportUncaughtExceptions.java:68)
	at org.apache.lucene.util.TestRuleStoreClassName$1.evaluate(TestRuleStoreClassName.java:38)
	at org.apache.lucene.util.TestRuleIcuHack$1.evaluate(TestRuleIcuHack.java:51)
	at com.carrotsearch.randomizedtesting.rules.SystemPropertiesInvariantRule$1.evaluate(SystemPropertiesInvariantRule.java:55)
	at org.apache.lucene.util.TestRuleNoInstanceHooksOverrides$1.evaluate(TestRuleNoInstanceHooksOverrides.java:53)
	at org.apache.lucene.util.TestRuleNoStaticHooksShadowing$1.evaluate(TestRuleNoStaticHooksShadowing.java:52)
	at org.apache.lucene.util.TestRuleAssertionsRequired$1.evaluate(TestRuleAssertionsRequired.java:36)
	at org.apache.lucene.util.TestRuleMarkFailure$1.evaluate(TestRuleMarkFailure.java:48)
	at org.apache.lucene.util.TestRuleIgnoreAfterMaxFailures$1.evaluate(TestRuleIgnoreAfterMaxFailures.java:70)
	at org.apache.lucene.util.TestRuleIgnoreTestSuites$1.evaluate(TestRuleIgnoreTestSuites.java:55)
	at com.carrotsearch.randomizedtesting.RandomizedRunner.runSuite(RandomizedRunner.java:605)
	at com.carrotsearch.randomizedtesting.RandomizedRunner.access$400(RandomizedRunner.java:132)
	at com.carrotsearch.randomizedtesting.RandomizedRunner$2.run(RandomizedRunner.java:551)




Build Log:
[...truncated 11165 lines...]
[junit4:junit4] Suite: org.apache.solr.handler.component.DistributedQueryElevationComponentTest
[junit4:junit4] ERROR   1.53s J0 | DistributedQueryElevationComponentTest.testDistribSearch
[junit4:junit4]    > Throwable #1: java.lang.IndexOutOfBoundsException: Index: 18, Size: 18
[junit4:junit4]    > 	at __randomizedtesting.SeedInfo.seed([F4B13915C498CA56:7557B70DB3C7AA6A]:0)
[junit4:junit4]    > 	at java.util.ArrayList.rangeCheck(ArrayList.java:603)
[junit4:junit4]    > 	at java.util.ArrayList.get(ArrayList.java:381)
[junit4:junit4]    > 	at org.apache.solr.common.util.NamedList.getName(NamedList.java:127)
[junit4:junit4]    > 	at org.apache.solr.BaseDistributedSearchTestCase.compare(BaseDistributedSearchTestCase.java:466)
[junit4:junit4]    > 	at org.apache.solr.BaseDistributedSearchTestCase.compare(BaseDistributedSearchTestCase.java:612)
[junit4:junit4]    > 	at org.apache.solr.BaseDistributedSearchTestCase.compare(BaseDistributedSearchTestCase.java:500)
[junit4:junit4]    > 	at org.apache.solr.BaseDistributedSearchTestCase.compare(BaseDistributedSearchTestCase.java:612)
[junit4:junit4]    > 	at org.apache.solr.BaseDistributedSearchTestCase.compare(BaseDistributedSearchTestCase.java:500)
[junit4:junit4]    > 	at org.apache.solr.BaseDistributedSearchTestCase.compareResponses(BaseDistributedSearchTestCase.java:667)
[junit4:junit4]    > 	at org.apache.solr.BaseDistributedSearchTestCase.query(BaseDistributedSearchTestCase.java:392)
[junit4:junit4]    > 	at org.apache.solr.handler.component.DistributedQueryElevationComponentTest.doTest(DistributedQueryElevationComponentTest.java:81)
[junit4:junit4]    > 	at org.apache.solr.BaseDistributedSearchTestCase.testDistribSearch(BaseDistributedSearchTestCase.java:679)
[junit4:junit4]    > 	at sun.reflect.NativeMethodAccessorImpl.invoke0(Native Method)
[junit4:junit4]    > 	at sun.reflect.NativeMethodAccessorImpl.invoke(NativeMethodAccessorImpl.java:57)
[junit4:junit4]    > 	at sun.reflect.DelegatingMethodAccessorImpl.invoke(DelegatingMethodAccessorImpl.java:43)
[junit4:junit4]    > 	at java.lang.reflect.Method.invoke(Method.java:474)
[junit4:junit4]    > 	at com.carrotsearch.randomizedtesting.RandomizedRunner.invoke(RandomizedRunner.java:1995)
[junit4:junit4]    > 	at com.carrotsearch.randomizedtesting.RandomizedRunner.access$1100(RandomizedRunner.java:132)
[junit4:junit4]    > 	at com.carrotsearch.randomizedtesting.RandomizedRunner$6.evaluate(RandomizedRunner.java:818)
[junit4:junit4]    > 	at com.carrotsearch.randomizedtesting.RandomizedRunner$7.evaluate(RandomizedRunner.java:877)
[junit4:junit4]    > 	at com.carrotsearch.randomizedtesting.RandomizedRunner$8.evaluate(RandomizedRunner.java:891)
[junit4:junit4]    > 	at com.carrotsearch.randomizedtesting.rules.SystemPropertiesRestoreRule$1.evaluate(SystemPropertiesRestoreRule.java:53)
[junit4:junit4]    > 	at org.apache.lucene.util.TestRuleSetupTeardownChained$1.evaluate(TestRuleSetupTeardownChained.java:50)
[junit4:junit4]    > 	at org.apache.lucene.util.TestRuleFieldCacheSanity$1.evaluate(TestRuleFieldCacheSanity.java:32)
[junit4:junit4]    > 	at org.apache.lucene.util.AbstractBeforeAfterRule$1.evaluate(AbstractBeforeAfterRule.java:45)
[junit4:junit4]    > 	at com.carrotsearch.randomizedtesting.rules.SystemPropertiesInvariantRule$1.evaluate(SystemPropertiesInvariantRule.java:55)
[junit4:junit4]    > 	at org.apache.lucene.util.TestRuleReportUncaughtExceptions$1.evaluate(TestRuleReportUncaughtExceptions.java:68)
[junit4:junit4]    > 	at org.apache.lucene.util.TestRuleThreadAndTestName$1.evaluate(TestRuleThreadAndTestName.java:48)
[junit4:junit4]    > 	at org.apache.lucene.util.TestRuleIgnoreAfterMaxFailures$1.evaluate(TestRuleIgnoreAfterMaxFailures.java:70)
[junit4:junit4]    > 	at org.apache.lucene.util.TestRuleMarkFailure$1.evaluate(TestRuleMarkFailure.java:48)
[junit4:junit4]    > 	at com.carrotsearch.randomizedtesting.RandomizedRunner.runSingleTest(RandomizedRunner.java:825)
[junit4:junit4]    > 	at com.carrotsearch.randomizedtesting.RandomizedRunner.access$700(RandomizedRunner.java:132)
[junit4:junit4]    > 	at com.carrotsearch.randomizedtesting.RandomizedRunner$3$1.run(RandomizedRunner.java:671)
[junit4:junit4]    > 	at com.carrotsearch.randomizedtesting.RandomizedRunner$3.evaluate(RandomizedRunner.java:697)
[junit4:junit4]    > 	at com.carrotsearch.randomizedtesting.RandomizedRunner$4.evaluate(RandomizedRunner.java:736)
[junit4:junit4]    > 	at com.carrotsearch.randomizedtesting.RandomizedRunner$5.evaluate(RandomizedRunner.java:747)
[junit4:junit4]    > 	at com.carrotsearch.randomizedtesting.rules.SystemPropertiesRestoreRule$1.evaluate(SystemPropertiesRestoreRule.java:53)
[junit4:junit4]    > 	at org.apache.lucene.util.AbstractBeforeAfterRule$1.evaluate(AbstractBeforeAfterRule.java:45)
[junit4:junit4]    > 	at org.apache.lucene.util.TestRuleReportUncaughtExceptions$1.evaluate(TestRuleReportUncaughtExceptions.java:68)
[junit4:junit4]    > 	at org.apache.lucene.util.TestRuleStoreClassName$1.evaluate(TestRuleStoreClassName.java:38)
[junit4:junit4]    > 	at org.apache.lucene.util.TestRuleIcuHack$1.evaluate(TestRuleIcuHack.java:51)
[junit4:junit4]    > 	at com.carrotsearch.randomizedtesting.rules.SystemPropertiesInvariantRule$1.evaluate(SystemPropertiesInvariantRule.java:55)
[junit4:junit4]    > 	at org.apache.lucene.util.TestRuleNoInstanceHooksOverrides$1.evaluate(TestRuleNoInstanceHooksOverrides.java:53)
[junit4:junit4]    > 	at org.apache.lucene.util.TestRuleNoStaticHooksShadowing$1.evaluate(TestRuleNoStaticHooksShadowing.java:52)
[junit4:junit4]    > 	at org.apache.lucene.util.TestRuleAssertionsRequired$1.evaluate(TestRuleAssertionsRequired.java:36)
[junit4:junit4]    > 	at org.apache.lucene.util.TestRuleMarkFailure$1.evaluate(TestRuleMarkFailure.java:48)
[junit4:junit4]    > 	at org.apache.lucene.util.TestRuleIgnoreAfterMaxFailures$1.evaluate(TestRuleIgnoreAfterMaxFailures.java:70)
[junit4:junit4]    > 	at org.apache.lucene.util.TestRuleIgnoreTestSuites$1.evaluate(TestRuleIgnoreTestSuites.java:55)
[junit4:junit4]    > 	at com.carrotsearch.randomizedtesting.RandomizedRunner.runSuite(RandomizedRunner.java:605)
[junit4:junit4]    > 	at com.carrotsearch.randomizedtesting.RandomizedRunner.access$400(RandomizedRunner.java:132)
[junit4:junit4]    > 	at com.carrotsearch.randomizedtesting.RandomizedRunner$2.run(RandomizedRunner.java:551)
[junit4:junit4]    > 
[junit4:junit4]   2> 2 T244 oas.SolrTestCaseJ4.setUp ###Starting testDistribSearch
[junit4:junit4]   2> 2 T244 oejs.Server.doStart jetty-8.1.2.v20120308
[junit4:junit4]   2> 5 T244 oejs.AbstractConnector.doStart Started SocketConnector@0.0.0.0:33574
[junit4:junit4]   2> 5 T244 oasc.SolrResourceLoader.locateSolrHome JNDI not configured for solr (NoInitialContextEx)
[junit4:junit4]   2> 6 T244 oasc.SolrResourceLoader.locateSolrHome using system property solr.solr.home: /mnt/ssd/jenkins/workspace/Lucene-Solr-4.x-Linux-Java8-64/checkout/solr/build/solr-core/test-files/solr
[junit4:junit4]   2> 6 T244 oasc.SolrResourceLoader.<init> new SolrResourceLoader for deduced Solr Home: '/mnt/ssd/jenkins/workspace/Lucene-Solr-4.x-Linux-Java8-64/checkout/solr/build/solr-core/test-files/solr/'
[junit4:junit4]   2> 8 T244 oass.SolrDispatchFilter.init SolrDispatchFilter.init()
[junit4:junit4]   2> 8 T244 oasc.SolrResourceLoader.locateSolrHome JNDI not configured for solr (NoInitialContextEx)
[junit4:junit4]   2> 9 T244 oasc.SolrResourceLoader.locateSolrHome using system property solr.solr.home: /mnt/ssd/jenkins/workspace/Lucene-Solr-4.x-Linux-Java8-64/checkout/solr/build/solr-core/test-files/solr
[junit4:junit4]   2> 9 T244 oasc.CoreContainer$Initializer.initialize looking for solr.xml: /mnt/ssd/jenkins/workspace/Lucene-Solr-4.x-Linux-Java8-64/checkout/solr/build/solr-core/test-files/solr/solr.xml
[junit4:junit4]   2> 9 T244 oasc.CoreContainer.<init> New CoreContainer 1172373094
[junit4:junit4]   2> 9 T244 oasc.CoreContainer.load Loading CoreContainer using Solr Home: '/mnt/ssd/jenkins/workspace/Lucene-Solr-4.x-Linux-Java8-64/checkout/solr/build/solr-core/test-files/solr/'
[junit4:junit4]   2> 9 T244 oasc.SolrResourceLoader.<init> new SolrResourceLoader for directory: '/mnt/ssd/jenkins/workspace/Lucene-Solr-4.x-Linux-Java8-64/checkout/solr/build/solr-core/test-files/solr/'
[junit4:junit4]   2> 14 T244 oasc.CoreContainer.load Registering Log Listener
[junit4:junit4]   2> 21 T244 oashc.HttpShardHandlerFactory.getParameter Setting socketTimeout to: 0
[junit4:junit4]   2> 21 T244 oashc.HttpShardHandlerFactory.getParameter Setting urlScheme to: http://
[junit4:junit4]   2> 21 T244 oashc.HttpShardHandlerFactory.getParameter Setting connTimeout to: 0
[junit4:junit4]   2> 21 T244 oashc.HttpShardHandlerFactory.getParameter Setting maxConnectionsPerHost to: 20
[junit4:junit4]   2> 22 T244 oashc.HttpShardHandlerFactory.getParameter Setting corePoolSize to: 0
[junit4:junit4]   2> 22 T244 oashc.HttpShardHandlerFactory.getParameter Setting maximumPoolSize to: 2147483647
[junit4:junit4]   2> 22 T244 oashc.HttpShardHandlerFactory.getParameter Setting maxThreadIdleTime to: 5
[junit4:junit4]   2> 22 T244 oashc.HttpShardHandlerFactory.getParameter Setting sizeOfQueue to: -1
[junit4:junit4]   2> 22 T244 oashc.HttpShardHandlerFactory.getParameter Setting fairnessPolicy to: false
[junit4:junit4]   2> 22 T244 oascsi.HttpClientUtil.createClient Creating new http client, config:maxConnectionsPerHost=20&maxConnections=10000&socketTimeout=0&connTimeout=0&retry=false
[junit4:junit4]   2> 26 T244 oasc.CoreContainer.create Creating SolrCore 'collection1' using instanceDir: /mnt/ssd/jenkins/workspace/Lucene-Solr-4.x-Linux-Java8-64/checkout/solr/build/solr-core/test-files/solr/collection1
[junit4:junit4]   2> 27 T244 oasc.SolrResourceLoader.<init> new SolrResourceLoader for directory: '/mnt/ssd/jenkins/workspace/Lucene-Solr-4.x-Linux-Java8-64/checkout/solr/build/solr-core/test-files/solr/collection1/'
[junit4:junit4]   2> 27 T244 oasc.SolrResourceLoader.replaceClassLoader Adding 'file:/mnt/ssd/jenkins/workspace/Lucene-Solr-4.x-Linux-Java8-64/checkout/solr/build/solr-core/test-files/solr/collection1/lib/README' to classloader
[junit4:junit4]   2> 28 T244 oasc.SolrResourceLoader.replaceClassLoader Adding 'file:/mnt/ssd/jenkins/workspace/Lucene-Solr-4.x-Linux-Java8-64/checkout/solr/build/solr-core/test-files/solr/collection1/lib/classes/' to classloader
[junit4:junit4]   2> 40 T244 oasc.SolrConfig.<init> Using Lucene MatchVersion: LUCENE_40
[junit4:junit4]   2> 64 T244 oasc.SolrConfig.<init> Loaded SolrConfig: solrconfig-elevate.xml
[junit4:junit4]   2> 64 T244 oass.IndexSchema.readSchema Reading Solr Schema
[junit4:junit4]   2> 66 T244 oass.IndexSchema.readSchema Schema name=example
[junit4:junit4]   2> 177 T244 oass.IndexSchema.readSchema default search field in schema is text
[junit4:junit4]   2> 178 T244 oass.IndexSchema.readSchema unique key field: id
[junit4:junit4]   2> 181 T244 oasc.SolrCore.<init> [collection1] Opening new SolrCore at /mnt/ssd/jenkins/workspace/Lucene-Solr-4.x-Linux-Java8-64/checkout/solr/build/solr-core/test-files/solr/collection1/, dataDir=./org.apache.solr.handler.component.DistributedQueryElevationComponentTest-1341935964748/control/data/
[junit4:junit4]   2> 181 T244 oasc.JmxMonitoredMap.<init> JMX monitoring is enabled. Adding Solr mbeans to JMX Server: com.sun.jmx.mbeanserver.JmxMBeanServer@5193710b
[junit4:junit4]   2> 182 T244 oasc.SolrCore.getNewIndexDir WARNING New index directory detected: old=null new=./org.apache.solr.handler.component.DistributedQueryElevationComponentTest-1341935964748/control/data/index/
[junit4:junit4]   2> 182 T244 oasc.SolrCore.initIndex WARNING [collection1] Solr index directory './org.apache.solr.handler.component.DistributedQueryElevationComponentTest-1341935964748/control/data/index' doesn't exist. Creating new index...
[junit4:junit4]   2> 183 T244 oasc.SolrDeletionPolicy.onCommit SolrDeletionPolicy.onCommit: commits:num=1
[junit4:junit4]   2> 		commit{dir=MockDirWrapper(org.apache.lucene.store.RAMDirectory@5e1a9152 lockFactory=org.apache.lucene.store.SingleInstanceLockFactory@42dc341c),segFN=segments_1,generation=1,filenames=[segments_1]
[junit4:junit4]   2> 183 T244 oasc.SolrDeletionPolicy.updateCommits newest commit = 1
[junit4:junit4]   2> 184 T244 oasc.RequestHandlers.initHandlersFromConfig created /update: solr.UpdateRequestHandler
[junit4:junit4]   2> 185 T244 oasc.RequestHandlers.initHandlersFromConfig created /elevate: org.apache.solr.handler.component.SearchHandler
[junit4:junit4]   2> 185 T244 oasc.RequestHandlers.initHandlersFromConfig created /dataElevate: org.apache.solr.handler.component.SearchHandler
[junit4:junit4]   2> 186 T244 oashl.XMLLoader.init xsltCacheLifetimeSeconds=60
[junit4:junit4]   2> 186 T244 oasc.RequestHandlers.initHandlersFromConfig WARNING no default request handler is registered (either '/select' or 'standard')
[junit4:junit4]   2> 187 T244 oasc.SolrCore.initDeprecatedSupport WARNING solrconfig.xml uses deprecated <admin/gettableFiles>, Please update your config to use the ShowFileRequestHandler.
[junit4:junit4]   2> 188 T244 oasc.SolrCore.initDeprecatedSupport WARNING adding ShowFileRequestHandler with hidden files: [SCHEMA-BM25.XML, KEEP-2.TXT, BAD-SCHEMA-NOT-INDEXED-BUT-POS.XML, BAD-MP-SOLRCONFIG.XML, DA_UTF8.XML, SOLRCONFIG-DELPOLICY1.XML, SOLRCONFIG-MASTER.XML, COMPOUNDDICTIONARY.TXT, SOLRCONFIG-NOCACHE.XML, SCHEMA-NOT-REQUIRED-UNIQUE-KEY.XML, BAD-SCHEMA-DUP-FIELD.XML, SOLRCONFIG-PHRASESUGGEST.XML, SOLRCONFIG-SLAVE.XML, STOPTYPES-2.TXT, SCHEMA-STOP-KEEP.XML, SCHEMA.XML, STOPWORDSWRONGENCODING.TXT, SOLRCONFIG-SLAVE1.XML, SOLRCONFIG-SOLR-749.XML, SCHEMA-FOLDING.XML, SOLRCONFIG-XINCLUDE.XML, SCHEMA15.XML, SOLRCONFIG-MASTER1.XML, SCHEMA-LUCENEMATCHVERSION.XML, SCHEMA-REQUIRED-FIELDS.XML, BAD-SCHEMA-DUP-DYNAMICFIELD.XML, STOPWORDS.TXT, STOP-SNOWBALL.TXT, STOP-2.TXT, SCHEMA-COLLATEFILTER.XML, SOLRCONFIG-TLOG.XML, SCHEMA-COLLATE.XML, SOLRCONFIG-NATIVELOCK.XML, CURRENCY.XML, SOLRCONFIG-QUERYSENDER-NOQUERY.XML, SOLRCONFIG-MASTER1-KEEPONEBACKUP.XML, SOLRCONFIG-SIMPLELOCK.XML, SCHEMA-LMDIRICHLET.XML, SCHEMA-REVERSED.XML, BAD-SCHEMA-NOT-INDEXED-BUT-TF.XML, SYNONYMS.TXT, SCHEMA_CODEC.XML, SOLRCONFIG-PROPINJECT.XML, HUNSPELL-TEST.DIC, DA_COMPOUNDDICTIONARY.TXT, SOLRCONFIG-REQHANDLER.INCL, SOLRCONFIG-FUNCTIONQUERY.XML, BAD-SCHEMA-DUP-FIELDTYPE.XML, SOLRCONFIG-UPDATE-PROCESSOR-CHAINS.XML, BAD-SCHEMA-CODEC-GLOBAL-VS-FT-MISMATCH.XML, SOLRCONFIG-BASIC.XML, SOLRCONFIG-ALTDIRECTORY.XML, BAD-SCHEMA-NOT-INDEXED-BUT-NORMS.XML, SCHEMA-CHARFILTERS.XML, BAD-SCHEMA-EXTERNAL-FILEFIELD.XML, BAD-SCHEMA-OMIT-TF-BUT-NOT-POS.XML, OLD_SYNONYMS.TXT, SOLRCONFIG-MASTER2.XML, SCHEMA-PHRASESUGGEST.XML, SOLRCONFIG-CACHING.XML, SOLRCONFIG_PERF.XML, SOLRCONFIG-TRANSFORMERS.XML, SCHEMA-BINARYFIELD.XML, SOLRCONFIG_CODEC.XML, SOLRCONFIG-MASTER3.XML, FRENCHARTICLES.TXT, SOLRCONFIG-ELEVATE.XML, SOLRCONFIG-SPELLCHECKER.XML, OPEN-EXCHANGE-RATES.JSON, SOLRCONFIG-ENABLEPLUGIN.XML, BAD_SOLRCONFIG.XML, BAD-SCHEMA-UNIQUEKEY-IS-COPYFIELD-DEST.XML, SOLRCONFIG-DELPOLICY2.XML, SOLRCONFIG-HIGHLIGHT.XML, SOLRCONFIG-SOLCOREPROPERTIES.XML, SCHEMA-REPLICATION1.XML, STOPWITHBOM.TXT, SCHEMA-REPLICATION2.XML, SOLRCONFIG-SPELLCHECKCOMPONENT.XML, SCHEMA-LMJELINEKMERCER.XML, BAD-SCHEMA-SIM-GLOBAL-VS-FT-MISMATCH.XML, SCHEMA-NUMERIC.XML, SCHEMA12.XML, SCHEMA-MINIMAL.XML, ELEVATE.XML, BAD-SCHEMA-NONTEXT-ANALYZER.XML, XSLT, PROTWORDS.TXT, SCHEMA-COPYFIELD-TEST.XML, BAD-SCHEMA-UNIQUEKEY-USES-DEFAULT.XML, HUNSPELL-TEST.AFF, KEEP-1.TXT, SCHEMA-IB.XML, SOLRCONFIG-REPEATER.XML, SOLRCONFIG-BASIC-LUCENEVERSION31.XML, SCHEMASURROUND.XML, MAPPING-ISOLATIN1ACCENT.TXT, SCHEMA-TFIDF.XML, STOPTYPES-1.TXT, WDFTYPES.TXT, STEMDICT.TXT, SCHEMA-SIM.XML, SCHEMA-SPELLCHECKER.XML, HYPHENATION.DTD, PHRASESUGGEST.TXT, STOP-1.TXT, SCHEMA-TRIE.XML, SCHEMA11.XML, SCHEMA-DFR.XML, SOLRCONFIG-PROPINJECT-INDEXDEFAULT.XML, SOLRCONFIG-LAZYWRITER.XML, SOLRCONFIG-MERGEPOLICY.XML, SOLRCONFIG-QUERYSENDER.XML, SOLRCONFIG-TERMINDEX.XML]
[junit4:junit4]   2> 190 T244 oass.SolrIndexSearcher.<init> Opening Searcher@a36aeff main
[junit4:junit4]   2> 191 T244 oass.SolrIndexSearcher.getIndexDir WARNING WARNING: Directory impl does not support setting indexDir: org.apache.lucene.store.MockDirectoryWrapper
[junit4:junit4]   2> 191 T244 oasu.CommitTracker.<init> Hard AutoCommit: disabled
[junit4:junit4]   2> 191 T244 oasu.CommitTracker.<init> Soft AutoCommit: disabled
[junit4:junit4]   2> 192 T244 oashc.QueryElevationComponent.inform Loading QueryElevation from: /mnt/ssd/jenkins/workspace/Lucene-Solr-4.x-Linux-Java8-64/checkout/solr/build/solr-core/test-files/solr/collection1/conf/elevate.xml
[junit4:junit4]   2> 199 T244 oashc.QueryElevationComponent.inform Loading QueryElevation from: /mnt/ssd/jenkins/workspace/Lucene-Solr-4.x-Linux-Java8-64/checkout/solr/build/solr-core/test-files/solr/collection1/conf/elevate.xml
[junit4:junit4]   2> 207 T254 oasc.SolrCore.registerSearcher [collection1] Registered new searcher Searcher@a36aeff main{StandardDirectoryReader(segments_1:1)}
[junit4:junit4]   2> 207 T244 oasc.CoreContainer.register registering core: collection1
[junit4:junit4]   2> 208 T244 oass.SolrDispatchFilter.init user.dir=/mnt/ssd/jenkins/workspace/Lucene-Solr-4.x-Linux-Java8-64/checkout/solr/build/solr-core/test/J0
[junit4:junit4]   2> 208 T244 oass.SolrDispatchFilter.init SolrDispatchFilter.init() done
[junit4:junit4]   2> 208 T244 oascsi.HttpClientUtil.createClient Creating new http client, config:maxConnections=128&maxConnectionsPerHost=32&followRedirects=false
[junit4:junit4]   2> 211 T244 oejs.Server.doStart jetty-8.1.2.v20120308
[junit4:junit4]   2> 219 T244 oejs.AbstractConnector.doStart Started SocketConnector@0.0.0.0:44447
[junit4:junit4]   2> 220 T244 oasc.SolrResourceLoader.locateSolrHome JNDI not configured for solr (NoInitialContextEx)
[junit4:junit4]   2> 220 T244 oasc.SolrResourceLoader.locateSolrHome using system property solr.solr.home: /mnt/ssd/jenkins/workspace/Lucene-Solr-4.x-Linux-Java8-64/checkout/solr/build/solr-core/test-files/solr
[junit4:junit4]   2> 220 T244 oasc.SolrResourceLoader.<init> new SolrResourceLoader for deduced Solr Home: '/mnt/ssd/jenkins/workspace/Lucene-Solr-4.x-Linux-Java8-64/checkout/solr/build/solr-core/test-files/solr/'
[junit4:junit4]   2> 225 T244 oass.SolrDispatchFilter.init SolrDispatchFilter.init()
[junit4:junit4]   2> 225 T244 oasc.SolrResourceLoader.locateSolrHome JNDI not configured for solr (NoInitialContextEx)
[junit4:junit4]   2> 225 T244 oasc.SolrResourceLoader.locateSolrHome using system property solr.solr.home: /mnt/ssd/jenkins/workspace/Lucene-Solr-4.x-Linux-Java8-64/checkout/solr/build/solr-core/test-files/solr
[junit4:junit4]   2> 225 T244 oasc.CoreContainer$Initializer.initialize looking for solr.xml: /mnt/ssd/jenkins/workspace/Lucene-Solr-4.x-Linux-Java8-64/checkout/solr/build/solr-core/test-files/solr/solr.xml
[junit4:junit4]   2> 226 T244 oasc.CoreContainer.<init> New CoreContainer 1073665167
[junit4:junit4]   2> 226 T244 oasc.CoreContainer.load Loading CoreContainer using Solr Home: '/mnt/ssd/jenkins/workspace/Lucene-Solr-4.x-Linux-Java8-64/checkout/solr/build/solr-core/test-files/solr/'
[junit4:junit4]   2> 226 T244 oasc.SolrResourceLoader.<init> new SolrResourceLoader for directory: '/mnt/ssd/jenkins/workspace/Lucene-Solr-4.x-Linux-Java8-64/checkout/solr/build/solr-core/test-files/solr/'
[junit4:junit4]   2> 230 T244 oasc.CoreContainer.load Registering Log Listener
[junit4:junit4]   2> 236 T244 oashc.HttpShardHandlerFactory.getParameter Setting socketTimeout to: 0
[junit4:junit4]   2> 237 T244 oashc.HttpShardHandlerFactory.getParameter Setting urlScheme to: http://
[junit4:junit4]   2> 237 T244 oashc.HttpShardHandlerFactory.getParameter Setting connTimeout to: 0
[junit4:junit4]   2> 237 T244 oashc.HttpShardHandlerFactory.getParameter Setting maxConnectionsPerHost to: 20
[junit4:junit4]   2> 237 T244 oashc.HttpShardHandlerFactory.getParameter Setting corePoolSize to: 0
[junit4:junit4]   2> 237 T244 oashc.HttpShardHandlerFactory.getParameter Setting maximumPoolSize to: 2147483647
[junit4:junit4]   2> 238 T244 oashc.HttpShardHandlerFactory.getParameter Setting maxThreadIdleTime to: 5
[junit4:junit4]   2> 238 T244 oashc.HttpShardHandlerFactory.getParameter Setting sizeOfQueue to: -1
[junit4:junit4]   2> 238 T244 oashc.HttpShardHandlerFactory.getParameter Setting fairnessPolicy to: false
[junit4:junit4]   2> 238 T244 oascsi.HttpClientUtil.createClient Creating new http client, config:maxConnectionsPerHost=20&maxConnections=10000&socketTimeout=0&connTimeout=0&retry=false
[junit4:junit4]   2> 244 T244 oasc.CoreContainer.create Creating SolrCore 'collection1' using instanceDir: /mnt/ssd/jenkins/workspace/Lucene-Solr-4.x-Linux-Java8-64/checkout/solr/build/solr-core/test-files/solr/collection1
[junit4:junit4]   2> 244 T244 oasc.SolrResourceLoader.<init> new SolrResourceLoader for directory: '/mnt/ssd/jenkins/workspace/Lucene-Solr-4.x-Linux-Java8-64/checkout/solr/build/solr-core/test-files/solr/collection1/'
[junit4:junit4]   2> 244 T244 oasc.SolrResourceLoader.replaceClassLoader Adding 'file:/mnt/ssd/jenkins/workspace/Lucene-Solr-4.x-Linux-Java8-64/checkout/solr/build/solr-core/test-files/solr/collection1/lib/README' to classloader
[junit4:junit4]   2> 245 T244 oasc.SolrResourceLoader.replaceClassLoader Adding 'file:/mnt/ssd/jenkins/workspace/Lucene-Solr-4.x-Linux-Java8-64/checkout/solr/build/solr-core/test-files/solr/collection1/lib/classes/' to classloader
[junit4:junit4]   2> 256 T244 oasc.SolrConfig.<init> Using Lucene MatchVersion: LUCENE_40
[junit4:junit4]   2> 279 T244 oasc.SolrConfig.<init> Loaded SolrConfig: solrconfig-elevate.xml
[junit4:junit4]   2> 280 T244 oass.IndexSchema.readSchema Reading Solr Schema
[junit4:junit4]   2> 282 T244 oass.IndexSchema.readSchema Schema name=example
[junit4:junit4]   2> 421 T244 oass.IndexSchema.readSchema default search field in schema is text
[junit4:junit4]   2> 422 T244 oass.IndexSchema.readSchema unique key field: id
[junit4:junit4]   2> 424 T244 oasc.SolrCore.<init> [collection1] Opening new SolrCore at /mnt/ssd/jenkins/workspace/Lucene-Solr-4.x-Linux-Java8-64/checkout/solr/build/solr-core/test-files/solr/collection1/, dataDir=./org.apache.solr.handler.component.DistributedQueryElevationComponentTest-1341935964748/shard0/data/
[junit4:junit4]   2> 424 T244 oasc.JmxMonitoredMap.<init> JMX monitoring is enabled. Adding Solr mbeans to JMX Server: com.sun.jmx.mbeanserver.JmxMBeanServer@5193710b
[junit4:junit4]   2> 425 T244 oasc.SolrCore.getNewIndexDir WARNING New index directory detected: old=null new=./org.apache.solr.handler.component.DistributedQueryElevationComponentTest-1341935964748/shard0/data/index/
[junit4:junit4]   2> 425 T244 oasc.SolrCore.initIndex WARNING [collection1] Solr index directory './org.apache.solr.handler.component.DistributedQueryElevationComponentTest-1341935964748/shard0/data/index' doesn't exist. Creating new index...
[junit4:junit4]   2> 426 T244 oasc.SolrDeletionPolicy.onCommit SolrDeletionPolicy.onCommit: commits:num=1
[junit4:junit4]   2> 		commit{dir=MockDirWrapper(org.apache.lucene.store.RAMDirectory@2d75018b lockFactory=org.apache.lucene.store.SingleInstanceLockFactory@4daca699),segFN=segments_1,generation=1,filenames=[segments_1]
[junit4:junit4]   2> 426 T244 oasc.SolrDeletionPolicy.updateCommits newest commit = 1
[junit4:junit4]   2> 427 T244 oasc.RequestHandlers.initHandlersFromConfig created /update: solr.UpdateRequestHandler
[junit4:junit4]   2> 427 T244 oasc.RequestHandlers.initHandlersFromConfig created /elevate: org.apache.solr.handler.component.SearchHandler
[junit4:junit4]   2> 427 T244 oasc.RequestHandlers.initHandlersFromConfig created /dataElevate: org.apache.solr.handler.component.SearchHandler
[junit4:junit4]   2> 428 T244 oashl.XMLLoader.init xsltCacheLifetimeSeconds=60
[junit4:junit4]   2> 428 T244 oasc.RequestHandlers.initHandlersFromConfig WARNING no default request handler is registered (either '/select' or 'standard')
[junit4:junit4]   2> 429 T244 oasc.SolrCore.initDeprecatedSupport WARNING solrconfig.xml uses deprecated <admin/gettableFiles>, Please update your config to use the ShowFileRequestHandler.
[junit4:junit4]   2> 429 T244 oasc.SolrCore.initDeprecatedSupport WARNING adding ShowFileRequestHandler with hidden files: [SCHEMA-BM25.XML, KEEP-2.TXT, BAD-SCHEMA-NOT-INDEXED-BUT-POS.XML, BAD-MP-SOLRCONFIG.XML, DA_UTF8.XML, SOLRCONFIG-DELPOLICY1.XML, SOLRCONFIG-MASTER.XML, COMPOUNDDICTIONARY.TXT, SOLRCONFIG-NOCACHE.XML, SCHEMA-NOT-REQUIRED-UNIQUE-KEY.XML, BAD-SCHEMA-DUP-FIELD.XML, SOLRCONFIG-PHRASESUGGEST.XML, SOLRCONFIG-SLAVE.XML, STOPTYPES-2.TXT, SCHEMA-STOP-KEEP.XML, SCHEMA.XML, STOPWORDSWRONGENCODING.TXT, SOLRCONFIG-SLAVE1.XML, SOLRCONFIG-SOLR-749.XML, SCHEMA-FOLDING.XML, SOLRCONFIG-XINCLUDE.XML, SCHEMA15.XML, SOLRCONFIG-MASTER1.XML, SCHEMA-LUCENEMATCHVERSION.XML, SCHEMA-REQUIRED-FIELDS.XML, BAD-SCHEMA-DUP-DYNAMICFIELD.XML, STOPWORDS.TXT, STOP-SNOWBALL.TXT, STOP-2.TXT, SCHEMA-COLLATEFILTER.XML, SOLRCONFIG-TLOG.XML, SCHEMA-COLLATE.XML, SOLRCONFIG-NATIVELOCK.XML, CURRENCY.XML, SOLRCONFIG-QUERYSENDER-NOQUERY.XML, SOLRCONFIG-MASTER1-KEEPONEBACKUP.XML, SOLRCONFIG-SIMPLELOCK.XML, SCHEMA-LMDIRICHLET.XML, SCHEMA-REVERSED.XML, BAD-SCHEMA-NOT-INDEXED-BUT-TF.XML, SYNONYMS.TXT, SCHEMA_CODEC.XML, SOLRCONFIG-PROPINJECT.XML, HUNSPELL-TEST.DIC, DA_COMPOUNDDICTIONARY.TXT, SOLRCONFIG-REQHANDLER.INCL, SOLRCONFIG-FUNCTIONQUERY.XML, BAD-SCHEMA-DUP-FIELDTYPE.XML, SOLRCONFIG-UPDATE-PROCESSOR-CHAINS.XML, BAD-SCHEMA-CODEC-GLOBAL-VS-FT-MISMATCH.XML, SOLRCONFIG-BASIC.XML, SOLRCONFIG-ALTDIRECTORY.XML, BAD-SCHEMA-NOT-INDEXED-BUT-NORMS.XML, SCHEMA-CHARFILTERS.XML, BAD-SCHEMA-EXTERNAL-FILEFIELD.XML, BAD-SCHEMA-OMIT-TF-BUT-NOT-POS.XML, OLD_SYNONYMS.TXT, SOLRCONFIG-MASTER2.XML, SCHEMA-PHRASESUGGEST.XML, SOLRCONFIG-CACHING.XML, SOLRCONFIG_PERF.XML, SOLRCONFIG-TRANSFORMERS.XML, SCHEMA-BINARYFIELD.XML, SOLRCONFIG_CODEC.XML, SOLRCONFIG-MASTER3.XML, FRENCHARTICLES.TXT, SOLRCONFIG-ELEVATE.XML, SOLRCONFIG-SPELLCHECKER.XML, OPEN-EXCHANGE-RATES.JSON, SOLRCONFIG-ENABLEPLUGIN.XML, BAD_SOLRCONFIG.XML, BAD-SCHEMA-UNIQUEKEY-IS-COPYFIELD-DEST.XML, SOLRCONFIG-DELPOLICY2.XML, SOLRCONFIG-HIGHLIGHT.XML, SOLRCONFIG-SOLCOREPROPERTIES.XML, SCHEMA-REPLICATION1.XML, STOPWITHBOM.TXT, SCHEMA-REPLICATION2.XML, SOLRCONFIG-SPELLCHECKCOMPONENT.XML, SCHEMA-LMJELINEKMERCER.XML, BAD-SCHEMA-SIM-GLOBAL-VS-FT-MISMATCH.XML, SCHEMA-NUMERIC.XML, SCHEMA12.XML, SCHEMA-MINIMAL.XML, ELEVATE.XML, BAD-SCHEMA-NONTEXT-ANALYZER.XML, XSLT, PROTWORDS.TXT, SCHEMA-COPYFIELD-TEST.XML, BAD-SCHEMA-UNIQUEKEY-USES-DEFAULT.XML, HUNSPELL-TEST.AFF, KEEP-1.TXT, SCHEMA-IB.XML, SOLRCONFIG-REPEATER.XML, SOLRCONFIG-BASIC-LUCENEVERSION31.XML, SCHEMASURROUND.XML, MAPPING-ISOLATIN1ACCENT.TXT, SCHEMA-TFIDF.XML, STOPTYPES-1.TXT, WDFTYPES.TXT, STEMDICT.TXT, SCHEMA-SIM.XML, SCHEMA-SPELLCHECKER.XML, HYPHENATION.DTD, PHRASESUGGEST.TXT, STOP-1.TXT, SCHEMA-TRIE.XML, SCHEMA11.XML, SCHEMA-DFR.XML, SOLRCONFIG-PROPINJECT-INDEXDEFAULT.XML, SOLRCONFIG-LAZYWRITER.XML, SOLRCONFIG-MERGEPOLICY.XML, SOLRCONFIG-QUERYSENDER.XML, SOLRCONFIG-TERMINDEX.XML]
[junit4:junit4]   2> 432 T244 oass.SolrIndexSearcher.<init> Opening Searcher@4e5541dc main
[junit4:junit4]   2> 432 T244 oass.SolrIndexSearcher.getIndexDir WARNING WARNING: Directory impl does not support setting indexDir: org.apache.lucene.store.MockDirectoryWrapper
[junit4:junit4]   2> 432 T244 oasu.CommitTracker.<init> Hard AutoCommit: disabled
[junit4:junit4]   2> 433 T244 oasu.CommitTracker.<init> Soft AutoCommit: disabled
[junit4:junit4]   2> 433 T244 oashc.QueryElevationComponent.inform Loading QueryElevation from: /mnt/ssd/jenkins/workspace/Lucene-Solr-4.x-Linux-Java8-64/checkout/solr/build/solr-core/test-files/solr/collection1/conf/elevate.xml
[junit4:junit4]   2> 440 T244 oashc.QueryElevationComponent.inform Loading QueryElevation from: /mnt/ssd/jenkins/workspace/Lucene-Solr-4.x-Linux-Java8-64/checkout/solr/build/solr-core/test-files/solr/collection1/conf/elevate.xml
[junit4:junit4]   2> 447 T264 oasc.SolrCore.registerSearcher [collection1] Registered new searcher Searcher@4e5541dc main{StandardDirectoryReader(segments_1:1)}
[junit4:junit4]   2> 448 T244 oasc.CoreContainer.register registering core: collection1
[junit4:junit4]   2> 448 T244 oass.SolrDispatchFilter.init user.dir=/mnt/ssd/jenkins/workspace/Lucene-Solr-4.x-Linux-Java8-64/checkout/solr/build/solr-core/test/J0
[junit4:junit4]   2> 448 T244 oass.SolrDispatchFilter.init SolrDispatchFilter.init() done
[junit4:junit4]   2> 448 T244 oascsi.HttpClientUtil.createClient Creating new http client, config:maxConnections=128&maxConnectionsPerHost=32&followRedirects=false
[junit4:junit4]   2> 451 T244 oejs.Server.doStart jetty-8.1.2.v20120308
[junit4:junit4]   2> 458 T244 oejs.AbstractConnector.doStart Started SocketConnector@0.0.0.0:33600
[junit4:junit4]   2> 459 T244 oasc.SolrResourceLoader.locateSolrHome JNDI not configured for solr (NoInitialContextEx)
[junit4:junit4]   2> 460 T244 oasc.SolrResourceLoader.locateSolrHome using system property solr.solr.home: /mnt/ssd/jenkins/workspace/Lucene-Solr-4.x-Linux-Java8-64/checkout/solr/build/solr-core/test-files/solr
[junit4:junit4]   2> 460 T244 oasc.SolrResourceLoader.<init> new SolrResourceLoader for deduced Solr Home: '/mnt/ssd/jenkins/workspace/Lucene-Solr-4.x-Linux-Java8-64/checkout/solr/build/solr-core/test-files/solr/'
[junit4:junit4]   2> 467 T244 oass.SolrDispatchFilter.init SolrDispatchFilter.init()
[junit4:junit4]   2> 467 T244 oasc.SolrResourceLoader.locateSolrHome JNDI not configured for solr (NoInitialContextEx)
[junit4:junit4]   2> 468 T244 oasc.SolrResourceLoader.locateSolrHome using system property solr.solr.home: /mnt/ssd/jenkins/workspace/Lucene-Solr-4.x-Linux-Java8-64/checkout/solr/build/solr-core/test-files/solr
[junit4:junit4]   2> 468 T244 oasc.CoreContainer$Initializer.initialize looking for solr.xml: /mnt/ssd/jenkins/workspace/Lucene-Solr-4.x-Linux-Java8-64/checkout/solr/build/solr-core/test-files/solr/solr.xml
[junit4:junit4]   2> 468 T244 oasc.CoreContainer.<init> New CoreContainer 1488334446
[junit4:junit4]   2> 468 T244 oasc.CoreContainer.load Loading CoreContainer using Solr Home: '/mnt/ssd/jenkins/workspace/Lucene-Solr-4.x-Linux-Java8-64/checkout/solr/build/solr-core/test-files/solr/'
[junit4:junit4]   2> 469 T244 oasc.SolrResourceLoader.<init> new SolrResourceLoader for directory: '/mnt/ssd/jenkins/workspace/Lucene-Solr-4.x-Linux-Java8-64/checkout/solr/build/solr-core/test-files/solr/'
[junit4:junit4]   2> 475 T244 oasc.CoreContainer.load Registering Log Listener
[junit4:junit4]   2> 484 T244 oashc.HttpShardHandlerFactory.getParameter Setting socketTimeout to: 0
[junit4:junit4]   2> 485 T244 oashc.HttpShardHandlerFactory.getParameter Setting urlScheme to: http://
[junit4:junit4]   2> 485 T244 oashc.HttpShardHandlerFactory.getParameter Setting connTimeout to: 0
[junit4:junit4]   2> 485 T244 oashc.HttpShardHandlerFactory.getParameter Setting maxConnectionsPerHost to: 20
[junit4:junit4]   2> 485 T244 oashc.HttpShardHandlerFactory.getParameter Setting corePoolSize to: 0
[junit4:junit4]   2> 486 T244 oashc.HttpShardHandlerFactory.getParameter Setting maximumPoolSize to: 2147483647
[junit4:junit4]   2> 486 T244 oashc.HttpShardHandlerFactory.getParameter Setting maxThreadIdleTime to: 5
[junit4:junit4]   2> 486 T244 oashc.HttpShardHandlerFactory.getParameter Setting sizeOfQueue to: -1
[junit4:junit4]   2> 486 T244 oashc.HttpShardHandlerFactory.getParameter Setting fairnessPolicy to: false
[junit4:junit4]   2> 486 T244 oascsi.HttpClientUtil.createClient Creating new http client, config:maxConnectionsPerHost=20&maxConnections=10000&socketTimeout=0&connTimeout=0&retry=false
[junit4:junit4]   2> 492 T244 oasc.CoreContainer.create Creating SolrCore 'collection1' using instanceDir: /mnt/ssd/jenkins/workspace/Lucene-Solr-4.x-Linux-Java8-64/checkout/solr/build/solr-core/test-files/solr/collection1
[junit4:junit4]   2> 492 T244 oasc.SolrResourceLoader.<init> new SolrResourceLoader for directory: '/mnt/ssd/jenkins/workspace/Lucene-Solr-4.x-Linux-Java8-64/checkout/solr/build/solr-core/test-files/solr/collection1/'
[junit4:junit4]   2> 493 T244 oasc.SolrResourceLoader.replaceClassLoader Adding 'file:/mnt/ssd/jenkins/workspace/Lucene-Solr-4.x-Linux-Java8-64/checkout/solr/build/solr-core/test-files/solr/collection1/lib/README' to classloader
[junit4:junit4]   2> 493 T244 oasc.SolrResourceLoader.replaceClassLoader Adding 'file:/mnt/ssd/jenkins/workspace/Lucene-Solr-4.x-Linux-Java8-64/checkout/solr/build/solr-core/test-files/solr/collection1/lib/classes/' to classloader
[junit4:junit4]   2> 505 T244 oasc.SolrConfig.<init> Using Lucene MatchVersion: LUCENE_40
[junit4:junit4]   2> 536 T244 oasc.SolrConfig.<init> Loaded SolrConfig: solrconfig-elevate.xml
[junit4:junit4]   2> 536 T244 oass.IndexSchema.readSchema Reading Solr Schema
[junit4:junit4]   2> 538 T244 oass.IndexSchema.readSchema Schema name=example
[junit4:junit4]   2> 657 T244 oass.IndexSchema.readSchema default search field in schema is text
[junit4:junit4]   2> 659 T244 oass.IndexSchema.readSchema unique key field: id
[junit4:junit4]   2> 662 T244 oasc.SolrCore.<init> [collection1] Opening new SolrCore at /mnt/ssd/jenkins/workspace/Lucene-Solr-4.x-Linux-Java8-64/checkout/solr/build/solr-core/test-files/solr/collection1/, dataDir=./org.apache.solr.handler.component.DistributedQueryElevationComponentTest-1341935964748/shard1/data/
[junit4:junit4]   2> 663 T244 oasc.JmxMonitoredMap.<init> JMX monitoring is enabled. Adding Solr mbeans to JMX Server: com.sun.jmx.mbeanserver.JmxMBeanServer@5193710b
[junit4:junit4]   2> 663 T244 oasc.SolrCore.getNewIndexDir WARNING New index directory detected: old=null new=./org.apache.solr.handler.component.DistributedQueryElevationComponentTest-1341935964748/shard1/data/index/
[junit4:junit4]   2> 663 T244 oasc.SolrCore.initIndex WARNING [collection1] Solr index directory './org.apache.solr.handler.component.DistributedQueryElevationComponentTest-1341935964748/shard1/data/index' doesn't exist. Creating new index...
[junit4:junit4]   2> 665 T244 oasc.SolrDeletionPolicy.onCommit SolrDeletionPolicy.onCommit: commits:num=1
[junit4:junit4]   2> 		commit{dir=MockDirWrapper(org.apache.lucene.store.RAMDirectory@67ca951a lockFactory=org.apache.lucene.store.SingleInstanceLockFactory@6ce14a99),segFN=segments_1,generation=1,filenames=[segments_1]
[junit4:junit4]   2> 665 T244 oasc.SolrDeletionPolicy.updateCommits newest commit = 1
[junit4:junit4]   2> 683 T244 oasc.RequestHandlers.initHandlersFromConfig created /update: solr.UpdateRequestHandler
[junit4:junit4]   2> 684 T244 oasc.RequestHandlers.initHandlersFromConfig created /elevate: org.apache.solr.handler.component.SearchHandler
[junit4:junit4]   2> 684 T244 oasc.RequestHandlers.initHandlersFromConfig created /dataElevate: org.apache.solr.handler.component.SearchHandler
[junit4:junit4]   2> 685 T244 oashl.XMLLoader.init xsltCacheLifetimeSeconds=60
[junit4:junit4]   2> 685 T244 oasc.RequestHandlers.initHandlersFromConfig WARNING no default request handler is registered (either '/select' or 'standard')
[junit4:junit4]   2> 686 T244 oasc.SolrCore.initDeprecatedSupport WARNING solrconfig.xml uses deprecated <admin/gettableFiles>, Please update your config to use the ShowFileRequestHandler.
[junit4:junit4]   2> 687 T244 oasc.SolrCore.initDeprecatedSupport WARNING adding ShowFileRequestHandler with hidden files: [SCHEMA-BM25.XML, KEEP-2.TXT, BAD-SCHEMA-NOT-INDEXED-BUT-POS.XML, BAD-MP-SOLRCONFIG.XML, DA_UTF8.XML, SOLRCONFIG-DELPOLICY1.XML, SOLRCONFIG-MASTER.XML, COMPOUNDDICTIONARY.TXT, SOLRCONFIG-NOCACHE.XML, SCHEMA-NOT-REQUIRED-UNIQUE-KEY.XML, BAD-SCHEMA-DUP-FIELD.XML, SOLRCONFIG-PHRASESUGGEST.XML, SOLRCONFIG-SLAVE.XML, STOPTYPES-2.TXT, SCHEMA-STOP-KEEP.XML, SCHEMA.XML, STOPWORDSWRONGENCODING.TXT, SOLRCONFIG-SLAVE1.XML, SOLRCONFIG-SOLR-749.XML, SCHEMA-FOLDING.XML, SOLRCONFIG-XINCLUDE.XML, SCHEMA15.XML, SOLRCONFIG-MASTER1.XML, SCHEMA-LUCENEMATCHVERSION.XML, SCHEMA-REQUIRED-FIELDS.XML, BAD-SCHEMA-DUP-DYNAMICFIELD.XML, STOPWORDS.TXT, STOP-SNOWBALL.TXT, STOP-2.TXT, SCHEMA-COLLATEFILTER.XML, SOLRCONFIG-TLOG.XML, SCHEMA-COLLATE.XML, SOLRCONFIG-NATIVELOCK.XML, CURRENCY.XML, SOLRCONFIG-QUERYSENDER-NOQUERY.XML, SOLRCONFIG-MASTER1-KEEPONEBACKUP.XML, SOLRCONFIG-SIMPLELOCK.XML, SCHEMA-LMDIRICHLET.XML, SCHEMA-REVERSED.XML, BAD-SCHEMA-NOT-INDEXED-BUT-TF.XML, SYNONYMS.TXT, SCHEMA_CODEC.XML, SOLRCONFIG-PROPINJECT.XML, HUNSPELL-TEST.DIC, DA_COMPOUNDDICTIONARY.TXT, SOLRCONFIG-REQHANDLER.INCL, SOLRCONFIG-FUNCTIONQUERY.XML, BAD-SCHEMA-DUP-FIELDTYPE.XML, SOLRCONFIG-UPDATE-PROCESSOR-CHAINS.XML, BAD-SCHEMA-CODEC-GLOBAL-VS-FT-MISMATCH.XML, SOLRCONFIG-BASIC.XML, SOLRCONFIG-ALTDIRECTORY.XML, BAD-SCHEMA-NOT-INDEXED-BUT-NORMS.XML, SCHEMA-CHARFILTERS.XML, BAD-SCHEMA-EXTERNAL-FILEFIELD.XML, BAD-SCHEMA-OMIT-TF-BUT-NOT-POS.XML, OLD_SYNONYMS.TXT, SOLRCONFIG-MASTER2.XML, SCHEMA-PHRASESUGGEST.XML, SOLRCONFIG-CACHING.XML, SOLRCONFIG_PERF.XML, SOLRCONFIG-TRANSFORMERS.XML, SCHEMA-BINARYFIELD.XML, SOLRCONFIG_CODEC.XML, SOLRCONFIG-MASTER3.XML, FRENCHARTICLES.TXT, SOLRCONFIG-ELEVATE.XML, SOLRCONFIG-SPELLCHECKER.XML, OPEN-EXCHANGE-RATES.JSON, SOLRCONFIG-ENABLEPLUGIN.XML, BAD_SOLRCONFIG.XML, BAD-SCHEMA-UNIQUEKEY-IS-COPYFIELD-DEST.XML, SOLRCONFIG-DELPOLICY2.XML, SOLRCONFIG-HIGHLIGHT.XML, SOLRCONFIG-SOLCOREPROPERTIES.XML, SCHEMA-REPLICATION1.XML, STOPWITHBOM.TXT, SCHEMA-REPLICATION2.XML, SOLRCONFIG-SPELLCHECKCOMPONENT.XML, SCHEMA-LMJELINEKMERCER.XML, BAD-SCHEMA-SIM-GLOBAL-VS-FT-MISMATCH.XML, SCHEMA-NUMERIC.XML, SCHEMA12.XML, SCHEMA-MINIMAL.XML, ELEVATE.XML, BAD-SCHEMA-NONTEXT-ANALYZER.XML, XSLT, PROTWORDS.TXT, SCHEMA-COPYFIELD-TEST.XML, BAD-SCHEMA-UNIQUEKEY-USES-DEFAULT.XML, HUNSPELL-TEST.AFF, KEEP-1.TXT, SCHEMA-IB.XML, SOLRCONFIG-REPEATER.XML, SOLRCONFIG-BASIC-LUCENEVERSION31.XML, SCHEMASURROUND.XML, MAPPING-ISOLATIN1ACCENT.TXT, SCHEMA-TFIDF.XML, STOPTYPES-1.TXT, WDFTYPES.TXT, STEMDICT.TXT, SCHEMA-SIM.XML, SCHEMA-SPELLCHECKER.XML, HYPHENATION.DTD, PHRASESUGGEST.TXT, STOP-1.TXT, SCHEMA-TRIE.XML, SCHEMA11.XML, SCHEMA-DFR.XML, SOLRCONFIG-PROPINJECT-INDEXDEFAULT.XML, SOLRCONFIG-LAZYWRITER.XML, SOLRCONFIG-MERGEPOLICY.XML, SOLRCONFIG-QUERYSENDER.XML, SOLRCONFIG-TERMINDEX.XML]
[junit4:junit4]   2> 697 T244 oass.SolrIndexSearcher.<init> Opening Searcher@759f03d2 main
[junit4:junit4]   2> 698 T244 oass.SolrIndexSearcher.getIndexDir WARNING WARNING: Directory impl does not support setting indexDir: org.apache.lucene.store.MockDirectoryWrapper
[junit4:junit4]   2> 698 T244 oasu.CommitTracker.<init> Hard AutoCommit: disabled
[junit4:junit4]   2> 698 T244 oasu.CommitTracker.<init> Soft AutoCommit: disabled
[junit4:junit4]   2> 699 T244 oashc.QueryElevationComponent.inform Loading QueryElevation from: /mnt/ssd/jenkins/workspace/Lucene-Solr-4.x-Linux-Java8-64/checkout/solr/build/solr-core/test-files/solr/collection1/conf/elevate.xml
[junit4:junit4]   2> 706 T244 oashc.QueryElevationComponent.inform Loading QueryElevation from: /mnt/ssd/jenkins/workspace/Lucene-Solr-4.x-Linux-Java8-64/checkout/solr/build/solr-core/test-files/solr/collection1/conf/elevate.xml
[junit4:junit4]   2> 724 T274 oasc.SolrCore.registerSearcher [collection1] Registered new searcher Searcher@759f03d2 main{StandardDirectoryReader(segments_1:1)}
[junit4:junit4]   2> 724 T244 oasc.CoreContainer.register registering core: collection1
[junit4:junit4]   2> 724 T244 oass.SolrDispatchFilter.init user.dir=/mnt/ssd/jenkins/workspace/Lucene-Solr-4.x-Linux-Java8-64/checkout/solr/build/solr-core/test/J0
[junit4:junit4]   2> 724 T244 oass.SolrDispatchFilter.init SolrDispatchFilter.init() done
[junit4:junit4]   2> 725 T244 oascsi.HttpClientUtil.createClient Creating new http client, config:maxConnections=128&maxConnectionsPerHost=32&followRedirects=false
[junit4:junit4]   2> 733 T244 oejs.Server.doStart jetty-8.1.2.v20120308
[junit4:junit4]   2> 743 T244 oejs.AbstractConnector.doStart Started SocketConnector@0.0.0.0:40762
[junit4:junit4]   2> 744 T244 oasc.SolrResourceLoader.locateSolrHome JNDI not configured for solr (NoInitialContextEx)
[junit4:junit4]   2> 744 T244 oasc.SolrResourceLoader.locateSolrHome using system property solr.solr.home: /mnt/ssd/jenkins/workspace/Lucene-Solr-4.x-Linux-Java8-64/checkout/solr/build/solr-core/test-files/solr
[junit4:junit4]   2> 744 T244 oasc.SolrResourceLoader.<init> new SolrResourceLoader for deduced Solr Home: '/mnt/ssd/jenkins/workspace/Lucene-Solr-4.x-Linux-Java8-64/checkout/solr/build/solr-core/test-files/solr/'
[junit4:junit4]   2> 748 T244 oass.SolrDispatchFilter.init SolrDispatchFilter.init()
[junit4:junit4]   2> 748 T244 oasc.SolrResourceLoader.locateSolrHome JNDI not configured for solr (NoInitialContextEx)
[junit4:junit4]   2> 748 T244 oasc.SolrResourceLoader.locateSolrHome using system property solr.solr.home: /mnt/ssd/jenkins/workspace/Lucene-Solr-4.x-Linux-Java8-64/checkout/solr/build/solr-core/test-files/solr
[junit4:junit4]   2> 749 T244 oasc.CoreContainer$Initializer.initialize looking for solr.xml: /mnt/ssd/jenkins/workspace/Lucene-Solr-4.x-Linux-Java8-64/checkout/solr/build/solr-core/test-files/solr/solr.xml
[junit4:junit4]   2> 749 T244 oasc.CoreContainer.<init> New CoreContainer 1412608053
[junit4:junit4]   2> 757 T244 oasc.CoreContainer.load Loading CoreContainer using Solr Home: '/mnt/ssd/jenkins/workspace/Lucene-Solr-4.x-Linux-Java8-64/checkout/solr/build/solr-core/test-files/solr/'
[junit4:junit4]   2> 757 T244 oasc.SolrResourceLoader.<init> new SolrResourceLoader for directory: '/mnt/ssd/jenkins/workspace/Lucene-Solr-4.x-Linux-Java8-64/checkout/solr/build/solr-core/test-files/solr/'
[junit4:junit4]   2> 764 T244 oasc.CoreContainer.load Registering Log Listener
[junit4:junit4]   2> 773 T244 oashc.HttpShardHandlerFactory.getParameter Setting socketTimeout to: 0
[junit4:junit4]   2> 773 T244 oashc.HttpShardHandlerFactory.getParameter Setting urlScheme to: http://
[junit4:junit4]   2> 773 T244 oashc.HttpShardHandlerFactory.getParameter Setting connTimeout to: 0
[junit4:junit4]   2> 774 T244 oashc.HttpShardHandlerFactory.getParameter Setting maxConnectionsPerHost to: 20
[junit4:junit4]   2> 774 T244 oashc.HttpShardHandlerFactory.getParameter Setting corePoolSize to: 0
[junit4:junit4]   2> 774 T244 oashc.HttpShardHandlerFactory.getParameter Setting maximumPoolSize to: 2147483647
[junit4:junit4]   2> 774 T244 oashc.HttpShardHandlerFactory.getParameter Setting maxThreadIdleTime to: 5
[junit4:junit4]   2> 774 T244 oashc.HttpShardHandlerFactory.getParameter Setting sizeOfQueue to: -1
[junit4:junit4]   2> 775 T244 oashc.HttpShardHandlerFactory.getParameter Setting fairnessPolicy to: false
[junit4:junit4]   2> 775 T244 oascsi.HttpClientUtil.createClient Creating new http client, config:maxConnectionsPerHost=20&maxConnections=10000&socketTimeout=0&connTimeout=0&retry=false
[junit4:junit4]   2> 781 T244 oasc.CoreContainer.create Creating SolrCore 'collection1' using instanceDir: /mnt/ssd/jenkins/workspace/Lucene-Solr-4.x-Linux-Java8-64/checkout/solr/build/solr-core/test-files/solr/collection1
[junit4:junit4]   2> 781 T244 oasc.SolrResourceLoader.<init> new SolrResourceLoader for directory: '/mnt/ssd/jenkins/workspace/Lucene-Solr-4.x-Linux-Java8-64/checkout/solr/build/solr-core/test-files/solr/collection1/'
[junit4:junit4]   2> 782 T244 oasc.SolrResourceLoader.replaceClassLoader Adding 'file:/mnt/ssd/jenkins/workspace/Lucene-Solr-4.x-Linux-Java8-64/checkout/solr/build/solr-core/test-files/solr/collection1/lib/README' to classloader
[junit4:junit4]   2> 782 T244 oasc.SolrResourceLoader.replaceClassLoader Adding 'file:/mnt/ssd/jenkins/workspace/Lucene-Solr-4.x-Linux-Java8-64/checkout/solr/build/solr-core/test-files/solr/collection1/lib/classes/' to classloader
[junit4:junit4]   2> 800 T244 oasc.SolrConfig.<init> Using Lucene MatchVersion: LUCENE_40
[junit4:junit4]   2> 828 T244 oasc.SolrConfig.<init> Loaded SolrConfig: solrconfig-elevate.xml
[junit4:junit4]   2> 828 T244 oass.IndexSchema.readSchema Reading Solr Schema
[junit4:junit4]   2> 831 T244 oass.IndexSchema.readSchema Schema name=example
[junit4:junit4]   2> 981 T244 oass.IndexSchema.readSchema default search field in schema is text
[junit4:junit4]   2> 984 T244 oass.IndexSchema.readSchema unique key field: id
[junit4:junit4]   2> 987 T244 oasc.SolrCore.<init> [collection1] Opening new SolrCore at /mnt/ssd/jenkins/workspace/Lucene-Solr-4.x-Linux-Java8-64/checkout/solr/build/solr-core/test-files/solr/collection1/, dataDir=./org.apache.solr.handler.component.DistributedQueryElevationComponentTest-1341935964748/shard2/data/
[junit4:junit4]   2> 987 T244 oasc.JmxMonitoredMap.<init> JMX monitoring is enabled. Adding Solr mbeans to JMX Server: com.sun.jmx.mbeanserver.JmxMBeanServer@5193710b
[junit4:junit4]   2> 988 T244 oasc.SolrCore.getNewIndexDir WARNING New index directory detected: old=null new=./org.apache.solr.handler.component.DistributedQueryElevationComponentTest-1341935964748/shard2/data/index/
[junit4:junit4]   2> 988 T244 oasc.SolrCore.initIndex WARNING [collection1] Solr index directory './org.apache.solr.handler.component.DistributedQueryElevationComponentTest-1341935964748/shard2/data/index' doesn't exist. Creating new index...
[junit4:junit4]   2> 989 T244 oasc.SolrDeletionPolicy.onCommit SolrDeletionPolicy.onCommit: commits:num=1
[junit4:junit4]   2> 		commit{dir=MockDirWrapper(org.apache.lucene.store.RAMDirectory@5b811aeb lockFactory=org.apache.lucene.store.SingleInstanceLockFactory@211ede94),segFN=segments_1,generation=1,filenames=[segments_1]
[junit4:junit4]   2> 990 T244 oasc.SolrDeletionPolicy.updateCommits newest commit = 1
[junit4:junit4]   2> 991 T244 oasc.RequestHandlers.initHandlersFromConfig created /update: solr.UpdateRequestHandler
[junit4:junit4]   2> 991 T244 oasc.RequestHandlers.initHandlersFromConfig created /elevate: org.apache.solr.handler.component.SearchHandler
[junit4:junit4]   2> 991 T244 oasc.RequestHandlers.initHandlersFromConfig created /dataElevate: org.apache.solr.handler.component.SearchHandler
[junit4:junit4]   2> 992 T244 oashl.XMLLoader.init xsltCacheLifetimeSeconds=60
[junit4:junit4]   2> 992 T244 oasc.RequestHandlers.initHandlersFromConfig WARNING no default request handler is registered (either '/select' or 'standard')
[junit4:junit4]   2> 993 T244 oasc.SolrCore.initDeprecatedSupport WARNING solrconfig.xml uses deprecated <admin/gettableFiles>, Please update your config to use the ShowFileRequestHandler.
[junit4:junit4]   2> 994 T244 oasc.SolrCore.initDeprecatedSupport WARNING adding ShowFileRequestHandler with hidden files: [SCHEMA-BM25.XML, KEEP-2.TXT, BAD-SCHEMA-NOT-INDEXED-BUT-POS.XML, BAD-MP-SOLRCONFIG.XML, DA_UTF8.XML, SOLRCONFIG-DELPOLICY1.XML, SOLRCONFIG-MASTER.XML, COMPOUNDDICTIONARY.TXT, SOLRCONFIG-NOCACHE.XML, SCHEMA-NOT-REQUIRED-UNIQUE-KEY.XML, BAD-SCHEMA-DUP-FIELD.XML, SOLRCONFIG-PHRASESUGGEST.XML, SOLRCONFIG-SLAVE.XML, STOPTYPES-2.TXT, SCHEMA-STOP-KEEP.XML, SCHEMA.XML, STOPWORDSWRONGENCODING.TXT, SOLRCONFIG-SLAVE1.XML, SOLRCONFIG-SOLR-749.XML, SCHEMA-FOLDING.XML, SOLRCONFIG-XINCLUDE.XML, SCHEMA15.XML, SOLRCONFIG-MASTER1.XML, SCHEMA-LUCENEMATCHVERSION.XML, SCHEMA-REQUIRED-FIELDS.XML, BAD-SCHEMA-DUP-DYNAMICFIELD.XML, STOPWORDS.TXT, STOP-SNOWBALL.TXT, STOP-2.TXT, SCHEMA-COLLATEFILTER.XML, SOLRCONFIG-TLOG.XML, SCHEMA-COLLATE.XML, SOLRCONFIG-NATIVELOCK.XML, CURRENCY.XML, SOLRCONFIG-QUERYSENDER-NOQUERY.XML, SOLRCONFIG-MASTER1-KEEPONEBACKUP.XML, SOLRCONFIG-SIMPLELOCK.XML, SCHEMA-LMDIRICHLET.XML, SCHEMA-REVERSED.XML, BAD-SCHEMA-NOT-INDEXED-BUT-TF.XML, SYNONYMS.TXT, SCHEMA_CODEC.XML, SOLRCONFIG-PROPINJECT.XML, HUNSPELL-TEST.DIC, DA_COMPOUNDDICTIONARY.TXT, SOLRCONFIG-REQHANDLER.INCL, SOLRCONFIG-FUNCTIONQUERY.XML, BAD-SCHEMA-DUP-FIELDTYPE.XML, SOLRCONFIG-UPDATE-PROCESSOR-CHAINS.XML, BAD-SCHEMA-CODEC-GLOBAL-VS-FT-MISMATCH.XML, SOLRCONFIG-BASIC.XML, SOLRCONFIG-ALTDIRECTORY.XML, BAD-SCHEMA-NOT-INDEXED-BUT-NORMS.XML, SCHEMA-CHARFILTERS.XML, BAD-SCHEMA-EXTERNAL-FILEFIELD.XML, BAD-SCHEMA-OMIT-TF-BUT-NOT-POS.XML, OLD_SYNONYMS.TXT, SOLRCONFIG-MASTER2.XML, SCHEMA-PHRASESUGGEST.XML, SOLRCONFIG-CACHING.XML, SOLRCONFIG_PERF.XML, SOLRCONFIG-TRANSFORMERS.XML, SCHEMA-BINARYFIELD.XML, SOLRCONFIG_CODEC.XML, SOLRCONFIG-MASTER3.XML, FRENCHARTICLES.TXT, SOLRCONFIG-ELEVATE.XML, SOLRCONFIG-SPELLCHECKER.XML, OPEN-EXCHANGE-RATES.JSON, SOLRCONFIG-ENABLEPLUGIN.XML, BAD_SOLRCONFIG.XML, BAD-SCHEMA-UNIQUEKEY-IS-COPYFIELD-DEST.XML, SOLRCONFIG-DELPOLICY2.XML, SOLRCONFIG-HIGHLIGHT.XML, SOLRCONFIG-SOLCOREPROPERTIES.XML, SCHEMA-REPLICATION1.XML, STOPWITHBOM.TXT, SCHEMA-REPLICATION2.XML, SOLRCONFIG-SPELLCHECKCOMPONENT.XML, SCHEMA-LMJELINEKMERCER.XML, BAD-SCHEMA-SIM-GLOBAL-VS-FT-MISMATCH.XML, SCHEMA-NUMERIC.XML, SCHEMA12.XML, SCHEMA-MINIMAL.XML, ELEVATE.XML, BAD-SCHEMA-NONTEXT-ANALYZER.XML, XSLT, PROTWORDS.TXT, SCHEMA-COPYFIELD-TEST.XML, BAD-SCHEMA-UNIQUEKEY-USES-DEFAULT.XML, HUNSPELL-TEST.AFF, KEEP-1.TXT, SCHEMA-IB.XML, SOLRCONFIG-REPEATER.XML, SOLRCONFIG-BASIC-LUCENEVERSION31.XML, SCHEMASURROUND.XML, MAPPING-ISOLATIN1ACCENT.TXT, SCHEMA-TFIDF.XML, STOPTYPES-1.TXT, WDFTYPES.TXT, STEMDICT.TXT, SCHEMA-SIM.XML, SCHEMA-SPELLCHECKER.XML, HYPHENATION.DTD, PHRASESUGGEST.TXT, STOP-1.TXT, SCHEMA-TRIE.XML, SCHEMA11.XML, SCHEMA-DFR.XML, SOLRCONFIG-PROPINJECT-INDEXDEFAULT.XML, SOLRCONFIG-LAZYWRITER.XML, SOLRCONFIG-MERGEPOLICY.XML, SOLRCONFIG-QUERYSENDER.XML, SOLRCONFIG-TERMINDEX.XML]
[junit4:junit4]   2> 997 T244 oass.SolrIndexSearcher.<init> Opening Searcher@20f97cce main
[junit4:junit4]   2> 997 T244 oass.SolrIndexSearcher.getIndexDir WARNING WARNING: Directory impl does not support setting indexDir: org.apache.lucene.store.MockDirectoryWrapper
[junit4:junit4]   2> 998 T244 oasu.CommitTracker.<init> Hard AutoCommit: disabled
[junit4:junit4]   2> 998 T244 oasu.CommitTracker.<init> Soft AutoCommit: disabled
[junit4:junit4]   2> 998 T244 oashc.QueryElevationComponent.inform Loading QueryElevation from: /mnt/ssd/jenkins/workspace/Lucene-Solr-4.x-Linux-Java8-64/checkout/solr/build/solr-core/test-files/solr/collection1/conf/elevate.xml
[junit4:junit4]   2> 1006 T244 oashc.QueryElevationComponent.inform Loading QueryElevation from: /mnt/ssd/jenkins/workspace/Lucene-Solr-4.x-Linux-Java8-64/checkout/solr/build/solr-core/test-files/solr/collection1/conf/elevate.xml
[junit4:junit4]   2> 1013 T284 oasc.SolrCore.registerSearcher [collection1] Registered new searcher Searcher@20f97cce main{StandardDirectoryReader(segments_1:1)}
[junit4:junit4]   2> 1013 T244 oasc.CoreContainer.register registering core: collection1
[junit4:junit4]   2> 1014 T244 oass.SolrDispatchFilter.init user.dir=/mnt/ssd/jenkins/workspace/Lucene-Solr-4.x-Linux-Java8-64/checkout/solr/build/solr-core/test/J0
[junit4:junit4]   2> 1014 T244 oass.SolrDispatchFilter.init SolrDispatchFilter.init() done
[junit4:junit4]   2> 1014 T244 oascsi.HttpClientUtil.createClient Creating new http client, config:maxConnections=128&maxConnectionsPerHost=32&followRedirects=false
[junit4:junit4]   2> ASYNC  NEW_CORE C32 name=collection1 org.apache.solr.core.SolrCore@40dcc542
[junit4:junit4]   2> 1023 T247 C32 oasu.DirectUpdateHandler2.deleteAll [collection1] REMOVING ALL DOCUMENTS FROM INDEX
[junit4:junit4]   2> 1026 T247 C32 oasc.SolrDeletionPolicy.onInit SolrDeletionPolicy.onInit: commits:num=1
[junit4:junit4]   2> 		commit{dir=MockDirWrapper(org.apache.lucene.store.RAMDirectory@5e1a9152 lockFactory=org.apache.lucene.store.SingleInstanceLockFactory@42dc341c),segFN=segments_1,generation=1,filenames=[segments_1]
[junit4:junit4]   2> 1026 T247 C32 oasc.SolrDeletionPolicy.updateCommits newest commit = 1
[junit4:junit4]   2> 1026 T247 C32 UPDATE [collection1] webapp=/solr path=/update params={version=2&wt=javabin} {deleteByQuery=*:*} 0 3
[junit4:junit4]   2> ASYNC  NEW_CORE C33 name=collection1 org.apache.solr.core.SolrCore@76d165d6
[junit4:junit4]   2> 1040 T257 C33 oasu.DirectUpdateHandler2.deleteAll [collection1] REMOVING ALL DOCUMENTS FROM INDEX
[junit4:junit4]   2> 1041 T257 C33 oasc.SolrDeletionPolicy.onInit SolrDeletionPolicy.onInit: commits:num=1
[junit4:junit4]   2> 		commit{dir=MockDirWrapper(org.apache.lucene.store.RAMDirectory@2d75018b lockFactory=org.apache.lucene.store.SingleInstanceLockFactory@4daca699),segFN=segments_1,generation=1,filenames=[segments_1]
[junit4:junit4]   2> 1041 T257 C33 oasc.SolrDeletionPolicy.updateCommits newest commit = 1
[junit4:junit4]   2> 1042 T257 C33 UPDATE [collection1] webapp=/solr path=/update params={version=2&wt=javabin} {deleteByQuery=*:*} 0 2
[junit4:junit4]   2> ASYNC  NEW_CORE C34 name=collection1 org.apache.solr.core.SolrCore@23de8c43
[junit4:junit4]   2> 1063 T267 C34 oasu.DirectUpdateHandler2.deleteAll [collection1] REMOVING ALL DOCUMENTS FROM INDEX
[junit4:junit4]   2> 1064 T267 C34 oasc.SolrDeletionPolicy.onInit SolrDeletionPolicy.onInit: commits:num=1
[junit4:junit4]   2> 		commit{dir=MockDirWrapper(org.apache.lucene.store.RAMDirectory@67ca951a lockFactory=org.apache.lucene.store.SingleInstanceLockFactory@6ce14a99),segFN=segments_1,generation=1,filenames=[segments_1]
[junit4:junit4]   2> 1065 T267 C34 oasc.SolrDeletionPolicy.updateCommits newest commit = 1
[junit4:junit4]   2> 1065 T267 C34 UPDATE [collection1] webapp=/solr path=/update params={version=2&wt=javabin} {deleteByQuery=*:*} 0 2
[junit4:junit4]   2> ASYNC  NEW_CORE C35 name=collection1 org.apache.solr.core.SolrCore@7154643d
[junit4:junit4]   2> 1071 T277 C35 oasu.DirectUpdateHandler2.deleteAll [collection1] REMOVING ALL DOCUMENTS FROM INDEX
[junit4:junit4]   2> 1072 T277 C35 oasc.SolrDeletionPolicy.onInit SolrDeletionPolicy.onInit: commits:num=1
[junit4:junit4]   2> 		commit{dir=MockDirWrapper(org.apache.lucene.store.RAMDirectory@5b811aeb lockFactory=org.apache.lucene.store.SingleInstanceLockFactory@211ede94),segFN=segments_1,generation=1,filenames=[segments_1]
[junit4:junit4]   2> 1072 T277 C35 oasc.SolrDeletionPolicy.updateCommits newest commit = 1
[junit4:junit4]   2> 1073 T277 C35 UPDATE [collection1] webapp=/solr path=/update params={version=2&wt=javabin} {deleteByQuery=*:*} 0 3
[junit4:junit4]   2> 1076 T247 C32 UPDATE [collection1] webapp=/solr path=/update params={version=2&wt=javabin} {add=[1]} 0 0
[junit4:junit4]   2> 1080 T257 C33 UPDATE [collection1] webapp=/solr path=/update params={version=2&wt=javabin} {add=[1]} 0 0
[junit4:junit4]   2> 1084 T247 C32 UPDATE [collection1] webapp=/solr path=/update params={version=2&wt=javabin} {add=[2]} 0 1
[junit4:junit4]   2> 1087 T267 C34 UPDATE [collection1] webapp=/solr path=/update params={version=2&wt=javabin} {add=[2]} 0 0
[junit4:junit4]   2> 1091 T247 C32 UPDATE [collection1] webapp=/solr path=/update params={version=2&wt=javabin} {add=[3]} 0 1
[junit4:junit4]   2> 1094 T277 C35 UPDATE [collection1] webapp=/solr path=/update params={version=2&wt=javabin} {add=[3]} 0 0
[junit4:junit4]   2> 1098 T247 C32 UPDATE [collection1] webapp=/solr path=/update params={version=2&wt=javabin} {add=[4]} 0 1
[junit4:junit4]   2> 1101 T257 C33 UPDATE [collection1] webapp=/solr path=/update params={version=2&wt=javabin} {add=[4]} 0 1
[junit4:junit4]   2> 1104 T247 C32 UPDATE [collection1] webapp=/solr path=/update params={version=2&wt=javabin} {add=[5]} 0 1
[junit4:junit4]   2> 1107 T267 C34 UPDATE [collection1] webapp=/solr path=/update params={version=2&wt=javabin} {add=[5]} 0 0
[junit4:junit4]   2> 1110 T247 C32 UPDATE [collection1] webapp=/solr path=/update params={version=2&wt=javabin} {add=[6]} 0 0
[junit4:junit4]   2> 1113 T277 C35 UPDATE [collection1] webapp=/solr path=/update params={version=2&wt=javabin} {add=[6]} 0 0
[junit4:junit4]   2> 1116 T247 C32 UPDATE [collection1] webapp=/solr path=/update params={version=2&wt=javabin} {add=[7]} 0 0
[junit4:junit4]   2> 1120 T277 C35 UPDATE [collection1] webapp=/solr path=/update params={version=2&wt=javabin} {add=[7]} 0 1
[junit4:junit4]   2> 1123 T247 C32 oasu.DirectUpdateHandler2.commit start commit{flags=0,version=0,optimize=false,openSearcher=true,waitSearcher=true,expungeDeletes=false,softCommit=false}
[junit4:junit4]   2> 1125 T247 C32 oasc.SolrDeletionPolicy.onCommit SolrDeletionPolicy.onCommit: commits:num=2
[junit4:junit4]   2> 		commit{dir=MockDirWrapper(org.apache.lucene.store.RAMDirectory@5e1a9152 lockFactory=org.apache.lucene.store.SingleInstanceLockFactory@42dc341c),segFN=segments_1,generation=1,filenames=[segments_1]
[junit4:junit4]   2> 		commit{dir=MockDirWrapper(org.apache.lucene.store.RAMDirectory@5e1a9152 lockFactory=org.apache.lucene.store.SingleInstanceLockFactory@42dc341c),segFN=segments_2,generation=2,filenames=[_0_MockVariableIntBlock_0.pos, _0.fdx, _0_MockVariableIntBlock_0.skp, _0_NestedPulsing_0.frq, _0_NestedPulsing_0.tim, _0_MockVariableIntBlock_0.frq, _0.si, segments_2, _0_MockVariableIntBlock_0.pyl, _0_MockVariableIntBlock_0.tii, _0_nrm.cfe, _0.fnm, _0_nrm.cfs, _0_NestedPulsing_0.prx, _0_MockVariableIntBlock_0.doc, _0_NestedPulsing_0.tip, _0.fdt, _0_MockVariableIntBlock_0.tib]
[junit4:junit4]   2> 1125 T247 C32 oasc.SolrDeletionPolicy.updateCommits newest commit = 2
[junit4:junit4]   2> 1130 T247 C32 oass.SolrIndexSearcher.<init> Opening Searcher@9710d main
[junit4:junit4]   2> 1130 T247 C32 oass.SolrIndexSearcher.getIndexDir WARNING WARNING: Directory impl does not support setting indexDir: org.apache.lucene.store.MockDirectoryWrapper
[junit4:junit4]   2> 1130 T247 C32 oasu.DirectUpdateHandler2.commit end_commit_flush
[junit4:junit4]   2> 1131 T254 oasc.SolrCore.registerSearcher [collection1] Registered new searcher Searcher@9710d main{StandardDirectoryReader(segments_2:4 _0(4.0):C7)}
[junit4:junit4]   2> 1131 T247 C32 UPDATE [collection1] webapp=/solr path=/update params={wt=javabin&version=2&softCommit=false&waitSearcher=true&commit=true} {commit=} 0 8
[junit4:junit4]   2> 1134 T257 C33 oasu.DirectUpdateHandler2.commit start commit{flags=0,version=0,optimize=false,openSearcher=true,waitSearcher=true,expungeDeletes=false,softCommit=false}
[junit4:junit4]   2> 1136 T257 C33 oasc.SolrDeletionPolicy.onCommit SolrDeletionPolicy.onCommit: commits:num=2
[junit4:junit4]   2> 		commit{dir=MockDirWrapper(org.apache.lucene.store.RAMDirectory@2d75018b lockFactory=org.apache.lucene.store.SingleInstanceLockFactory@4daca699),segFN=segments_1,generation=1,filenames=[segments_1]
[junit4:junit4]   2> 		commit{dir=MockDirWrapper(org.apache.lucene.store.RAMDirectory@2d75018b lockFactory=org.apache.lucene.store.SingleInstanceLockFactory@4daca699),segFN=segments_2,generation=2,filenames=[_0_MockVariableIntBlock_0.pos, _0.fdx, _0_MockVariableIntBlock_0.skp, _0_NestedPulsing_0.frq, _0_NestedPulsing_0.tim, _0_MockVariableIntBlock_0.frq, _0.si, segments_2, _0_MockVariableIntBlock_0.pyl, _0_MockVariableIntBlock_0.tii, _0_nrm.cfe, _0.fnm, _0_nrm.cfs, _0_NestedPulsing_0.prx, _0_MockVariableIntBlock_0.doc, _0_NestedPulsing_0.tip, _0.fdt, _0_MockVariableIntBlock_0.tib]
[junit4:junit4]   2> 1137 T257 C33 oasc.SolrDeletionPolicy.updateCommits newest commit = 2
[junit4:junit4]   2> 1138 T257 C33 oass.SolrIndexSearcher.<init> Opening Searcher@4c265a60 main
[junit4:junit4]   2> 1138 T257 C33 oass.SolrIndexSearcher.getIndexDir WARNING WARNING: Directory impl does not support setting indexDir: org.apache.lucene.store.MockDirectoryWrapper
[junit4:junit4]   2> 1138 T257 C33 oasu.DirectUpdateHandler2.commit end_commit_flush
[junit4:junit4]   2> 1139 T264 oasc.SolrCore.registerSearcher [collection1] Registered new searcher Searcher@4c265a60 main{StandardDirectoryReader(segments_2:4 _0(4.0):C2)}
[junit4:junit4]   2> 1139 T257 C33 UPDATE [collection1] webapp=/solr path=/update params={wt=javabin&version=2&softCommit=false&waitSearcher=true&commit=true} {commit=} 0 5
[junit4:junit4]   2> 1142 T267 C34 oasu.DirectUpdateHandler2.commit start commit{flags=0,version=0,optimize=false,openSearcher=true,waitSearcher=true,expungeDeletes=false,softCommit=false}
[junit4:junit4]   2> 1144 T267 C34 oasc.SolrDeletionPolicy.onCommit SolrDeletionPolicy.onCommit: commits:num=2
[junit4:junit4]   2> 		commit{dir=MockDirWrapper(org.apache.lucene.store.RAMDirectory@67ca951a lockFactory=org.apache.lucene.store.SingleInstanceLockFactory@6ce14a99),segFN=segments_1,generation=1,filenames=[segments_1]
[junit4:junit4]   2> 		commit{dir=MockDirWrapper(org.apache.lucene.store.RAMDirectory@67ca951a lockFactory=org.apache.lucene.store.SingleInstanceLockFactory@6ce14a99),segFN=segments_2,generation=2,filenames=[_0_MockVariableIntBlock_0.pos, _0.fdx, _0_MockVariableIntBlock_0.skp, _0_NestedPulsing_0.frq, _0_NestedPulsing_0.tim, _0_MockVariableIntBlock_0.frq, _0.si, segments_2, _0_MockVariableIntBlock_0.pyl, _0_MockVariableIntBlock_0.tii, _0_nrm.cfe, _0.fnm, _0_nrm.cfs, _0_NestedPulsing_0.prx, _0_MockVariableIntBlock_0.doc, _0_NestedPulsing_0.tip, _0.fdt, _0_MockVariableIntBlock_0.tib]
[junit4:junit4]   2> 1144 T267 C34 oasc.SolrDeletionPolicy.updateCommits newest commit = 2
[junit4:junit4]   2> 1146 T267 C34 oass.SolrIndexSearcher.<init> Opening Searcher@40cf5bbd main
[junit4:junit4]   2> 1146 T267 C34 oass.SolrIndexSearcher.getIndexDir WARNING WARNING: Directory impl does not support setting indexDir: org.apache.lucene.store.MockDirectoryWrapper
[junit4:junit4]   2> 1147 T274 oasc.SolrCore.registerSearcher [collection1] Registered new searcher Searcher@40cf5bbd main{StandardDirectoryReader(segments_2:4 _0(4.0):C2)}
[junit4:junit4]   2> 1147 T267 C34 oasu.DirectUpdateHandler2.commit end_commit_flush
[junit4:junit4]   2> 1147 T267 C34 UPDATE [collection1] webapp=/solr path=/update params={wt=javabin&version=2&softCommit=false&waitSearcher=true&commit=true} {commit=} 0 5
[junit4:junit4]   2> 1150 T277 C35 oasu.DirectUpdateHandler2.commit start commit{flags=0,version=0,optimize=false,openSearcher=true,waitSearcher=true,expungeDeletes=false,softCommit=false}
[junit4:junit4]   2> 1152 T277 C35 oasc.SolrDeletionPolicy.onCommit SolrDeletionPolicy.onCommit: commits:num=2
[junit4:junit4]   2> 		commit{dir=MockDirWrapper(org.apache.lucene.store.RAMDirectory@5b811aeb lockFactory=org.apache.lucene.store.SingleInstanceLockFactory@211ede94),segFN=segments_1,generation=1,filenames=[segments_1]
[junit4:junit4]   2> 		commit{dir=MockDirWrapper(org.apache.lucene.store.RAMDirectory@5b811aeb lockFactory=org.apache.lucene.store.SingleInstanceLockFactory@211ede94),segFN=segments_2,generation=2,filenames=[_0_MockVariableIntBlock_0.pos, _0.fdx, _0_MockVariableIntBlock_0.skp, _0_NestedPulsing_0.frq, _0_NestedPulsing_0.tim, _0_MockVariableIntBlock_0.frq, _0.si, segments_2, _0_MockVariableIntBlock_0.pyl, _0_MockVariableIntBlock_0.tii, _0_nrm.cfe, _0.fnm, _0_nrm.cfs, _0_NestedPulsing_0.prx, _0_MockVariableIntBlock_0.doc, _0_NestedPulsing_0.tip, _0.fdt, _0_MockVariableIntBlock_0.tib]
[junit4:junit4]   2> 1152 T277 C35 oasc.SolrDeletionPolicy.updateCommits newest commit = 2
[junit4:junit4]   2> 1154 T277 C35 oass.SolrIndexSearcher.<init> Opening Searcher@30631d9a main
[junit4:junit4]   2> 1154 T277 C35 oass.SolrIndexSearcher.getIndexDir WARNING WARNING: Directory impl does not support setting indexDir: org.apache.lucene.store.MockDirectoryWrapper
[junit4:junit4]   2> 1154 T277 C35 oasu.DirectUpdateHandler2.commit end_commit_flush
[junit4:junit4]   2> 1156 T284 oasc.SolrCore.registerSearcher [collection1] Registered new searcher Searcher@30631d9a main{StandardDirectoryReader(segments_2:4 _0(4.0):C3)}
[junit4:junit4]   2> 1157 T277 C35 UPDATE [collection1] webapp=/solr path=/update params={wt=javabin&version=2&softCommit=false&waitSearcher=true&commit=true} {commit=} 0 7
[junit4:junit4]   2> 1162 T247 C32 REQ [collection1] webapp=/solr path=/elevate params={shards.qt=/elevate&sort=id+desc&distrib=false&fl=id,+score,+[elevated]&q=*:*&rows=500&wt=javabin&version=2&qt=/elevate} hits=7 status=0 QTime=2 
[junit4:junit4]   2> 1196 T268 C34 REQ [collection1] webapp=/solr path=/elevate params={shards.qt=/elevate&distrib=false&shard.url=localhost:33600/solr&NOW=1341935965912&sort=id+desc&fl=id,score&rows=500&q=*:*&isShard=true&wt=javabin&version=2&start=0&qt=/elevate&fsv=true} hits=2 status=0 QTime=0 
[junit4:junit4]   2> 1196 T258 C33 REQ [collection1] webapp=/solr path=/elevate params={shards.qt=/elevate&distrib=false&shard.url=localhost:44447/solr|[::1]:33332/solr&NOW=1341935965912&sort=id+desc&fl=id,score&rows=500&q=*:*&isShard=true&wt=javabin&version=2&start=0&qt=/elevate&fsv=true} hits=2 status=0 QTime=0 
[junit4:junit4]   2> 1214 T278 C35 REQ [collection1] webapp=/solr path=/elevate params={shards.qt=/elevate&distrib=false&shard.url=localhost:40762/solr|[::1]:33332/solr&NOW=1341935965912&sort=id+desc&fl=id,score&rows=500&q=*:*&isShard=true&wt=javabin&version=2&start=0&qt=/elevate&fsv=true} hits=3 status=0 QTime=1 
[junit4:junit4]   2> 1222 T268 C34 REQ [collection1] webapp=/solr path=/elevate params={shards.qt=/elevate&ids=5.0,2.0&distrib=false&shard.url=localhost:33600/solr&NOW=1341935965912&fl=id,+score,+[elevated]&q=*:*&rows=500&isShard=true&wt=javabin&version=2&qt=/elevate} status=0 QTime=1 
[junit4:junit4]   2> 1222 T258 C33 REQ [collection1] webapp=/solr path=/elevate params={shards.qt=/elevate&ids=4.0,1.0&distrib=false&shard.url=localhost:44447/solr|[::1]:33332/solr&NOW=1341935965912&fl=id,+score,+[elevated]&q=*:*&rows=500&isShard=true&wt=javabin&version=2&qt=/elevate} status=0 QTime=1 
[junit4:junit4]   2> 1222 T278 C35 REQ [collection1] webapp=/solr path=/elevate params={shards.qt=/elevate&ids=6.0,7.0,3.0&distrib=false&shard.url=localhost:40762/solr|[::1]:33332/solr&NOW=1341935965912&fl=id,+score,+[elevated]&q=*:*&rows=500&isShard=true&wt=javabin&version=2&qt=/elevate} status=0 QTime=1 
[junit4:junit4]   2> 1223 T257 C33 REQ [collection1] webapp=/solr path=/elevate params={shards.qt=/elevate&sort=id+desc&fl=id,+score,+[elevated]&q=*:*&rows=500&wt=javabin&version=2&qt=/elevate&shards=localhost:44447/solr|[::1]:33332/solr,localhost:33600/solr,localhost:40762/solr|[::1]:33332/solr} status=0 QTime=57 
[junit4:junit4]   2> 1225 T244 oasc.CoreContainer.shutdown Shutting down CoreContainer instance=1172373094
[junit4:junit4]   2> 1226 T244 oasc.SolrCore.close [collection1]  CLOSING SolrCore org.apache.solr.core.SolrCore@40dcc542
[junit4:junit4]   2> 1226 T244 oasc.SolrCore.closeSearcher [collection1] Closing main searcher on request.
[junit4:junit4]   2> 1227 T244 oasu.DirectUpdateHandler2.close closing DirectUpdateHandler2{commits=1,autocommits=0,soft autocommits=0,optimizes=0,rollbacks=0,expungeDeletes=0,docsPending=0,adds=0,deletesById=0,deletesByQuery=0,errors=0,cumulative_adds=7,cumulative_deletesById=0,cumulative_deletesByQuery=1,cumulative_errors=0}
[junit4:junit4]   2> 1230 T244 oejsh.ContextHandler.doStop stopped o.e.j.s.ServletContextHandler{/solr,null}
[junit4:junit4]   2> 1284 T244 oasc.CoreContainer.shutdown Shutting down CoreContainer instance=1073665167
[junit4:junit4]   2> 1284 T244 oasc.SolrCore.close [collection1]  CLOSING SolrCore org.apache.solr.core.SolrCore@76d165d6
[junit4:junit4]   2> 1285 T244 oasc.SolrCore.closeSearcher [collection1] Closing main searcher on request.
[junit4:junit4]   2> 1286 T244 oasu.DirectUpdateHandler2.close closing DirectUpdateHandler2{commits=1,autocommits=0,soft autocommits=0,optimizes=0,rollbacks=0,expungeDeletes=0,docsPending=0,adds=0,deletesById=0,deletesByQuery=0,errors=0,cumulative_adds=2,cumulative_deletesById=0,cumulative_deletesByQuery=1,cumulative_errors=0}
[junit4:junit4]   2> 1290 T244 oejsh.ContextHandler.doStop stopped o.e.j.s.ServletContextHandler{/solr,null}
[junit4:junit4]   2> 1342 T244 oasc.CoreContainer.shutdown Shutting down CoreContainer instance=1488334446
[junit4:junit4]   2> 1342 T244 oasc.SolrCore.close [collection1]  CLOSING SolrCore org.apache.solr.core.SolrCore@23de8c43
[junit4:junit4]   2> 1343 T244 oasc.SolrCore.closeSearcher [collection1] Closing main searcher on request.
[junit4:junit4]   2> 1343 T244 oasu.DirectUpdateHandler2.close closing DirectUpdateHandler2{commits=1,autocommits=0,soft autocommits=0,optimizes=0,rollbacks=0,expungeDeletes=0,docsPending=0,adds=0,deletesById=0,deletesByQuery=0,errors=0,cumulative_adds=2,cumulative_deletesById=0,cumulative_deletesByQuery=1,cumulative_errors=0}
[junit4:junit4]   2> 1346 T244 oejsh.ContextHandler.doStop stopped o.e.j.s.ServletContextHandler{/solr,null}
[junit4:junit4]   2> 1398 T244 oasc.CoreContainer.shutdown Shutting down CoreContainer instance=1412608053
[junit4:junit4]   2> 1398 T244 oasc.SolrCore.close [collection1]  CLOSING SolrCore org.apache.solr.core.SolrCore@7154643d
[junit4:junit4]   2> 1399 T244 oasc.SolrCore.closeSearcher [collection1] Closing main searcher on request.
[junit4:junit4]   2> 1399 T244 oasu.DirectUpdateHandler2.close closing DirectUpdateHandler2{commits=1,autocommits=0,soft autocommits=0,optimizes=0,rollbacks=0,expungeDeletes=0,docsPending=0,adds=0,deletesById=0,deletesByQuery=0,errors=0,cumulative_adds=3,cumulative_deletesById=0,cumulative_deletesByQuery=1,cumulative_errors=0}
[junit4:junit4]   2> 1401 T244 oejsh.ContextHandler.doStop stopped o.e.j.s.ServletContextHandler{/solr,null}
[junit4:junit4]   2> 1453 T244 oas.SolrTestCaseJ4.tearDown ###Ending testDistribSearch
[junit4:junit4]   2> NOTE: reproduce with: ant test  -Dtestcase=DistributedQueryElevationComponentTest -Dtests.method=testDistribSearch -Dtests.seed=F4B13915C498CA56 -Dtests.multiplier=3 -Dtests.slow=true -Dtests.locale=ro_RO -Dtests.timezone=America/Kralendijk -Dtests.file.encoding=US-ASCII
[junit4:junit4]   2>
[junit4:junit4]    > (@AfterClass output)
[junit4:junit4]   2> 1535 T244 oas.SolrTestCaseJ4.deleteCore ###deleteCore
[junit4:junit4]   2> NOTE: test params are: codec=Lucene40: {field_t=MockVariableIntBlock(baseBlockSize=22), text=PostingsFormat(name=NestedPulsing), plow_t=PostingsFormat(name=NestedPulsing), id=MockVariableIntBlock(baseBlockSize=22), int_i=PostingsFormat(name=NestedPulsing)}, sim=RandomSimilarityProvider(queryNorm=true,coord=false): {}, locale=ro_RO, timezone=America/Kralendijk
[junit4:junit4]   2> NOTE: Linux 3.2.0-26-generic amd64/Oracle Corporation 1.8.0-ea (64-bit)/cpus=8,threads=1,free=99492904,total=265355264
[junit4:junit4]   2> NOTE: All tests run in this JVM: [TestIndexingPerformance, SpatialFilterTest, TestCapitalizationFilterFactory, TestHTMLStripCharFilterFactory, TestHashPartitioner, TestPortugueseMinimalStemFilterFactory, TestPatternTokenizerFactory, ZkNodePropsTest, DateFieldTest, FileUtilsTest, TestUpdate, TestSolrJ, PluginInfoTest, PingRequestHandlerTest, TestCJKWidthFilterFactory, OutputWriterTest, ConvertedLegacyTest, TestItalianLightStemFilterFactory, TermsComponentTest, TestGermanLightStemFilterFactory, TestStressRecovery, OpenExchangeRatesOrgProviderTest, BadComponentTest, TestBulgarianStemFilterFactory, SolrCoreCheckLockOnStartupTest, TestTrimFilterFactory, UpdateRequestProcessorFactoryTest, TestDelimitedPayloadTokenFilterFactory, TestThaiWordFilterFactory, TestFaceting, TestPropInject, QueryElevationComponentTest, SolrCmdDistributorTest, CoreAdminHandlerTest, TestChineseTokenizerFactory, SOLR749Test, TestBadConfig, BinaryUpdateRequestHandlerTest, IndexBasedSpellCheckerTest, TestArabicFilters, TestJapaneseBaseFormFilterFactory, StatsComponentTest, RequiredFieldsTest, TestSwedishLightStemFilterFactory, SuggesterWFSTTest, CommonGramsQueryFilterFactoryTest, DateMathParserTest, SimpleFacetsTest, HighlighterTest, TestIrishLowerCaseFilterFactory, TestStressVersions, AutoCommitTest, TestBM25SimilarityFactory, TestRemoveDuplicatesTokenFilterFactory, SolrIndexConfigTest, TestTypeTokenFilterFactory, DistributedQueryElevationComponentTest]
[junit4:junit4]   2> 
[junit4:junit4] Completed on J0 in 1.54s, 1 test, 1 error <<< FAILURES!

[...truncated 574 lines...]
BUILD FAILED
/mnt/ssd/jenkins/workspace/Lucene-Solr-4.x-Linux-Java8-64/checkout/build.xml:29: The following error occurred while executing this line:
/mnt/ssd/jenkins/workspace/Lucene-Solr-4.x-Linux-Java8-64/checkout/solr/build.xml:144: The following error occurred while executing this line:
/mnt/ssd/jenkins/workspace/Lucene-Solr-4.x-Linux-Java8-64/checkout/lucene/module-build.xml:62: The following error occurred while executing this line:
/mnt/ssd/jenkins/workspace/Lucene-Solr-4.x-Linux-Java8-64/checkout/lucene/common-build.xml:1095: The following error occurred while executing this line:
/mnt/ssd/jenkins/workspace/Lucene-Solr-4.x-Linux-Java8-64/checkout/lucene/common-build.xml:792: There were test failures: 299 suites, 1062 tests, 1 error, 5 ignored

Total time: 28 minutes 54 seconds
Build step 'Execute shell' marked build as failure
Archiving artifacts
Recording test results
Email was triggered for: Failure
Sending email for trigger: Failure




Mime
View raw message