lucene-dev mailing list archives

Site index · List index
Message view « Date » · « Thread »
Top « Date » · « Thread »
From Policeman Jenkins Server <jenk...@sd-datasolutions.de>
Subject [JENKINS] Lucene-Solr-4.x-Linux-Java8-64 - Build # 9 - Still Failing!
Date Wed, 11 Jul 2012 16:17:08 GMT
Build: http://jenkins.sd-datasolutions.de/job/Lucene-Solr-4.x-Linux-Java8-64/9/

2 tests failed.
REGRESSION:  org.apache.solr.handler.component.SpellCheckComponentTest.testPerDictionary

Error Message:
mismatch: '0'!='2' @ spellcheck/suggestions/bar/startOffset

Stack Trace:
java.lang.RuntimeException: mismatch: '0'!='2' @ spellcheck/suggestions/bar/startOffset
	at __randomizedtesting.SeedInfo.seed([AB68DD5CEEF63A4:CDB8797DC68376EC]:0)
	at org.apache.solr.SolrTestCaseJ4.assertJQ(SolrTestCaseJ4.java:573)
	at org.apache.solr.SolrTestCaseJ4.assertJQ(SolrTestCaseJ4.java:521)
	at org.apache.solr.handler.component.SpellCheckComponentTest.testPerDictionary(SpellCheckComponentTest.java:102)
	at sun.reflect.NativeMethodAccessorImpl.invoke0(Native Method)
	at sun.reflect.NativeMethodAccessorImpl.invoke(NativeMethodAccessorImpl.java:57)
	at sun.reflect.DelegatingMethodAccessorImpl.invoke(DelegatingMethodAccessorImpl.java:43)
	at java.lang.reflect.Method.invoke(Method.java:474)
	at com.carrotsearch.randomizedtesting.RandomizedRunner.invoke(RandomizedRunner.java:1995)
	at com.carrotsearch.randomizedtesting.RandomizedRunner.access$1100(RandomizedRunner.java:132)
	at com.carrotsearch.randomizedtesting.RandomizedRunner$6.evaluate(RandomizedRunner.java:818)
	at com.carrotsearch.randomizedtesting.RandomizedRunner$7.evaluate(RandomizedRunner.java:877)
	at com.carrotsearch.randomizedtesting.RandomizedRunner$8.evaluate(RandomizedRunner.java:891)
	at com.carrotsearch.randomizedtesting.rules.SystemPropertiesRestoreRule$1.evaluate(SystemPropertiesRestoreRule.java:53)
	at org.apache.lucene.util.TestRuleSetupTeardownChained$1.evaluate(TestRuleSetupTeardownChained.java:50)
	at org.apache.lucene.util.TestRuleFieldCacheSanity$1.evaluate(TestRuleFieldCacheSanity.java:32)
	at org.apache.lucene.util.AbstractBeforeAfterRule$1.evaluate(AbstractBeforeAfterRule.java:45)
	at com.carrotsearch.randomizedtesting.rules.SystemPropertiesInvariantRule$1.evaluate(SystemPropertiesInvariantRule.java:55)
	at org.apache.lucene.util.TestRuleReportUncaughtExceptions$1.evaluate(TestRuleReportUncaughtExceptions.java:68)
	at org.apache.lucene.util.TestRuleThreadAndTestName$1.evaluate(TestRuleThreadAndTestName.java:48)
	at org.apache.lucene.util.TestRuleIgnoreAfterMaxFailures$1.evaluate(TestRuleIgnoreAfterMaxFailures.java:70)
	at org.apache.lucene.util.TestRuleMarkFailure$1.evaluate(TestRuleMarkFailure.java:48)
	at com.carrotsearch.randomizedtesting.RandomizedRunner.runSingleTest(RandomizedRunner.java:825)
	at com.carrotsearch.randomizedtesting.RandomizedRunner.access$700(RandomizedRunner.java:132)
	at com.carrotsearch.randomizedtesting.RandomizedRunner$3$1.run(RandomizedRunner.java:671)
	at com.carrotsearch.randomizedtesting.RandomizedRunner$3.evaluate(RandomizedRunner.java:697)
	at com.carrotsearch.randomizedtesting.RandomizedRunner$4.evaluate(RandomizedRunner.java:736)
	at com.carrotsearch.randomizedtesting.RandomizedRunner$5.evaluate(RandomizedRunner.java:747)
	at com.carrotsearch.randomizedtesting.rules.SystemPropertiesRestoreRule$1.evaluate(SystemPropertiesRestoreRule.java:53)
	at org.apache.lucene.util.AbstractBeforeAfterRule$1.evaluate(AbstractBeforeAfterRule.java:45)
	at org.apache.lucene.util.TestRuleReportUncaughtExceptions$1.evaluate(TestRuleReportUncaughtExceptions.java:68)
	at org.apache.lucene.util.TestRuleStoreClassName$1.evaluate(TestRuleStoreClassName.java:38)
	at org.apache.lucene.util.TestRuleIcuHack$1.evaluate(TestRuleIcuHack.java:51)
	at com.carrotsearch.randomizedtesting.rules.SystemPropertiesInvariantRule$1.evaluate(SystemPropertiesInvariantRule.java:55)
	at org.apache.lucene.util.TestRuleNoInstanceHooksOverrides$1.evaluate(TestRuleNoInstanceHooksOverrides.java:53)
	at org.apache.lucene.util.TestRuleNoStaticHooksShadowing$1.evaluate(TestRuleNoStaticHooksShadowing.java:52)
	at org.apache.lucene.util.TestRuleAssertionsRequired$1.evaluate(TestRuleAssertionsRequired.java:36)
	at org.apache.lucene.util.TestRuleMarkFailure$1.evaluate(TestRuleMarkFailure.java:48)
	at org.apache.lucene.util.TestRuleIgnoreAfterMaxFailures$1.evaluate(TestRuleIgnoreAfterMaxFailures.java:70)
	at org.apache.lucene.util.TestRuleIgnoreTestSuites$1.evaluate(TestRuleIgnoreTestSuites.java:55)
	at com.carrotsearch.randomizedtesting.RandomizedRunner.runSuite(RandomizedRunner.java:605)
	at com.carrotsearch.randomizedtesting.RandomizedRunner.access$400(RandomizedRunner.java:132)
	at com.carrotsearch.randomizedtesting.RandomizedRunner$2.run(RandomizedRunner.java:551)


FAILED:  org.apache.solr.handler.component.DistributedQueryElevationComponentTest.testDistribSearch

Error Message:
Index: 18, Size: 18

Stack Trace:
java.lang.IndexOutOfBoundsException: Index: 18, Size: 18
	at __randomizedtesting.SeedInfo.seed([AB68DD5CEEF63A4:8B5003CDB9B00398]:0)
	at java.util.ArrayList.rangeCheck(ArrayList.java:603)
	at java.util.ArrayList.get(ArrayList.java:381)
	at org.apache.solr.common.util.NamedList.getName(NamedList.java:127)
	at org.apache.solr.BaseDistributedSearchTestCase.compare(BaseDistributedSearchTestCase.java:466)
	at org.apache.solr.BaseDistributedSearchTestCase.compare(BaseDistributedSearchTestCase.java:612)
	at org.apache.solr.BaseDistributedSearchTestCase.compare(BaseDistributedSearchTestCase.java:500)
	at org.apache.solr.BaseDistributedSearchTestCase.compare(BaseDistributedSearchTestCase.java:612)
	at org.apache.solr.BaseDistributedSearchTestCase.compare(BaseDistributedSearchTestCase.java:500)
	at org.apache.solr.BaseDistributedSearchTestCase.compareResponses(BaseDistributedSearchTestCase.java:667)
	at org.apache.solr.BaseDistributedSearchTestCase.query(BaseDistributedSearchTestCase.java:392)
	at org.apache.solr.handler.component.DistributedQueryElevationComponentTest.doTest(DistributedQueryElevationComponentTest.java:81)
	at org.apache.solr.BaseDistributedSearchTestCase.testDistribSearch(BaseDistributedSearchTestCase.java:679)
	at sun.reflect.NativeMethodAccessorImpl.invoke0(Native Method)
	at sun.reflect.NativeMethodAccessorImpl.invoke(NativeMethodAccessorImpl.java:57)
	at sun.reflect.DelegatingMethodAccessorImpl.invoke(DelegatingMethodAccessorImpl.java:43)
	at java.lang.reflect.Method.invoke(Method.java:474)
	at com.carrotsearch.randomizedtesting.RandomizedRunner.invoke(RandomizedRunner.java:1995)
	at com.carrotsearch.randomizedtesting.RandomizedRunner.access$1100(RandomizedRunner.java:132)
	at com.carrotsearch.randomizedtesting.RandomizedRunner$6.evaluate(RandomizedRunner.java:818)
	at com.carrotsearch.randomizedtesting.RandomizedRunner$7.evaluate(RandomizedRunner.java:877)
	at com.carrotsearch.randomizedtesting.RandomizedRunner$8.evaluate(RandomizedRunner.java:891)
	at com.carrotsearch.randomizedtesting.rules.SystemPropertiesRestoreRule$1.evaluate(SystemPropertiesRestoreRule.java:53)
	at org.apache.lucene.util.TestRuleSetupTeardownChained$1.evaluate(TestRuleSetupTeardownChained.java:50)
	at org.apache.lucene.util.TestRuleFieldCacheSanity$1.evaluate(TestRuleFieldCacheSanity.java:32)
	at org.apache.lucene.util.AbstractBeforeAfterRule$1.evaluate(AbstractBeforeAfterRule.java:45)
	at com.carrotsearch.randomizedtesting.rules.SystemPropertiesInvariantRule$1.evaluate(SystemPropertiesInvariantRule.java:55)
	at org.apache.lucene.util.TestRuleReportUncaughtExceptions$1.evaluate(TestRuleReportUncaughtExceptions.java:68)
	at org.apache.lucene.util.TestRuleThreadAndTestName$1.evaluate(TestRuleThreadAndTestName.java:48)
	at org.apache.lucene.util.TestRuleIgnoreAfterMaxFailures$1.evaluate(TestRuleIgnoreAfterMaxFailures.java:70)
	at org.apache.lucene.util.TestRuleMarkFailure$1.evaluate(TestRuleMarkFailure.java:48)
	at com.carrotsearch.randomizedtesting.RandomizedRunner.runSingleTest(RandomizedRunner.java:825)
	at com.carrotsearch.randomizedtesting.RandomizedRunner.access$700(RandomizedRunner.java:132)
	at com.carrotsearch.randomizedtesting.RandomizedRunner$3$1.run(RandomizedRunner.java:671)
	at com.carrotsearch.randomizedtesting.RandomizedRunner$3.evaluate(RandomizedRunner.java:697)
	at com.carrotsearch.randomizedtesting.RandomizedRunner$4.evaluate(RandomizedRunner.java:736)
	at com.carrotsearch.randomizedtesting.RandomizedRunner$5.evaluate(RandomizedRunner.java:747)
	at com.carrotsearch.randomizedtesting.rules.SystemPropertiesRestoreRule$1.evaluate(SystemPropertiesRestoreRule.java:53)
	at org.apache.lucene.util.AbstractBeforeAfterRule$1.evaluate(AbstractBeforeAfterRule.java:45)
	at org.apache.lucene.util.TestRuleReportUncaughtExceptions$1.evaluate(TestRuleReportUncaughtExceptions.java:68)
	at org.apache.lucene.util.TestRuleStoreClassName$1.evaluate(TestRuleStoreClassName.java:38)
	at org.apache.lucene.util.TestRuleIcuHack$1.evaluate(TestRuleIcuHack.java:51)
	at com.carrotsearch.randomizedtesting.rules.SystemPropertiesInvariantRule$1.evaluate(SystemPropertiesInvariantRule.java:55)
	at org.apache.lucene.util.TestRuleNoInstanceHooksOverrides$1.evaluate(TestRuleNoInstanceHooksOverrides.java:53)
	at org.apache.lucene.util.TestRuleNoStaticHooksShadowing$1.evaluate(TestRuleNoStaticHooksShadowing.java:52)
	at org.apache.lucene.util.TestRuleAssertionsRequired$1.evaluate(TestRuleAssertionsRequired.java:36)
	at org.apache.lucene.util.TestRuleMarkFailure$1.evaluate(TestRuleMarkFailure.java:48)
	at org.apache.lucene.util.TestRuleIgnoreAfterMaxFailures$1.evaluate(TestRuleIgnoreAfterMaxFailures.java:70)
	at org.apache.lucene.util.TestRuleIgnoreTestSuites$1.evaluate(TestRuleIgnoreTestSuites.java:55)
	at com.carrotsearch.randomizedtesting.RandomizedRunner.runSuite(RandomizedRunner.java:605)
	at com.carrotsearch.randomizedtesting.RandomizedRunner.access$400(RandomizedRunner.java:132)
	at com.carrotsearch.randomizedtesting.RandomizedRunner$2.run(RandomizedRunner.java:551)




Build Log:
[...truncated 10907 lines...]
[junit4:junit4] Suite: org.apache.solr.handler.component.SpellCheckComponentTest
[junit4:junit4]    > (@BeforeClass output)
[junit4:junit4]   2> 0 T1185 oas.SolrTestCaseJ4.initCore ####initCore
[junit4:junit4]   2> Creating dataDir: /mnt/ssd/jenkins/workspace/Lucene-Solr-4.x-Linux-Java8-64/checkout/solr/build/solr-core/test/J1/./solrtest-SpellCheckComponentTest-1342022915189
[junit4:junit4]   2> 0 T1185 oasc.SolrResourceLoader.<init> new SolrResourceLoader for directory: '/mnt/ssd/jenkins/workspace/Lucene-Solr-4.x-Linux-Java8-64/checkout/solr/build/solr-core/test-files/solr/collection1/'
[junit4:junit4]   2> 1 T1185 oasc.SolrResourceLoader.replaceClassLoader Adding 'file:/mnt/ssd/jenkins/workspace/Lucene-Solr-4.x-Linux-Java8-64/checkout/solr/build/solr-core/test-files/solr/collection1/lib/README' to classloader
[junit4:junit4]   2> 1 T1185 oasc.SolrResourceLoader.replaceClassLoader Adding 'file:/mnt/ssd/jenkins/workspace/Lucene-Solr-4.x-Linux-Java8-64/checkout/solr/build/solr-core/test-files/solr/collection1/lib/classes/' to classloader
[junit4:junit4]   2> 18 T1185 oasc.SolrConfig.<init> Using Lucene MatchVersion: LUCENE_40
[junit4:junit4]   2> 20 T1051 oascc.ZkStateReader$3.process WARNING ZooKeeper watch triggered, but Solr cannot talk to ZK
[junit4:junit4]   2> 20 T1051 oaz.ClientCnxn$EventThread.run EventThread shut down
[junit4:junit4]   2> 44 T1185 oasc.SolrConfig.<init> Loaded SolrConfig: solrconfig-spellcheckcomponent.xml
[junit4:junit4]   2> 45 T1185 oass.IndexSchema.readSchema Reading Solr Schema
[junit4:junit4]   2> 47 T1185 oass.IndexSchema.readSchema Schema name=test
[junit4:junit4]   2> 307 T1185 oass.OpenExchangeRatesOrgProvider.init Initialized with rates=open-exchange-rates.json, refreshInterval=1440.
[junit4:junit4]   2> 311 T1185 oass.IndexSchema.readSchema default search field in schema is text
[junit4:junit4]   2> 313 T1185 oass.IndexSchema.readSchema unique key field: id
[junit4:junit4]   2> 315 T1185 oass.FileExchangeRateProvider.reload Reloading exchange rates from file currency.xml
[junit4:junit4]   2> 317 T1185 oass.FileExchangeRateProvider.reload Reloading exchange rates from file currency.xml
[junit4:junit4]   2> 318 T1185 oass.OpenExchangeRatesOrgProvider.reload Reloading exchange rates from open-exchange-rates.json
[junit4:junit4]   2> 319 T1185 oass.OpenExchangeRatesOrgProvider.reload Reloading exchange rates from open-exchange-rates.json
[junit4:junit4]   2> 319 T1185 oasc.SolrResourceLoader.locateSolrHome JNDI not configured for solr (NoInitialContextEx)
[junit4:junit4]   2> 319 T1185 oasc.SolrResourceLoader.locateSolrHome using system property solr.solr.home: /mnt/ssd/jenkins/workspace/Lucene-Solr-4.x-Linux-Java8-64/checkout/solr/build/solr-core/test-files/solr
[junit4:junit4]   2> 319 T1185 oasc.SolrResourceLoader.<init> new SolrResourceLoader for directory: '/mnt/ssd/jenkins/workspace/Lucene-Solr-4.x-Linux-Java8-64/checkout/solr/build/solr-core/test-files/solr/'
[junit4:junit4]   2> 319 T1185 oasc.CoreContainer.<init> New CoreContainer 49428605
[junit4:junit4]   2> 319 T1185 oasc.SolrCore.<init> [collection1] Opening new SolrCore at /mnt/ssd/jenkins/workspace/Lucene-Solr-4.x-Linux-Java8-64/checkout/solr/build/solr-core/test-files/solr/collection1/, dataDir=/mnt/ssd/jenkins/workspace/Lucene-Solr-4.x-Linux-Java8-64/checkout/solr/build/solr-core/test/J1/./solrtest-SpellCheckComponentTest-1342022915189/
[junit4:junit4]   2> 320 T1185 oasc.SolrCore.<init> JMX monitoring not detected for core: collection1
[junit4:junit4]   2> 320 T1185 oasc.SolrCore.getNewIndexDir WARNING New index directory detected: old=null new=/mnt/ssd/jenkins/workspace/Lucene-Solr-4.x-Linux-Java8-64/checkout/solr/build/solr-core/test/J1/./solrtest-SpellCheckComponentTest-1342022915189/index/
[junit4:junit4]   2> 320 T1185 oasc.SolrCore.initIndex WARNING [collection1] Solr index directory '/mnt/ssd/jenkins/workspace/Lucene-Solr-4.x-Linux-Java8-64/checkout/solr/build/solr-core/test/J1/./solrtest-SpellCheckComponentTest-1342022915189/index' doesn't exist. Creating new index...
[junit4:junit4]   2> 321 T1185 oasc.SolrDeletionPolicy.onCommit SolrDeletionPolicy.onCommit: commits:num=1
[junit4:junit4]   2> 		commit{dir=MockDirWrapper(NRTCachingDirectory(org.apache.lucene.store.RAMDirectory@6c5a980d lockFactory=org.apache.lucene.store.NativeFSLockFactory@2ae0dd6f; maxCacheMB=0.021484375 maxMergeSizeMB=0.09375)),segFN=segments_1,generation=1,filenames=[segments_1]
[junit4:junit4]   2> 321 T1185 oasc.SolrDeletionPolicy.updateCommits newest commit = 1
[junit4:junit4]   2> 322 T1185 oasc.RequestHandlers.initHandlersFromConfig created standard: solr.StandardRequestHandler
[junit4:junit4]   2> 322 T1185 oasc.RequestHandlers.initHandlersFromConfig created spellCheckCompRH: org.apache.solr.handler.component.SearchHandler
[junit4:junit4]   2> 322 T1185 oasc.RequestHandlers.initHandlersFromConfig created spellCheckCompRH1: org.apache.solr.handler.component.SearchHandler
[junit4:junit4]   2> 322 T1185 oasc.RequestHandlers.initHandlersFromConfig created spellCheckWithWordbreak: org.apache.solr.handler.component.SearchHandler
[junit4:junit4]   2> 324 T1185 oass.SolrIndexSearcher.<init> Opening Searcher@4d7f4bab main
[junit4:junit4]   2> 324 T1185 oass.SolrIndexSearcher.getIndexDir WARNING WARNING: Directory impl does not support setting indexDir: org.apache.lucene.store.MockDirectoryWrapper
[junit4:junit4]   2> 324 T1185 oasu.CommitTracker.<init> Hard AutoCommit: disabled
[junit4:junit4]   2> 324 T1185 oasu.CommitTracker.<init> Soft AutoCommit: disabled
[junit4:junit4]   2> 324 T1185 oashc.SpellCheckComponent.inform Initializing spell checkers
[junit4:junit4]   2> 327 T1185 oashc.SpellCheckComponent.inform Registering newSearcher listener for spellchecker: default
[junit4:junit4]   2> 329 T1185 oashc.SpellCheckComponent.inform Registering newSearcher listener for spellchecker: default_teststop
[junit4:junit4]   2> 329 T1185 oass.DirectSolrSpellChecker.init init: {name=direct,classname=solr.DirectSolrSpellChecker,minQueryLength=3,maxQueryFrequency=100.0,field=teststop}
[junit4:junit4]   2> 329 T1185 oass.DirectSolrSpellChecker.init init: {name=direct_lowerfilt,classname=solr.DirectSolrSpellChecker,minQueryLength=3,maxQueryFrequency=100.0,field=lowerfilt}
[junit4:junit4]   2> 331 T1185 oashc.SpellCheckComponent.inform Registering newSearcher listener for spellchecker: threshold
[junit4:junit4]   2> 331 T1185 oass.DirectSolrSpellChecker.init init: {name=threshold_direct,classname=solr.DirectSolrSpellChecker,field=lowerfilt,spellcheckIndexDir=spellcheckerThreshold,buildOnCommit=true,thresholdTokenFrequency=0.29}
[junit4:junit4]   2> 332 T1185 oashc.SpellCheckComponent.inform Registering newSearcher listener for spellchecker: threshold_direct
[junit4:junit4]   2> 334 T1185 oashc.SpellCheckComponent.inform Registering newSearcher listener for spellchecker: multipleFields
[junit4:junit4]   2> 340 T1185 oashc.SpellCheckComponent.inform Registering newSearcher listener for spellchecker: freq
[junit4:junit4]   2> 342 T1185 oashc.SpellCheckComponent.inform Registering newSearcher listener for spellchecker: fqcn
[junit4:junit4]   2> 342 T1185 oashc.HttpShardHandlerFactory.getParameter Setting socketTimeout to: 0
[junit4:junit4]   2> 342 T1185 oashc.HttpShardHandlerFactory.getParameter Setting urlScheme to: http://
[junit4:junit4]   2> 343 T1185 oashc.HttpShardHandlerFactory.getParameter Setting connTimeout to: 0
[junit4:junit4]   2> 343 T1185 oashc.HttpShardHandlerFactory.getParameter Setting maxConnectionsPerHost to: 20
[junit4:junit4]   2> 343 T1185 oashc.HttpShardHandlerFactory.getParameter Setting corePoolSize to: 0
[junit4:junit4]   2> 343 T1185 oashc.HttpShardHandlerFactory.getParameter Setting maximumPoolSize to: 2147483647
[junit4:junit4]   2> 343 T1185 oashc.HttpShardHandlerFactory.getParameter Setting maxThreadIdleTime to: 5
[junit4:junit4]   2> 343 T1185 oashc.HttpShardHandlerFactory.getParameter Setting sizeOfQueue to: -1
[junit4:junit4]   2> 343 T1185 oashc.HttpShardHandlerFactory.getParameter Setting fairnessPolicy to: false
[junit4:junit4]   2> 343 T1185 oascsi.HttpClientUtil.createClient Creating new http client, config:maxConnectionsPerHost=20&maxConnections=10000&socketTimeout=0&connTimeout=0&retry=false
[junit4:junit4]   2> 345 T1186 oasc.SolrCore.registerSearcher [collection1] Registered new searcher Searcher@4d7f4bab main{StandardDirectoryReader(segments_1:1)}
[junit4:junit4]   2> 345 T1185 oasc.CoreContainer.register registering core: collection1
[junit4:junit4]   2> 345 T1185 oas.SolrTestCaseJ4.initCore ####initCore end
[junit4:junit4]   2> 
[junit4:junit4] ERROR   0.48s J1 | SpellCheckComponentTest.testPerDictionary
[junit4:junit4]    > Throwable #1: java.lang.RuntimeException: mismatch: '0'!='2' @ spellcheck/suggestions/bar/startOffset
[junit4:junit4]    > 	at __randomizedtesting.SeedInfo.seed([AB68DD5CEEF63A4:CDB8797DC68376EC]:0)
[junit4:junit4]    > 	at org.apache.solr.SolrTestCaseJ4.assertJQ(SolrTestCaseJ4.java:573)
[junit4:junit4]    > 	at org.apache.solr.SolrTestCaseJ4.assertJQ(SolrTestCaseJ4.java:521)
[junit4:junit4]    > 	at org.apache.solr.handler.component.SpellCheckComponentTest.testPerDictionary(SpellCheckComponentTest.java:102)
[junit4:junit4]    > 	at sun.reflect.NativeMethodAccessorImpl.invoke0(Native Method)
[junit4:junit4]    > 	at sun.reflect.NativeMethodAccessorImpl.invoke(NativeMethodAccessorImpl.java:57)
[junit4:junit4]    > 	at sun.reflect.DelegatingMethodAccessorImpl.invoke(DelegatingMethodAccessorImpl.java:43)
[junit4:junit4]    > 	at java.lang.reflect.Method.invoke(Method.java:474)
[junit4:junit4]    > 	at com.carrotsearch.randomizedtesting.RandomizedRunner.invoke(RandomizedRunner.java:1995)
[junit4:junit4]    > 	at com.carrotsearch.randomizedtesting.RandomizedRunner.access$1100(RandomizedRunner.java:132)
[junit4:junit4]    > 	at com.carrotsearch.randomizedtesting.RandomizedRunner$6.evaluate(RandomizedRunner.java:818)
[junit4:junit4]    > 	at com.carrotsearch.randomizedtesting.RandomizedRunner$7.evaluate(RandomizedRunner.java:877)
[junit4:junit4]    > 	at com.carrotsearch.randomizedtesting.RandomizedRunner$8.evaluate(RandomizedRunner.java:891)
[junit4:junit4]    > 	at com.carrotsearch.randomizedtesting.rules.SystemPropertiesRestoreRule$1.evaluate(SystemPropertiesRestoreRule.java:53)
[junit4:junit4]    > 	at org.apache.lucene.util.TestRuleSetupTeardownChained$1.evaluate(TestRuleSetupTeardownChained.java:50)
[junit4:junit4]    > 	at org.apache.lucene.util.TestRuleFieldCacheSanity$1.evaluate(TestRuleFieldCacheSanity.java:32)
[junit4:junit4]    > 	at org.apache.lucene.util.AbstractBeforeAfterRule$1.evaluate(AbstractBeforeAfterRule.java:45)
[junit4:junit4]    > 	at com.carrotsearch.randomizedtesting.rules.SystemPropertiesInvariantRule$1.evaluate(SystemPropertiesInvariantRule.java:55)
[junit4:junit4]    > 	at org.apache.lucene.util.TestRuleReportUncaughtExceptions$1.evaluate(TestRuleReportUncaughtExceptions.java:68)
[junit4:junit4]    > 	at org.apache.lucene.util.TestRuleThreadAndTestName$1.evaluate(TestRuleThreadAndTestName.java:48)
[junit4:junit4]    > 	at org.apache.lucene.util.TestRuleIgnoreAfterMaxFailures$1.evaluate(TestRuleIgnoreAfterMaxFailures.java:70)
[junit4:junit4]    > 	at org.apache.lucene.util.TestRuleMarkFailure$1.evaluate(TestRuleMarkFailure.java:48)
[junit4:junit4]    > 	at com.carrotsearch.randomizedtesting.RandomizedRunner.runSingleTest(RandomizedRunner.java:825)
[junit4:junit4]    > 	at com.carrotsearch.randomizedtesting.RandomizedRunner.access$700(RandomizedRunner.java:132)
[junit4:junit4]    > 	at com.carrotsearch.randomizedtesting.RandomizedRunner$3$1.run(RandomizedRunner.java:671)
[junit4:junit4]    > 	at com.carrotsearch.randomizedtesting.RandomizedRunner$3.evaluate(RandomizedRunner.java:697)
[junit4:junit4]    > 	at com.carrotsearch.randomizedtesting.RandomizedRunner$4.evaluate(RandomizedRunner.java:736)
[junit4:junit4]    > 	at com.carrotsearch.randomizedtesting.RandomizedRunner$5.evaluate(RandomizedRunner.java:747)
[junit4:junit4]    > 	at com.carrotsearch.randomizedtesting.rules.SystemPropertiesRestoreRule$1.evaluate(SystemPropertiesRestoreRule.java:53)
[junit4:junit4]    > 	at org.apache.lucene.util.AbstractBeforeAfterRule$1.evaluate(AbstractBeforeAfterRule.java:45)
[junit4:junit4]    > 	at org.apache.lucene.util.TestRuleReportUncaughtExceptions$1.evaluate(TestRuleReportUncaughtExceptions.java:68)
[junit4:junit4]    > 	at org.apache.lucene.util.TestRuleStoreClassName$1.evaluate(TestRuleStoreClassName.java:38)
[junit4:junit4]    > 	at org.apache.lucene.util.TestRuleIcuHack$1.evaluate(TestRuleIcuHack.java:51)
[junit4:junit4]    > 	at com.carrotsearch.randomizedtesting.rules.SystemPropertiesInvariantRule$1.evaluate(SystemPropertiesInvariantRule.java:55)
[junit4:junit4]    > 	at org.apache.lucene.util.TestRuleNoInstanceHooksOverrides$1.evaluate(TestRuleNoInstanceHooksOverrides.java:53)
[junit4:junit4]    > 	at org.apache.lucene.util.TestRuleNoStaticHooksShadowing$1.evaluate(TestRuleNoStaticHooksShadowing.java:52)
[junit4:junit4]    > 	at org.apache.lucene.util.TestRuleAssertionsRequired$1.evaluate(TestRuleAssertionsRequired.java:36)
[junit4:junit4]    > 	at org.apache.lucene.util.TestRuleMarkFailure$1.evaluate(TestRuleMarkFailure.java:48)
[junit4:junit4]    > 	at org.apache.lucene.util.TestRuleIgnoreAfterMaxFailures$1.evaluate(TestRuleIgnoreAfterMaxFailures.java:70)
[junit4:junit4]    > 	at org.apache.lucene.util.TestRuleIgnoreTestSuites$1.evaluate(TestRuleIgnoreTestSuites.java:55)
[junit4:junit4]    > 	at com.carrotsearch.randomizedtesting.RandomizedRunner.runSuite(RandomizedRunner.java:605)
[junit4:junit4]    > 	at com.carrotsearch.randomizedtesting.RandomizedRunner.access$400(RandomizedRunner.java:132)
[junit4:junit4]    > 	at com.carrotsearch.randomizedtesting.RandomizedRunner$2.run(RandomizedRunner.java:551)
[junit4:junit4]    > 
[junit4:junit4]   2> 2408 T1185 oas.SolrTestCaseJ4.setUp ###Starting testPerDictionary
[junit4:junit4]   2> 2411 T1185 C46 UPDATE [collection1] webapp=null path=null params={} {add=[0]} 0 1
[junit4:junit4]   2> 2415 T1185 C46 UPDATE [collection1] webapp=null path=null params={} {add=[1]} 0 2
[junit4:junit4]   2> 2418 T1185 C46 UPDATE [collection1] webapp=null path=null params={} {add=[2]} 0 1
[junit4:junit4]   2> 2420 T1185 C46 UPDATE [collection1] webapp=null path=null params={} {add=[3]} 0 0
[junit4:junit4]   2> 2423 T1185 C46 UPDATE [collection1] webapp=null path=null params={} {add=[4]} 0 0
[junit4:junit4]   2> 2426 T1185 C46 UPDATE [collection1] webapp=null path=null params={} {add=[5]} 0 0
[junit4:junit4]   2> 2429 T1185 C46 UPDATE [collection1] webapp=null path=null params={} {add=[6]} 0 0
[junit4:junit4]   2> 2431 T1185 C46 UPDATE [collection1] webapp=null path=null params={} {add=[7]} 0 0
[junit4:junit4]   2> 2434 T1185 C46 UPDATE [collection1] webapp=null path=null params={} {add=[8]} 0 0
[junit4:junit4]   2> 2437 T1185 C46 UPDATE [collection1] webapp=null path=null params={} {add=[9]} 0 0
[junit4:junit4]   2> 2439 T1185 C46 oasu.DirectUpdateHandler2.commit start commit{flags=0,version=0,optimize=false,openSearcher=true,waitSearcher=true,expungeDeletes=false,softCommit=false}
[junit4:junit4]   2> 2441 T1185 C46 oasc.SolrDeletionPolicy.onCommit SolrDeletionPolicy.onCommit: commits:num=2
[junit4:junit4]   2> 		commit{dir=MockDirWrapper(NRTCachingDirectory(org.apache.lucene.store.RAMDirectory@6c5a980d lockFactory=org.apache.lucene.store.NativeFSLockFactory@2ae0dd6f; maxCacheMB=0.021484375 maxMergeSizeMB=0.09375)),segFN=segments_a,generation=10,filenames=[segments_a]
[junit4:junit4]   2> 		commit{dir=MockDirWrapper(NRTCachingDirectory(org.apache.lucene.store.RAMDirectory@6c5a980d lockFactory=org.apache.lucene.store.NativeFSLockFactory@2ae0dd6f; maxCacheMB=0.021484375 maxMergeSizeMB=0.09375)),segFN=segments_b,generation=11,filenames=[_5.si, _5_Pulsing40_0.tip, _5_Lucene40_0.tip, _5_Pulsing40_1.frq, _5_Lucene40_0.tim, _5_Pulsing40_1.prx, segments_b, _5_nrm.cfe, _5_Pulsing40_1.tip, _5_nrm.cfs, _5.fnm, _5_Lucene40_0.prx, _5_Pulsing40_0.tim, _5_Pulsing40_0.frq, _5_Pulsing40_1.tim, _5_Pulsing40_0.prx, _5_Lucene40_0.frq, _5.fdx, _5.fdt]
[junit4:junit4]   2> 2441 T1185 C46 oasc.SolrDeletionPolicy.updateCommits newest commit = 11
[junit4:junit4]   2> 2442 T1185 C46 oass.SolrIndexSearcher.<init> Opening Searcher@43c0a333 main
[junit4:junit4]   2> 2443 T1185 C46 oass.SolrIndexSearcher.getIndexDir WARNING WARNING: Directory impl does not support setting indexDir: org.apache.lucene.store.MockDirectoryWrapper
[junit4:junit4]   2> 2443 T1186 oashc.SpellCheckComponent$SpellCheckerListener.buildSpellIndex Building spell index for spell checker: default
[junit4:junit4]   2> 2443 T1185 C46 oasu.DirectUpdateHandler2.commit end_commit_flush
[junit4:junit4]   2> 2477 T1186 oashc.SpellCheckComponent$SpellCheckerListener.buildSpellIndex Building spell index for spell checker: default_teststop
[junit4:junit4]   2> 2498 T1186 oashc.SpellCheckComponent$SpellCheckerListener.buildSpellIndex Building spell index for spell checker: threshold
[junit4:junit4]   2> 2538 T1186 oashc.SpellCheckComponent$SpellCheckerListener.buildSpellIndex Building spell index for spell checker: threshold_direct
[junit4:junit4]   2> 2538 T1186 oashc.SpellCheckComponent$SpellCheckerListener.buildSpellIndex Building spell index for spell checker: multipleFields
[junit4:junit4]   2> 2577 T1186 oashc.SpellCheckComponent$SpellCheckerListener.buildSpellIndex Building spell index for spell checker: freq
[junit4:junit4]   2> 2617 T1186 oashc.SpellCheckComponent$SpellCheckerListener.buildSpellIndex Building spell index for spell checker: fqcn
[junit4:junit4]   2> 2658 T1186 oasc.SolrCore.registerSearcher [collection1] Registered new searcher Searcher@43c0a333 main{StandardDirectoryReader(segments_b:17 _5(4.0):C10)}
[junit4:junit4]   2> 2658 T1185 C46 UPDATE [collection1] webapp=null path=null params={} {commit=} 0 219
[junit4:junit4]   2> 2660 T1185 C46 REQ [collection1] webapp=null path=null params={spellcheck..perDict.foo=bar&spellcheck.build=true&spellcheck=true&spellcheck.dictionary=perDict&q=documemt&spellcheck..perDict.bar=foo&qt=spellCheckCompRH&json.nl=map} hits=0 status=0 QTime=0 
[junit4:junit4]   2> 2661 T1185 oas.SolrTestCaseJ4.assertJQ SEVERE query failed JSON validation. error=mismatch: '0'!='2' @ spellcheck/suggestions/bar/startOffset
[junit4:junit4]   2> 	 expected =/spellcheck/suggestions/bar=={"numFound":1, "startOffset":0, "endOffset":1, "suggestion":["foo"]}
[junit4:junit4]   2> 	 response = {
[junit4:junit4]   2> 	  "responseHeader":{
[junit4:junit4]   2> 	    "status":0,
[junit4:junit4]   2> 	    "QTime":0},
[junit4:junit4]   2> 	  "command":"build",
[junit4:junit4]   2> 	  "response":{"numFound":0,"start":0,"docs":[]
[junit4:junit4]   2> 	  },
[junit4:junit4]   2> 	  "spellcheck":{
[junit4:junit4]   2> 	    "suggestions":{
[junit4:junit4]   2> 	      "foo":{
[junit4:junit4]   2> 	        "numFound":1,
[junit4:junit4]   2> 	        "startOffset":0,
[junit4:junit4]   2> 	        "endOffset":1,
[junit4:junit4]   2> 	        "suggestion":["bar"]},
[junit4:junit4]   2> 	      "bar":{
[junit4:junit4]   2> 	        "numFound":1,
[junit4:junit4]   2> 	        "startOffset":2,
[junit4:junit4]   2> 	        "endOffset":3,
[junit4:junit4]   2> 	        "suggestion":["foo"]}}}}
[junit4:junit4]   2> 	
[junit4:junit4]   2> 	 request = spellcheck..perDict.foo=bar&spellcheck.build=true&spellcheck=true&spellcheck.dictionary=perDict&q=documemt&spellcheck..perDict.bar=foo&qt=spellCheckCompRH&json.nl=map
[junit4:junit4]   2> 2661 T1185 oas.SolrTestCaseJ4.tearDown ###Ending testPerDictionary
[junit4:junit4]   2> 2664 T1185 C46 oasu.DirectUpdateHandler2.deleteAll [collection1] REMOVING ALL DOCUMENTS FROM INDEX
[junit4:junit4]   2> 2664 T1185 C46 UPDATE [collection1] webapp=null path=null params={} {deleteByQuery=*:*} 0 1
[junit4:junit4]   2> 2668 T1185 C46 oasu.DirectUpdateHandler2.commit start commit{flags=0,version=0,optimize=false,openSearcher=true,waitSearcher=true,expungeDeletes=false,softCommit=false}
[junit4:junit4]   2> 2668 T1185 C46 oasc.SolrDeletionPolicy.onCommit SolrDeletionPolicy.onCommit: commits:num=2
[junit4:junit4]   2> 		commit{dir=MockDirWrapper(NRTCachingDirectory(org.apache.lucene.store.RAMDirectory@6c5a980d lockFactory=org.apache.lucene.store.NativeFSLockFactory@2ae0dd6f; maxCacheMB=0.021484375 maxMergeSizeMB=0.09375)),segFN=segments_b,generation=11,filenames=[_5.si, _5_Pulsing40_0.tip, _5_Lucene40_0.tip, _5_Pulsing40_1.frq, _5_Lucene40_0.tim, _5_Pulsing40_1.prx, segments_b, _5_nrm.cfe, _5_Pulsing40_1.tip, _5_nrm.cfs, _5.fnm, _5_Lucene40_0.prx, _5_Pulsing40_0.tim, _5_Pulsing40_0.frq, _5_Pulsing40_1.tim, _5_Pulsing40_0.prx, _5_Lucene40_0.frq, _5.fdx, _5.fdt]
[junit4:junit4]   2> 		commit{dir=MockDirWrapper(NRTCachingDirectory(org.apache.lucene.store.RAMDirectory@6c5a980d lockFactory=org.apache.lucene.store.NativeFSLockFactory@2ae0dd6f; maxCacheMB=0.021484375 maxMergeSizeMB=0.09375)),segFN=segments_c,generation=12,filenames=[segments_c]
[junit4:junit4]   2> 2668 T1185 C46 oasc.SolrDeletionPolicy.updateCommits newest commit = 12
[junit4:junit4]   2> 2669 T1185 C46 oass.SolrIndexSearcher.<init> Opening Searcher@51b093b6 main
[junit4:junit4]   2> 2669 T1185 C46 oass.SolrIndexSearcher.getIndexDir WARNING WARNING: Directory impl does not support setting indexDir: org.apache.lucene.store.MockDirectoryWrapper
[junit4:junit4]   2> 2670 T1185 C46 oasu.DirectUpdateHandler2.commit end_commit_flush
[junit4:junit4]   2> 2670 T1186 oashc.SpellCheckComponent$SpellCheckerListener.buildSpellIndex Building spell index for spell checker: default
[junit4:junit4]   2> 2688 T1186 oashc.SpellCheckComponent$SpellCheckerListener.buildSpellIndex Building spell index for spell checker: default_teststop
[junit4:junit4]   2> 2717 T1186 oashc.SpellCheckComponent$SpellCheckerListener.buildSpellIndex Building spell index for spell checker: threshold
[junit4:junit4]   2> 2738 T1186 oashc.SpellCheckComponent$SpellCheckerListener.buildSpellIndex Building spell index for spell checker: threshold_direct
[junit4:junit4]   2> 2738 T1186 oashc.SpellCheckComponent$SpellCheckerListener.buildSpellIndex Building spell index for spell checker: multipleFields
[junit4:junit4]   2> 2778 T1186 oashc.SpellCheckComponent$SpellCheckerListener.buildSpellIndex Building spell index for spell checker: freq
[junit4:junit4]   2> 2798 T1186 oashc.SpellCheckComponent$SpellCheckerListener.buildSpellIndex Building spell index for spell checker: fqcn
[junit4:junit4]   2> 2828 T1186 oasc.SolrCore.registerSearcher [collection1] Registered new searcher Searcher@51b093b6 main{StandardDirectoryReader(segments_c:18)}
[junit4:junit4]   2> 2828 T1185 C46 UPDATE [collection1] webapp=null path=null params={} {commit=} 0 160
[junit4:junit4]   2> NOTE: reproduce with: ant test  -Dtestcase=SpellCheckComponentTest -Dtests.method=testPerDictionary -Dtests.seed=AB68DD5CEEF63A4 -Dtests.multiplier=3 -Dtests.slow=true -Dtests.locale=mk -Dtests.timezone=ACT -Dtests.file.encoding=UTF-8
[junit4:junit4]   2>
[junit4:junit4]    > (@AfterClass output)
[junit4:junit4]   2> 4906 T1185 oas.SolrTestCaseJ4.deleteCore ###deleteCore
[junit4:junit4]   2> 4906 T1185 oasc.CoreContainer.shutdown Shutting down CoreContainer instance=49428605
[junit4:junit4]   2> 4906 T1185 oasc.SolrCore.close [collection1]  CLOSING SolrCore org.apache.solr.core.SolrCore@2b53ea77
[junit4:junit4]   2> 4907 T1185 oasc.SolrCore.closeSearcher [collection1] Closing main searcher on request.
[junit4:junit4]   2> 4907 T1185 oasu.DirectUpdateHandler2.close closing DirectUpdateHandler2{commits=20,autocommits=0,soft autocommits=0,optimizes=0,rollbacks=0,expungeDeletes=0,docsPending=0,adds=0,deletesById=0,deletesByQuery=0,errors=0,cumulative_adds=92,cumulative_deletesById=0,cumulative_deletesByQuery=9,cumulative_errors=0}
[junit4:junit4]   2> NOTE: test params are: codec=Lucene40: {start2=Lucene40(minBlockSize=7 maxBlockSize=28), gram1=Lucene40(minBlockSize=7 maxBlockSize=28), word=Lucene40(minBlockSize=7 maxBlockSize=28), lowerfilt=Lucene40(minBlockSize=7 maxBlockSize=28), range_facet_sl=Pulsing40(freqCutoff=17 minBlockSize=7 maxBlockSize=28), end3=Pulsing40(freqCutoff=6 minBlockSize=7 maxBlockSize=28), id=Pulsing40(freqCutoff=17 minBlockSize=7 maxBlockSize=28), end1=Lucene40(minBlockSize=7 maxBlockSize=28), end4=PostingsFormat(name=Memory doPackFST= true), multiDefault=Lucene40(minBlockSize=7 maxBlockSize=28), start1=Pulsing40(freqCutoff=17 minBlockSize=7 maxBlockSize=28), gram4=PostingsFormat(name=Memory doPackFST= true), gram2=Pulsing40(freqCutoff=17 minBlockSize=7 maxBlockSize=28), timestamp=Lucene40(minBlockSize=7 maxBlockSize=28), range_facet_l=Lucene40(minBlockSize=7 maxBlockSize=28), range_facet_si=Lucene40(minBlockSize=7 maxBlockSize=28), end2=Pulsing40(freqCutoff=17 minBlockSize=7 maxBlockSize=28), gram3=Pulsing40(freqCutoff=6 minBlockSize=7 maxBlockSize=28), lowerfilt1and2=Lucene40(minBlockSize=7 maxBlockSize=28), start3=PostingsFormat(name=Memory doPackFST= true), start4=Pulsing40(freqCutoff=6 minBlockSize=7 maxBlockSize=28), intDefault=Pulsing40(freqCutoff=6 minBlockSize=7 maxBlockSize=28)}, sim=RandomSimilarityProvider(queryNorm=true,coord=true): {}, locale=mk, timezone=ACT
[junit4:junit4]   2> NOTE: Linux 3.2.0-26-generic amd64/Oracle Corporation 1.8.0-ea (64-bit)/cpus=8,threads=1,free=134960072,total=233897984
[junit4:junit4]   2> NOTE: All tests run in this JVM: [CloudStateTest, FileBasedSpellCheckerTest, TestSystemIdResolver, TestWikipediaTokenizerFactory, TestOmitPositions, SolrPluginUtilsTest, TestGroupingSearch, TestTrie, IndexSchemaTest, TestHungarianLightStemFilterFactory, TestIBSimilarityFactory, ZkControllerTest, TestCollationKeyFilterFactory, TestPorterStemFilterFactory, TestRussianLightStemFilterFactory, SoftAutoCommitTest, ResourceLoaderTest, TestLMDirichletSimilarityFactory, SearchHandlerTest, SpellPossibilityIteratorTest, TestRealTimeGet, JsonLoaderTest, TestKeywordMarkerFilterFactory, TestReverseStringFilterFactory, TestDefaultSimilarityFactory, TestElisionFilterFactory, TestJapaneseReadingFormFilterFactory, TestPseudoReturnFields, DebugComponentTest, TestQuerySenderNoQuery, TestLRUCache, TestJmxMonitoredMap, URLClassifyProcessorTest, TestRemoteStreaming, TestRTGBase, ReturnFieldsTest, IndexSchemaRuntimeFieldTest, TestSolrDeletionPolicy1, DistributedTermsComponentTest, TestStressReorder, TestNorwegianMinimalStemFilterFactory, PrimUtilsTest, SpellCheckCollatorTest, PolyFieldTest, SampleTest, TestHunspellStemFilterFactory, SuggesterFSTTest, MultiTermTest, QueryEqualityTest, TestStressLucene, TestJapaneseIterationMarkCharFilterFactory, TestPropInjectDefaults, TestCSVResponseWriter, TestUtils, TestBeiderMorseFilterFactory, TestPortugueseLightStemFilterFactory, StandardRequestHandlerTest, TestStopFilterFactory, TestSuggestSpellingConverter, TestMultiCoreConfBootstrap, TestShingleFilterFactory, TestFastLRUCache, TestJapaneseTokenizerFactory, TermVectorComponentTest, WordBreakSolrSpellCheckerTest, SignatureUpdateProcessorFactoryTest, TestWriterPerf, TestEnglishMinimalStemFilterFactory, TestGermanMinimalStemFilterFactory, TestGalicianMinimalStemFilterFactory, TestDocSet, OverseerTest, FullSolrCloudTest, SpellCheckComponentTest]
[junit4:junit4]   2> 
[junit4:junit4] Completed on J1 in 5.00s, 9 tests, 1 error <<< FAILURES!

[...truncated 102 lines...]
[junit4:junit4] Suite: org.apache.solr.handler.component.DistributedQueryElevationComponentTest
[junit4:junit4] ERROR   1.06s J1 | DistributedQueryElevationComponentTest.testDistribSearch
[junit4:junit4]    > Throwable #1: java.lang.IndexOutOfBoundsException: Index: 18, Size: 18
[junit4:junit4]    > 	at __randomizedtesting.SeedInfo.seed([AB68DD5CEEF63A4:8B5003CDB9B00398]:0)
[junit4:junit4]    > 	at java.util.ArrayList.rangeCheck(ArrayList.java:603)
[junit4:junit4]    > 	at java.util.ArrayList.get(ArrayList.java:381)
[junit4:junit4]    > 	at org.apache.solr.common.util.NamedList.getName(NamedList.java:127)
[junit4:junit4]    > 	at org.apache.solr.BaseDistributedSearchTestCase.compare(BaseDistributedSearchTestCase.java:466)
[junit4:junit4]    > 	at org.apache.solr.BaseDistributedSearchTestCase.compare(BaseDistributedSearchTestCase.java:612)
[junit4:junit4]    > 	at org.apache.solr.BaseDistributedSearchTestCase.compare(BaseDistributedSearchTestCase.java:500)
[junit4:junit4]    > 	at org.apache.solr.BaseDistributedSearchTestCase.compare(BaseDistributedSearchTestCase.java:612)
[junit4:junit4]    > 	at org.apache.solr.BaseDistributedSearchTestCase.compare(BaseDistributedSearchTestCase.java:500)
[junit4:junit4]    > 	at org.apache.solr.BaseDistributedSearchTestCase.compareResponses(BaseDistributedSearchTestCase.java:667)
[junit4:junit4]    > 	at org.apache.solr.BaseDistributedSearchTestCase.query(BaseDistributedSearchTestCase.java:392)
[junit4:junit4]    > 	at org.apache.solr.handler.component.DistributedQueryElevationComponentTest.doTest(DistributedQueryElevationComponentTest.java:81)
[junit4:junit4]    > 	at org.apache.solr.BaseDistributedSearchTestCase.testDistribSearch(BaseDistributedSearchTestCase.java:679)
[junit4:junit4]    > 	at sun.reflect.NativeMethodAccessorImpl.invoke0(Native Method)
[junit4:junit4]    > 	at sun.reflect.NativeMethodAccessorImpl.invoke(NativeMethodAccessorImpl.java:57)
[junit4:junit4]    > 	at sun.reflect.DelegatingMethodAccessorImpl.invoke(DelegatingMethodAccessorImpl.java:43)
[junit4:junit4]    > 	at java.lang.reflect.Method.invoke(Method.java:474)
[junit4:junit4]    > 	at com.carrotsearch.randomizedtesting.RandomizedRunner.invoke(RandomizedRunner.java:1995)
[junit4:junit4]    > 	at com.carrotsearch.randomizedtesting.RandomizedRunner.access$1100(RandomizedRunner.java:132)
[junit4:junit4]    > 	at com.carrotsearch.randomizedtesting.RandomizedRunner$6.evaluate(RandomizedRunner.java:818)
[junit4:junit4]    > 	at com.carrotsearch.randomizedtesting.RandomizedRunner$7.evaluate(RandomizedRunner.java:877)
[junit4:junit4]    > 	at com.carrotsearch.randomizedtesting.RandomizedRunner$8.evaluate(RandomizedRunner.java:891)
[junit4:junit4]    > 	at com.carrotsearch.randomizedtesting.rules.SystemPropertiesRestoreRule$1.evaluate(SystemPropertiesRestoreRule.java:53)
[junit4:junit4]    > 	at org.apache.lucene.util.TestRuleSetupTeardownChained$1.evaluate(TestRuleSetupTeardownChained.java:50)
[junit4:junit4]    > 	at org.apache.lucene.util.TestRuleFieldCacheSanity$1.evaluate(TestRuleFieldCacheSanity.java:32)
[junit4:junit4]    > 	at org.apache.lucene.util.AbstractBeforeAfterRule$1.evaluate(AbstractBeforeAfterRule.java:45)
[junit4:junit4]    > 	at com.carrotsearch.randomizedtesting.rules.SystemPropertiesInvariantRule$1.evaluate(SystemPropertiesInvariantRule.java:55)
[junit4:junit4]    > 	at org.apache.lucene.util.TestRuleReportUncaughtExceptions$1.evaluate(TestRuleReportUncaughtExceptions.java:68)
[junit4:junit4]    > 	at org.apache.lucene.util.TestRuleThreadAndTestName$1.evaluate(TestRuleThreadAndTestName.java:48)
[junit4:junit4]    > 	at org.apache.lucene.util.TestRuleIgnoreAfterMaxFailures$1.evaluate(TestRuleIgnoreAfterMaxFailures.java:70)
[junit4:junit4]    > 	at org.apache.lucene.util.TestRuleMarkFailure$1.evaluate(TestRuleMarkFailure.java:48)
[junit4:junit4]    > 	at com.carrotsearch.randomizedtesting.RandomizedRunner.runSingleTest(RandomizedRunner.java:825)
[junit4:junit4]    > 	at com.carrotsearch.randomizedtesting.RandomizedRunner.access$700(RandomizedRunner.java:132)
[junit4:junit4]    > 	at com.carrotsearch.randomizedtesting.RandomizedRunner$3$1.run(RandomizedRunner.java:671)
[junit4:junit4]    > 	at com.carrotsearch.randomizedtesting.RandomizedRunner$3.evaluate(RandomizedRunner.java:697)
[junit4:junit4]    > 	at com.carrotsearch.randomizedtesting.RandomizedRunner$4.evaluate(RandomizedRunner.java:736)
[junit4:junit4]    > 	at com.carrotsearch.randomizedtesting.RandomizedRunner$5.evaluate(RandomizedRunner.java:747)
[junit4:junit4]    > 	at com.carrotsearch.randomizedtesting.rules.SystemPropertiesRestoreRule$1.evaluate(SystemPropertiesRestoreRule.java:53)
[junit4:junit4]    > 	at org.apache.lucene.util.AbstractBeforeAfterRule$1.evaluate(AbstractBeforeAfterRule.java:45)
[junit4:junit4]    > 	at org.apache.lucene.util.TestRuleReportUncaughtExceptions$1.evaluate(TestRuleReportUncaughtExceptions.java:68)
[junit4:junit4]    > 	at org.apache.lucene.util.TestRuleStoreClassName$1.evaluate(TestRuleStoreClassName.java:38)
[junit4:junit4]    > 	at org.apache.lucene.util.TestRuleIcuHack$1.evaluate(TestRuleIcuHack.java:51)
[junit4:junit4]    > 	at com.carrotsearch.randomizedtesting.rules.SystemPropertiesInvariantRule$1.evaluate(SystemPropertiesInvariantRule.java:55)
[junit4:junit4]    > 	at org.apache.lucene.util.TestRuleNoInstanceHooksOverrides$1.evaluate(TestRuleNoInstanceHooksOverrides.java:53)
[junit4:junit4]    > 	at org.apache.lucene.util.TestRuleNoStaticHooksShadowing$1.evaluate(TestRuleNoStaticHooksShadowing.java:52)
[junit4:junit4]    > 	at org.apache.lucene.util.TestRuleAssertionsRequired$1.evaluate(TestRuleAssertionsRequired.java:36)
[junit4:junit4]    > 	at org.apache.lucene.util.TestRuleMarkFailure$1.evaluate(TestRuleMarkFailure.java:48)
[junit4:junit4]    > 	at org.apache.lucene.util.TestRuleIgnoreAfterMaxFailures$1.evaluate(TestRuleIgnoreAfterMaxFailures.java:70)
[junit4:junit4]    > 	at org.apache.lucene.util.TestRuleIgnoreTestSuites$1.evaluate(TestRuleIgnoreTestSuites.java:55)
[junit4:junit4]    > 	at com.carrotsearch.randomizedtesting.RandomizedRunner.runSuite(RandomizedRunner.java:605)
[junit4:junit4]    > 	at com.carrotsearch.randomizedtesting.RandomizedRunner.access$400(RandomizedRunner.java:132)
[junit4:junit4]    > 	at com.carrotsearch.randomizedtesting.RandomizedRunner$2.run(RandomizedRunner.java:551)
[junit4:junit4]    > 
[junit4:junit4]   2> 1 T2407 oas.SolrTestCaseJ4.setUp ###Starting testDistribSearch
[junit4:junit4]   2> 1 T2407 oejs.Server.doStart jetty-8.1.2.v20120308
[junit4:junit4]   2> 4 T2407 oejs.AbstractConnector.doStart Started SocketConnector@0.0.0.0:52615
[junit4:junit4]   2> 4 T2407 oasc.SolrResourceLoader.locateSolrHome JNDI not configured for solr (NoInitialContextEx)
[junit4:junit4]   2> 4 T2407 oasc.SolrResourceLoader.locateSolrHome using system property solr.solr.home: /mnt/ssd/jenkins/workspace/Lucene-Solr-4.x-Linux-Java8-64/checkout/solr/build/solr-core/test-files/solr
[junit4:junit4]   2> 5 T2407 oasc.SolrResourceLoader.<init> new SolrResourceLoader for deduced Solr Home: '/mnt/ssd/jenkins/workspace/Lucene-Solr-4.x-Linux-Java8-64/checkout/solr/build/solr-core/test-files/solr/'
[junit4:junit4]   2> 8 T2407 oass.SolrDispatchFilter.init SolrDispatchFilter.init()
[junit4:junit4]   2> 8 T2407 oasc.SolrResourceLoader.locateSolrHome JNDI not configured for solr (NoInitialContextEx)
[junit4:junit4]   2> 8 T2407 oasc.SolrResourceLoader.locateSolrHome using system property solr.solr.home: /mnt/ssd/jenkins/workspace/Lucene-Solr-4.x-Linux-Java8-64/checkout/solr/build/solr-core/test-files/solr
[junit4:junit4]   2> 9 T2407 oasc.CoreContainer$Initializer.initialize looking for solr.xml: /mnt/ssd/jenkins/workspace/Lucene-Solr-4.x-Linux-Java8-64/checkout/solr/build/solr-core/test-files/solr/solr.xml
[junit4:junit4]   2> 9 T2407 oasc.CoreContainer.<init> New CoreContainer 432125324
[junit4:junit4]   2> 9 T2407 oasc.CoreContainer.load Loading CoreContainer using Solr Home: '/mnt/ssd/jenkins/workspace/Lucene-Solr-4.x-Linux-Java8-64/checkout/solr/build/solr-core/test-files/solr/'
[junit4:junit4]   2> 9 T2407 oasc.SolrResourceLoader.<init> new SolrResourceLoader for directory: '/mnt/ssd/jenkins/workspace/Lucene-Solr-4.x-Linux-Java8-64/checkout/solr/build/solr-core/test-files/solr/'
[junit4:junit4]   2> 14 T2407 oasc.CoreContainer.load Registering Log Listener
[junit4:junit4]   2> 19 T2407 oashc.HttpShardHandlerFactory.getParameter Setting socketTimeout to: 0
[junit4:junit4]   2> 20 T2407 oashc.HttpShardHandlerFactory.getParameter Setting urlScheme to: http://
[junit4:junit4]   2> 20 T2407 oashc.HttpShardHandlerFactory.getParameter Setting connTimeout to: 0
[junit4:junit4]   2> 20 T2407 oashc.HttpShardHandlerFactory.getParameter Setting maxConnectionsPerHost to: 20
[junit4:junit4]   2> 20 T2407 oashc.HttpShardHandlerFactory.getParameter Setting corePoolSize to: 0
[junit4:junit4]   2> 20 T2407 oashc.HttpShardHandlerFactory.getParameter Setting maximumPoolSize to: 2147483647
[junit4:junit4]   2> 20 T2407 oashc.HttpShardHandlerFactory.getParameter Setting maxThreadIdleTime to: 5
[junit4:junit4]   2> 21 T2407 oashc.HttpShardHandlerFactory.getParameter Setting sizeOfQueue to: -1
[junit4:junit4]   2> 21 T2407 oashc.HttpShardHandlerFactory.getParameter Setting fairnessPolicy to: false
[junit4:junit4]   2> 21 T2407 oascsi.HttpClientUtil.createClient Creating new http client, config:maxConnectionsPerHost=20&maxConnections=10000&socketTimeout=0&connTimeout=0&retry=false
[junit4:junit4]   2> 31 T2407 oasc.CoreContainer.create Creating SolrCore 'collection1' using instanceDir: /mnt/ssd/jenkins/workspace/Lucene-Solr-4.x-Linux-Java8-64/checkout/solr/build/solr-core/test-files/solr/collection1
[junit4:junit4]   2> 32 T2407 oasc.SolrResourceLoader.<init> new SolrResourceLoader for directory: '/mnt/ssd/jenkins/workspace/Lucene-Solr-4.x-Linux-Java8-64/checkout/solr/build/solr-core/test-files/solr/collection1/'
[junit4:junit4]   2> 32 T2407 oasc.SolrResourceLoader.replaceClassLoader Adding 'file:/mnt/ssd/jenkins/workspace/Lucene-Solr-4.x-Linux-Java8-64/checkout/solr/build/solr-core/test-files/solr/collection1/lib/README' to classloader
[junit4:junit4]   2> 32 T2407 oasc.SolrResourceLoader.replaceClassLoader Adding 'file:/mnt/ssd/jenkins/workspace/Lucene-Solr-4.x-Linux-Java8-64/checkout/solr/build/solr-core/test-files/solr/collection1/lib/classes/' to classloader
[junit4:junit4]   2> 44 T2407 oasc.SolrConfig.<init> Using Lucene MatchVersion: LUCENE_40
[junit4:junit4]   2> 69 T2407 oasc.SolrConfig.<init> Loaded SolrConfig: solrconfig-elevate.xml
[junit4:junit4]   2> 70 T2407 oass.IndexSchema.readSchema Reading Solr Schema
[junit4:junit4]   2> 71 T2407 oass.IndexSchema.readSchema Schema name=example
[junit4:junit4]   2> 167 T2407 oass.IndexSchema.readSchema default search field in schema is text
[junit4:junit4]   2> 168 T2407 oass.IndexSchema.readSchema unique key field: id
[junit4:junit4]   2> 170 T2407 oasc.SolrCore.<init> [collection1] Opening new SolrCore at /mnt/ssd/jenkins/workspace/Lucene-Solr-4.x-Linux-Java8-64/checkout/solr/build/solr-core/test-files/solr/collection1/, dataDir=./org.apache.solr.handler.component.DistributedQueryElevationComponentTest-1342023116694/control/data/
[junit4:junit4]   2> 170 T2407 oasc.JmxMonitoredMap.<init> JMX monitoring is enabled. Adding Solr mbeans to JMX Server: com.sun.jmx.mbeanserver.JmxMBeanServer@508da027
[junit4:junit4]   2> 170 T2407 oasc.SolrCore.getNewIndexDir WARNING New index directory detected: old=null new=./org.apache.solr.handler.component.DistributedQueryElevationComponentTest-1342023116694/control/data/index/
[junit4:junit4]   2> 170 T2407 oasc.SolrCore.initIndex WARNING [collection1] Solr index directory './org.apache.solr.handler.component.DistributedQueryElevationComponentTest-1342023116694/control/data/index' doesn't exist. Creating new index...
[junit4:junit4]   2> 171 T2407 oasc.SolrDeletionPolicy.onCommit SolrDeletionPolicy.onCommit: commits:num=1
[junit4:junit4]   2> 		commit{dir=MockDirWrapper(org.apache.lucene.store.RAMDirectory@5d4c4973 lockFactory=org.apache.lucene.store.SingleInstanceLockFactory@3fdce2f2),segFN=segments_1,generation=1,filenames=[segments_1]
[junit4:junit4]   2> 171 T2407 oasc.SolrDeletionPolicy.updateCommits newest commit = 1
[junit4:junit4]   2> 172 T2407 oasc.RequestHandlers.initHandlersFromConfig created /update: solr.UpdateRequestHandler
[junit4:junit4]   2> 173 T2407 oasc.RequestHandlers.initHandlersFromConfig created /elevate: org.apache.solr.handler.component.SearchHandler
[junit4:junit4]   2> 173 T2407 oasc.RequestHandlers.initHandlersFromConfig created /dataElevate: org.apache.solr.handler.component.SearchHandler
[junit4:junit4]   2> 173 T2407 oashl.XMLLoader.init xsltCacheLifetimeSeconds=60
[junit4:junit4]   2> 173 T2407 oasc.RequestHandlers.initHandlersFromConfig WARNING no default request handler is registered (either '/select' or 'standard')
[junit4:junit4]   2> 174 T2407 oasc.SolrCore.initDeprecatedSupport WARNING solrconfig.xml uses deprecated <admin/gettableFiles>, Please update your config to use the ShowFileRequestHandler.
[junit4:junit4]   2> 175 T2407 oasc.SolrCore.initDeprecatedSupport WARNING adding ShowFileRequestHandler with hidden files: [MAPPING-ISOLATIN1ACCENT.TXT, SOLRCONFIG-MASTER2.XML, KEEP-1.TXT, SOLRCONFIG-SPELLCHECKER.XML, SCHEMA-REVERSED.XML, SOLRCONFIG-SIMPLELOCK.XML, SOLRCONFIG-SOLR-749.XML, SCHEMA-REPLICATION2.XML, SOLRCONFIG-BASIC-LUCENEVERSION31.XML, SOLRCONFIG-PROPINJECT.XML, STOPWORDSWRONGENCODING.TXT, SOLRCONFIG-QUERYSENDER.XML, PHRASESUGGEST.TXT, SCHEMA-BINARYFIELD.XML, SOLRCONFIG-TERMINDEX.XML, SCHEMA-LUCENEMATCHVERSION.XML, KEEP-2.TXT, SOLRCONFIG-REPEATER.XML, BAD-SCHEMA-CODEC-GLOBAL-VS-FT-MISMATCH.XML, SOLRCONFIG-TRANSFORMERS.XML, OPEN-EXCHANGE-RATES.JSON, BAD-SCHEMA-NONTEXT-ANALYZER.XML, CURRENCY.XML, STEMDICT.TXT, SCHEMA-SIM.XML, SOLRCONFIG-ENABLEPLUGIN.XML, SOLRCONFIG-DELPOLICY1.XML, HUNSPELL-TEST.DIC, SOLRCONFIG-BASIC.XML, BAD-MP-SOLRCONFIG.XML, SCHEMA-CHARFILTERS.XML, SOLRCONFIG-FUNCTIONQUERY.XML, BAD-SCHEMA-DUP-DYNAMICFIELD.XML, HUNSPELL-TEST.AFF, BAD-SCHEMA-NOT-INDEXED-BUT-NORMS.XML, HYPHENATION.DTD, SOLRCONFIG-DELPOLICY2.XML, SCHEMA-MINIMAL.XML, STOP-1.TXT, SYNONYMS.TXT, SCHEMA-FOLDING.XML, SCHEMA-REPLICATION1.XML, SOLRCONFIG-NOCACHE.XML, SCHEMASURROUND.XML, SOLRCONFIG_CODEC.XML, SOLRCONFIG-SLAVE.XML, STOPWITHBOM.TXT, SCHEMA-NOT-REQUIRED-UNIQUE-KEY.XML, STOP-2.TXT, SOLRCONFIG-MASTER1.XML, SCHEMA-BM25.XML, PROTWORDS.TXT, SOLRCONFIG-ALTDIRECTORY.XML, DA_COMPOUNDDICTIONARY.TXT, DA_UTF8.XML, SCHEMA-DFR.XML, SCHEMA_CODEC.XML, SCHEMA-STOP-KEEP.XML, SCHEMA12.XML, SOLRCONFIG-SLAVE1.XML, SCHEMA11.XML, SCHEMA15.XML, BAD-SCHEMA-DUP-FIELDTYPE.XML, SCHEMA-SPELLCHECKER.XML, SOLRCONFIG-UPDATE-PROCESSOR-CHAINS.XML, SCHEMA-PHRASESUGGEST.XML, SOLRCONFIG-TLOG.XML, SOLRCONFIG-QUERYSENDER-NOQUERY.XML, SOLRCONFIG-MERGEPOLICY.XML, SCHEMA-NUMERIC.XML, SOLRCONFIG-CACHING.XML, SCHEMA-LMJELINEKMERCER.XML, SOLRCONFIG-MASTER3.XML, SOLRCONFIG-PROPINJECT-INDEXDEFAULT.XML, BAD-SCHEMA-EXTERNAL-FILEFIELD.XML, BAD-SCHEMA-NOT-INDEXED-BUT-TF.XML, STOPTYPES-2.TXT, SCHEMA-COLLATE.XML, SOLRCONFIG-ELEVATE.XML, SCHEMA-TFIDF.XML, SCHEMA-COLLATEFILTER.XML, SCHEMA-COPYFIELD-TEST.XML, SOLRCONFIG-NATIVELOCK.XML, STOPTYPES-1.TXT, COMPOUNDDICTIONARY.TXT, SCHEMA-IB.XML, BAD-SCHEMA-SIM-GLOBAL-VS-FT-MISMATCH.XML, XSLT, SOLRCONFIG-SOLCOREPROPERTIES.XML, FRENCHARTICLES.TXT, SOLRCONFIG-MASTER1-KEEPONEBACKUP.XML, SCHEMA-TRIE.XML, WDFTYPES.TXT, BAD-SCHEMA-DUP-FIELD.XML, SOLRCONFIG-SPELLCHECKCOMPONENT.XML, BAD-SCHEMA-UNIQUEKEY-IS-COPYFIELD-DEST.XML, BAD-SCHEMA-UNIQUEKEY-USES-DEFAULT.XML, SOLRCONFIG-XINCLUDE.XML, SCHEMA-REQUIRED-FIELDS.XML, OLD_SYNONYMS.TXT, SCHEMA-LMDIRICHLET.XML, BAD_SOLRCONFIG.XML, STOPWORDS.TXT, SOLRCONFIG-REQHANDLER.INCL, SOLRCONFIG-LAZYWRITER.XML, ELEVATE.XML, SCHEMA.XML, STOP-SNOWBALL.TXT, SOLRCONFIG-HIGHLIGHT.XML, BAD-SCHEMA-OMIT-TF-BUT-NOT-POS.XML, BAD-SCHEMA-NOT-INDEXED-BUT-POS.XML, SOLRCONFIG_PERF.XML, SOLRCONFIG-MASTER.XML, SOLRCONFIG-PHRASESUGGEST.XML]
[junit4:junit4]   2> 176 T2407 oass.SolrIndexSearcher.<init> Opening Searcher@1b8cd14a main
[junit4:junit4]   2> 176 T2407 oass.SolrIndexSearcher.getIndexDir WARNING WARNING: Directory impl does not support setting indexDir: org.apache.lucene.store.MockDirectoryWrapper
[junit4:junit4]   2> 177 T2407 oasu.CommitTracker.<init> Hard AutoCommit: disabled
[junit4:junit4]   2> 177 T2407 oasu.CommitTracker.<init> Soft AutoCommit: disabled
[junit4:junit4]   2> 177 T2407 oashc.QueryElevationComponent.inform Loading QueryElevation from: /mnt/ssd/jenkins/workspace/Lucene-Solr-4.x-Linux-Java8-64/checkout/solr/build/solr-core/test-files/solr/collection1/conf/elevate.xml
[junit4:junit4]   2> 182 T2407 oashc.QueryElevationComponent.inform Loading QueryElevation from: /mnt/ssd/jenkins/workspace/Lucene-Solr-4.x-Linux-Java8-64/checkout/solr/build/solr-core/test-files/solr/collection1/conf/elevate.xml
[junit4:junit4]   2> 186 T2417 oasc.SolrCore.registerSearcher [collection1] Registered new searcher Searcher@1b8cd14a main{StandardDirectoryReader(segments_1:1)}
[junit4:junit4]   2> 186 T2407 oasc.CoreContainer.register registering core: collection1
[junit4:junit4]   2> 187 T2407 oass.SolrDispatchFilter.init user.dir=/mnt/ssd/jenkins/workspace/Lucene-Solr-4.x-Linux-Java8-64/checkout/solr/build/solr-core/test/J1
[junit4:junit4]   2> 187 T2407 oass.SolrDispatchFilter.init SolrDispatchFilter.init() done
[junit4:junit4]   2> 187 T2407 oascsi.HttpClientUtil.createClient Creating new http client, config:maxConnections=128&maxConnectionsPerHost=32&followRedirects=false
[junit4:junit4]   2> 189 T2407 oejs.Server.doStart jetty-8.1.2.v20120308
[junit4:junit4]   2> 190 T2407 oejs.AbstractConnector.doStart Started SocketConnector@0.0.0.0:43491
[junit4:junit4]   2> 190 T2407 oasc.SolrResourceLoader.locateSolrHome JNDI not configured for solr (NoInitialContextEx)
[junit4:junit4]   2> 191 T2407 oasc.SolrResourceLoader.locateSolrHome using system property solr.solr.home: /mnt/ssd/jenkins/workspace/Lucene-Solr-4.x-Linux-Java8-64/checkout/solr/build/solr-core/test-files/solr
[junit4:junit4]   2> 191 T2407 oasc.SolrResourceLoader.<init> new SolrResourceLoader for deduced Solr Home: '/mnt/ssd/jenkins/workspace/Lucene-Solr-4.x-Linux-Java8-64/checkout/solr/build/solr-core/test-files/solr/'
[junit4:junit4]   2> 193 T2407 oass.SolrDispatchFilter.init SolrDispatchFilter.init()
[junit4:junit4]   2> 193 T2407 oasc.SolrResourceLoader.locateSolrHome JNDI not configured for solr (NoInitialContextEx)
[junit4:junit4]   2> 193 T2407 oasc.SolrResourceLoader.locateSolrHome using system property solr.solr.home: /mnt/ssd/jenkins/workspace/Lucene-Solr-4.x-Linux-Java8-64/checkout/solr/build/solr-core/test-files/solr
[junit4:junit4]   2> 193 T2407 oasc.CoreContainer$Initializer.initialize looking for solr.xml: /mnt/ssd/jenkins/workspace/Lucene-Solr-4.x-Linux-Java8-64/checkout/solr/build/solr-core/test-files/solr/solr.xml
[junit4:junit4]   2> 194 T2407 oasc.CoreContainer.<init> New CoreContainer 413146354
[junit4:junit4]   2> 194 T2407 oasc.CoreContainer.load Loading CoreContainer using Solr Home: '/mnt/ssd/jenkins/workspace/Lucene-Solr-4.x-Linux-Java8-64/checkout/solr/build/solr-core/test-files/solr/'
[junit4:junit4]   2> 194 T2407 oasc.SolrResourceLoader.<init> new SolrResourceLoader for directory: '/mnt/ssd/jenkins/workspace/Lucene-Solr-4.x-Linux-Java8-64/checkout/solr/build/solr-core/test-files/solr/'
[junit4:junit4]   2> 198 T2407 oasc.CoreContainer.load Registering Log Listener
[junit4:junit4]   2> 203 T2407 oashc.HttpShardHandlerFactory.getParameter Setting socketTimeout to: 0
[junit4:junit4]   2> 204 T2407 oashc.HttpShardHandlerFactory.getParameter Setting urlScheme to: http://
[junit4:junit4]   2> 204 T2407 oashc.HttpShardHandlerFactory.getParameter Setting connTimeout to: 0
[junit4:junit4]   2> 204 T2407 oashc.HttpShardHandlerFactory.getParameter Setting maxConnectionsPerHost to: 20
[junit4:junit4]   2> 204 T2407 oashc.HttpShardHandlerFactory.getParameter Setting corePoolSize to: 0
[junit4:junit4]   2> 204 T2407 oashc.HttpShardHandlerFactory.getParameter Setting maximumPoolSize to: 2147483647
[junit4:junit4]   2> 204 T2407 oashc.HttpShardHandlerFactory.getParameter Setting maxThreadIdleTime to: 5
[junit4:junit4]   2> 205 T2407 oashc.HttpShardHandlerFactory.getParameter Setting sizeOfQueue to: -1
[junit4:junit4]   2> 205 T2407 oashc.HttpShardHandlerFactory.getParameter Setting fairnessPolicy to: false
[junit4:junit4]   2> 205 T2407 oascsi.HttpClientUtil.createClient Creating new http client, config:maxConnectionsPerHost=20&maxConnections=10000&socketTimeout=0&connTimeout=0&retry=false
[junit4:junit4]   2> 208 T2407 oasc.CoreContainer.create Creating SolrCore 'collection1' using instanceDir: /mnt/ssd/jenkins/workspace/Lucene-Solr-4.x-Linux-Java8-64/checkout/solr/build/solr-core/test-files/solr/collection1
[junit4:junit4]   2> 209 T2407 oasc.SolrResourceLoader.<init> new SolrResourceLoader for directory: '/mnt/ssd/jenkins/workspace/Lucene-Solr-4.x-Linux-Java8-64/checkout/solr/build/solr-core/test-files/solr/collection1/'
[junit4:junit4]   2> 209 T2407 oasc.SolrResourceLoader.replaceClassLoader Adding 'file:/mnt/ssd/jenkins/workspace/Lucene-Solr-4.x-Linux-Java8-64/checkout/solr/build/solr-core/test-files/solr/collection1/lib/README' to classloader
[junit4:junit4]   2> 209 T2407 oasc.SolrResourceLoader.replaceClassLoader Adding 'file:/mnt/ssd/jenkins/workspace/Lucene-Solr-4.x-Linux-Java8-64/checkout/solr/build/solr-core/test-files/solr/collection1/lib/classes/' to classloader
[junit4:junit4]   2> 230 T2407 oasc.SolrConfig.<init> Using Lucene MatchVersion: LUCENE_40
[junit4:junit4]   2> 254 T2407 oasc.SolrConfig.<init> Loaded SolrConfig: solrconfig-elevate.xml
[junit4:junit4]   2> 255 T2407 oass.IndexSchema.readSchema Reading Solr Schema
[junit4:junit4]   2> 257 T2407 oass.IndexSchema.readSchema Schema name=example
[junit4:junit4]   2> 355 T2407 oass.IndexSchema.readSchema default search field in schema is text
[junit4:junit4]   2> 356 T2407 oass.IndexSchema.readSchema unique key field: id
[junit4:junit4]   2> 358 T2407 oasc.SolrCore.<init> [collection1] Opening new SolrCore at /mnt/ssd/jenkins/workspace/Lucene-Solr-4.x-Linux-Java8-64/checkout/solr/build/solr-core/test-files/solr/collection1/, dataDir=./org.apache.solr.handler.component.DistributedQueryElevationComponentTest-1342023116694/shard0/data/
[junit4:junit4]   2> 358 T2407 oasc.JmxMonitoredMap.<init> JMX monitoring is enabled. Adding Solr mbeans to JMX Server: com.sun.jmx.mbeanserver.JmxMBeanServer@508da027
[junit4:junit4]   2> 359 T2407 oasc.SolrCore.getNewIndexDir WARNING New index directory detected: old=null new=./org.apache.solr.handler.component.DistributedQueryElevationComponentTest-1342023116694/shard0/data/index/
[junit4:junit4]   2> 359 T2407 oasc.SolrCore.initIndex WARNING [collection1] Solr index directory './org.apache.solr.handler.component.DistributedQueryElevationComponentTest-1342023116694/shard0/data/index' doesn't exist. Creating new index...
[junit4:junit4]   2> 360 T2407 oasc.SolrDeletionPolicy.onCommit SolrDeletionPolicy.onCommit: commits:num=1
[junit4:junit4]   2> 		commit{dir=MockDirWrapper(org.apache.lucene.store.RAMDirectory@40cd08fd lockFactory=org.apache.lucene.store.SingleInstanceLockFactory@5112ddee),segFN=segments_1,generation=1,filenames=[segments_1]
[junit4:junit4]   2> 360 T2407 oasc.SolrDeletionPolicy.updateCommits newest commit = 1
[junit4:junit4]   2> 361 T2407 oasc.RequestHandlers.initHandlersFromConfig created /update: solr.UpdateRequestHandler
[junit4:junit4]   2> 361 T2407 oasc.RequestHandlers.initHandlersFromConfig created /elevate: org.apache.solr.handler.component.SearchHandler
[junit4:junit4]   2> 361 T2407 oasc.RequestHandlers.initHandlersFromConfig created /dataElevate: org.apache.solr.handler.component.SearchHandler
[junit4:junit4]   2> 362 T2407 oashl.XMLLoader.init xsltCacheLifetimeSeconds=60
[junit4:junit4]   2> 362 T2407 oasc.RequestHandlers.initHandlersFromConfig WARNING no default request handler is registered (either '/select' or 'standard')
[junit4:junit4]   2> 362 T2407 oasc.SolrCore.initDeprecatedSupport WARNING solrconfig.xml uses deprecated <admin/gettableFiles>, Please update your config to use the ShowFileRequestHandler.
[junit4:junit4]   2> 363 T2407 oasc.SolrCore.initDeprecatedSupport WARNING adding ShowFileRequestHandler with hidden files: [MAPPING-ISOLATIN1ACCENT.TXT, SOLRCONFIG-MASTER2.XML, KEEP-1.TXT, SOLRCONFIG-SPELLCHECKER.XML, SCHEMA-REVERSED.XML, SOLRCONFIG-SIMPLELOCK.XML, SOLRCONFIG-SOLR-749.XML, SCHEMA-REPLICATION2.XML, SOLRCONFIG-BASIC-LUCENEVERSION31.XML, SOLRCONFIG-PROPINJECT.XML, STOPWORDSWRONGENCODING.TXT, SOLRCONFIG-QUERYSENDER.XML, PHRASESUGGEST.TXT, SCHEMA-BINARYFIELD.XML, SOLRCONFIG-TERMINDEX.XML, SCHEMA-LUCENEMATCHVERSION.XML, KEEP-2.TXT, SOLRCONFIG-REPEATER.XML, BAD-SCHEMA-CODEC-GLOBAL-VS-FT-MISMATCH.XML, SOLRCONFIG-TRANSFORMERS.XML, OPEN-EXCHANGE-RATES.JSON, BAD-SCHEMA-NONTEXT-ANALYZER.XML, CURRENCY.XML, STEMDICT.TXT, SCHEMA-SIM.XML, SOLRCONFIG-ENABLEPLUGIN.XML, SOLRCONFIG-DELPOLICY1.XML, HUNSPELL-TEST.DIC, SOLRCONFIG-BASIC.XML, BAD-MP-SOLRCONFIG.XML, SCHEMA-CHARFILTERS.XML, SOLRCONFIG-FUNCTIONQUERY.XML, BAD-SCHEMA-DUP-DYNAMICFIELD.XML, HUNSPELL-TEST.AFF, BAD-SCHEMA-NOT-INDEXED-BUT-NORMS.XML, HYPHENATION.DTD, SOLRCONFIG-DELPOLICY2.XML, SCHEMA-MINIMAL.XML, STOP-1.TXT, SYNONYMS.TXT, SCHEMA-FOLDING.XML, SCHEMA-REPLICATION1.XML, SOLRCONFIG-NOCACHE.XML, SCHEMASURROUND.XML, SOLRCONFIG_CODEC.XML, SOLRCONFIG-SLAVE.XML, STOPWITHBOM.TXT, SCHEMA-NOT-REQUIRED-UNIQUE-KEY.XML, STOP-2.TXT, SOLRCONFIG-MASTER1.XML, SCHEMA-BM25.XML, PROTWORDS.TXT, SOLRCONFIG-ALTDIRECTORY.XML, DA_COMPOUNDDICTIONARY.TXT, DA_UTF8.XML, SCHEMA-DFR.XML, SCHEMA_CODEC.XML, SCHEMA-STOP-KEEP.XML, SCHEMA12.XML, SOLRCONFIG-SLAVE1.XML, SCHEMA11.XML, SCHEMA15.XML, BAD-SCHEMA-DUP-FIELDTYPE.XML, SCHEMA-SPELLCHECKER.XML, SOLRCONFIG-UPDATE-PROCESSOR-CHAINS.XML, SCHEMA-PHRASESUGGEST.XML, SOLRCONFIG-TLOG.XML, SOLRCONFIG-QUERYSENDER-NOQUERY.XML, SOLRCONFIG-MERGEPOLICY.XML, SCHEMA-NUMERIC.XML, SOLRCONFIG-CACHING.XML, SCHEMA-LMJELINEKMERCER.XML, SOLRCONFIG-MASTER3.XML, SOLRCONFIG-PROPINJECT-INDEXDEFAULT.XML, BAD-SCHEMA-EXTERNAL-FILEFIELD.XML, BAD-SCHEMA-NOT-INDEXED-BUT-TF.XML, STOPTYPES-2.TXT, SCHEMA-COLLATE.XML, SOLRCONFIG-ELEVATE.XML, SCHEMA-TFIDF.XML, SCHEMA-COLLATEFILTER.XML, SCHEMA-COPYFIELD-TEST.XML, SOLRCONFIG-NATIVELOCK.XML, STOPTYPES-1.TXT, COMPOUNDDICTIONARY.TXT, SCHEMA-IB.XML, BAD-SCHEMA-SIM-GLOBAL-VS-FT-MISMATCH.XML, XSLT, SOLRCONFIG-SOLCOREPROPERTIES.XML, FRENCHARTICLES.TXT, SOLRCONFIG-MASTER1-KEEPONEBACKUP.XML, SCHEMA-TRIE.XML, WDFTYPES.TXT, BAD-SCHEMA-DUP-FIELD.XML, SOLRCONFIG-SPELLCHECKCOMPONENT.XML, BAD-SCHEMA-UNIQUEKEY-IS-COPYFIELD-DEST.XML, BAD-SCHEMA-UNIQUEKEY-USES-DEFAULT.XML, SOLRCONFIG-XINCLUDE.XML, SCHEMA-REQUIRED-FIELDS.XML, OLD_SYNONYMS.TXT, SCHEMA-LMDIRICHLET.XML, BAD_SOLRCONFIG.XML, STOPWORDS.TXT, SOLRCONFIG-REQHANDLER.INCL, SOLRCONFIG-LAZYWRITER.XML, ELEVATE.XML, SCHEMA.XML, STOP-SNOWBALL.TXT, SOLRCONFIG-HIGHLIGHT.XML, BAD-SCHEMA-OMIT-TF-BUT-NOT-POS.XML, BAD-SCHEMA-NOT-INDEXED-BUT-POS.XML, SOLRCONFIG_PERF.XML, SOLRCONFIG-MASTER.XML, SOLRCONFIG-PHRASESUGGEST.XML]
[junit4:junit4]   2> 364 T2407 oass.SolrIndexSearcher.<init> Opening Searcher@4b31dc3a main
[junit4:junit4]   2> 365 T2407 oass.SolrIndexSearcher.getIndexDir WARNING WARNING: Directory impl does not support setting indexDir: org.apache.lucene.store.MockDirectoryWrapper
[junit4:junit4]   2> 365 T2407 oasu.CommitTracker.<init> Hard AutoCommit: disabled
[junit4:junit4]   2> 365 T2407 oasu.CommitTracker.<init> Soft AutoCommit: disabled
[junit4:junit4]   2> 365 T2407 oashc.QueryElevationComponent.inform Loading QueryElevation from: /mnt/ssd/jenkins/workspace/Lucene-Solr-4.x-Linux-Java8-64/checkout/solr/build/solr-core/test-files/solr/collection1/conf/elevate.xml
[junit4:junit4]   2> 372 T2407 oashc.QueryElevationComponent.inform Loading QueryElevation from: /mnt/ssd/jenkins/workspace/Lucene-Solr-4.x-Linux-Java8-64/checkout/solr/build/solr-core/test-files/solr/collection1/conf/elevate.xml
[junit4:junit4]   2> 377 T2427 oasc.SolrCore.registerSearcher [collection1] Registered new searcher Searcher@4b31dc3a main{StandardDirectoryReader(segments_1:1)}
[junit4:junit4]   2> 377 T2407 oasc.CoreContainer.register registering core: collection1
[junit4:junit4]   2> 377 T2407 oass.SolrDispatchFilter.init user.dir=/mnt/ssd/jenkins/workspace/Lucene-Solr-4.x-Linux-Java8-64/checkout/solr/build/solr-core/test/J1
[junit4:junit4]   2> 378 T2407 oass.SolrDispatchFilter.init SolrDispatchFilter.init() done
[junit4:junit4]   2> 378 T2407 oascsi.HttpClientUtil.createClient Creating new http client, config:maxConnections=128&maxConnectionsPerHost=32&followRedirects=false
[junit4:junit4]   2> 380 T2407 oejs.Server.doStart jetty-8.1.2.v20120308
[junit4:junit4]   2> 381 T2407 oejs.AbstractConnector.doStart Started SocketConnector@0.0.0.0:38245
[junit4:junit4]   2> 381 T2407 oasc.SolrResourceLoader.locateSolrHome JNDI not configured for solr (NoInitialContextEx)
[junit4:junit4]   2> 381 T2407 oasc.SolrResourceLoader.locateSolrHome using system property solr.solr.home: /mnt/ssd/jenkins/workspace/Lucene-Solr-4.x-Linux-Java8-64/checkout/solr/build/solr-core/test-files/solr
[junit4:junit4]   2> 382 T2407 oasc.SolrResourceLoader.<init> new SolrResourceLoader for deduced Solr Home: '/mnt/ssd/jenkins/workspace/Lucene-Solr-4.x-Linux-Java8-64/checkout/solr/build/solr-core/test-files/solr/'
[junit4:junit4]   2> 384 T2407 oass.SolrDispatchFilter.init SolrDispatchFilter.init()
[junit4:junit4]   2> 384 T2407 oasc.SolrResourceLoader.locateSolrHome JNDI not configured for solr (NoInitialContextEx)
[junit4:junit4]   2> 384 T2407 oasc.SolrResourceLoader.locateSolrHome using system property solr.solr.home: /mnt/ssd/jenkins/workspace/Lucene-Solr-4.x-Linux-Java8-64/checkout/solr/build/solr-core/test-files/solr
[junit4:junit4]   2> 385 T2407 oasc.CoreContainer$Initializer.initialize looking for solr.xml: /mnt/ssd/jenkins/workspace/Lucene-Solr-4.x-Linux-Java8-64/checkout/solr/build/solr-core/test-files/solr/solr.xml
[junit4:junit4]   2> 385 T2407 oasc.CoreContainer.<init> New CoreContainer 1005202860
[junit4:junit4]   2> 385 T2407 oasc.CoreContainer.load Loading CoreContainer using Solr Home: '/mnt/ssd/jenkins/workspace/Lucene-Solr-4.x-Linux-Java8-64/checkout/solr/build/solr-core/test-files/solr/'
[junit4:junit4]   2> 385 T2407 oasc.SolrResourceLoader.<init> new SolrResourceLoader for directory: '/mnt/ssd/jenkins/workspace/Lucene-Solr-4.x-Linux-Java8-64/checkout/solr/build/solr-core/test-files/solr/'
[junit4:junit4]   2> 393 T2407 oasc.CoreContainer.load Registering Log Listener
[junit4:junit4]   2> 399 T2407 oashc.HttpShardHandlerFactory.getParameter Setting socketTimeout to: 0
[junit4:junit4]   2> 399 T2407 oashc.HttpShardHandlerFactory.getParameter Setting urlScheme to: http://
[junit4:junit4]   2> 399 T2407 oashc.HttpShardHandlerFactory.getParameter Setting connTimeout to: 0
[junit4:junit4]   2> 399 T2407 oashc.HttpShardHandlerFactory.getParameter Setting maxConnectionsPerHost to: 20
[junit4:junit4]   2> 400 T2407 oashc.HttpShardHandlerFactory.getParameter Setting corePoolSize to: 0
[junit4:junit4]   2> 400 T2407 oashc.HttpShardHandlerFactory.getParameter Setting maximumPoolSize to: 2147483647
[junit4:junit4]   2> 400 T2407 oashc.HttpShardHandlerFactory.getParameter Setting maxThreadIdleTime to: 5
[junit4:junit4]   2> 400 T2407 oashc.HttpShardHandlerFactory.getParameter Setting sizeOfQueue to: -1
[junit4:junit4]   2> 400 T2407 oashc.HttpShardHandlerFactory.getParameter Setting fairnessPolicy to: false
[junit4:junit4]   2> 400 T2407 oascsi.HttpClientUtil.createClient Creating new http client, config:maxConnectionsPerHost=20&maxConnections=10000&socketTimeout=0&connTimeout=0&retry=false
[junit4:junit4]   2> 404 T2407 oasc.CoreContainer.create Creating SolrCore 'collection1' using instanceDir: /mnt/ssd/jenkins/workspace/Lucene-Solr-4.x-Linux-Java8-64/checkout/solr/build/solr-core/test-files/solr/collection1
[junit4:junit4]   2> 404 T2407 oasc.SolrResourceLoader.<init> new SolrResourceLoader for directory: '/mnt/ssd/jenkins/workspace/Lucene-Solr-4.x-Linux-Java8-64/checkout/solr/build/solr-core/test-files/solr/collection1/'
[junit4:junit4]   2> 404 T2407 oasc.SolrResourceLoader.replaceClassLoader Adding 'file:/mnt/ssd/jenkins/workspace/Lucene-Solr-4.x-Linux-Java8-64/checkout/solr/build/solr-core/test-files/solr/collection1/lib/README' to classloader
[junit4:junit4]   2> 405 T2407 oasc.SolrResourceLoader.replaceClassLoader Adding 'file:/mnt/ssd/jenkins/workspace/Lucene-Solr-4.x-Linux-Java8-64/checkout/solr/build/solr-core/test-files/solr/collection1/lib/classes/' to classloader
[junit4:junit4]   2> 426 T2407 oasc.SolrConfig.<init> Using Lucene MatchVersion: LUCENE_40
[junit4:junit4]   2> 451 T2407 oasc.SolrConfig.<init> Loaded SolrConfig: solrconfig-elevate.xml
[junit4:junit4]   2> 451 T2407 oass.IndexSchema.readSchema Reading Solr Schema
[junit4:junit4]   2> 453 T2407 oass.IndexSchema.readSchema Schema name=example
[junit4:junit4]   2> 522 T1177 oaz.ClientCnxn$SendThread.startConnect Opening socket connection to server localhost.localdomain/127.0.0.1:43754
[junit4:junit4]   2> 522 T1177 oaz.ClientCnxn$SendThread.run WARNING Session 0x13876cbd0a60010 for server null, unexpected error, closing socket connection and attempting reconnect java.net.ConnectException: Connection refused
[junit4:junit4]   2> 	at sun.nio.ch.SocketChannelImpl.checkConnect(Native Method)
[junit4:junit4]   2> 	at sun.nio.ch.SocketChannelImpl.finishConnect(SocketChannelImpl.java:692)
[junit4:junit4]   2> 	at org.apache.zookeeper.ClientCnxn$SendThread.run(ClientCnxn.java:1146)
[junit4:junit4]   2> 
[junit4:junit4]   2> 551 T2407 oass.IndexSchema.readSchema default search field in schema is text
[junit4:junit4]   2> 552 T2407 oass.IndexSchema.readSchema unique key field: id
[junit4:junit4]   2> 554 T2407 oasc.SolrCore.<init> [collection1] Opening new SolrCore at /mnt/ssd/jenkins/workspace/Lucene-Solr-4.x-Linux-Java8-64/checkout/solr/build/solr-core/test-files/solr/collection1/, dataDir=./org.apache.solr.handler.component.DistributedQueryElevationComponentTest-1342023116694/shard1/data/
[junit4:junit4]   2> 554 T2407 oasc.JmxMonitoredMap.<init> JMX monitoring is enabled. Adding Solr mbeans to JMX Server: com.sun.jmx.mbeanserver.JmxMBeanServer@508da027
[junit4:junit4]   2> 555 T2407 oasc.SolrCore.getNewIndexDir WARNING New index directory detected: old=null new=./org.apache.solr.handler.component.DistributedQueryElevationComponentTest-1342023116694/shard1/data/index/
[junit4:junit4]   2> 555 T2407 oasc.SolrCore.initIndex WARNING [collection1] Solr index directory './org.apache.solr.handler.component.DistributedQueryElevationComponentTest-1342023116694/shard1/data/index' doesn't exist. Creating new index...
[junit4:junit4]   2> 556 T2407 oasc.SolrDeletionPolicy.onCommit SolrDeletionPolicy.onCommit: commits:num=1
[junit4:junit4]   2> 		commit{dir=MockDirWrapper(org.apache.lucene.store.RAMDirectory@77a3b365 lockFactory=org.apache.lucene.store.SingleInstanceLockFactory@deb7749),segFN=segments_1,generation=1,filenames=[segments_1]
[junit4:junit4]   2> 556 T2407 oasc.SolrDeletionPolicy.updateCommits newest commit = 1
[junit4:junit4]   2> 557 T2407 oasc.RequestHandlers.initHandlersFromConfig created /update: solr.UpdateRequestHandler
[junit4:junit4]   2> 557 T2407 oasc.RequestHandlers.initHandlersFromConfig created /elevate: org.apache.solr.handler.component.SearchHandler
[junit4:junit4]   2> 557 T2407 oasc.RequestHandlers.initHandlersFromConfig created /dataElevate: org.apache.solr.handler.component.SearchHandler
[junit4:junit4]   2> 557 T2407 oashl.XMLLoader.init xsltCacheLifetimeSeconds=60
[junit4:junit4]   2> 558 T2407 oasc.RequestHandlers.initHandlersFromConfig WARNING no default request handler is registered (either '/select' or 'standard')
[junit4:junit4]   2> 558 T2407 oasc.SolrCore.initDeprecatedSupport WARNING solrconfig.xml uses deprecated <admin/gettableFiles>, Please update your config to use the ShowFileRequestHandler.
[junit4:junit4]   2> 559 T2407 oasc.SolrCore.initDeprecatedSupport WARNING adding ShowFileRequestHandler with hidden files: [MAPPING-ISOLATIN1ACCENT.TXT, SOLRCONFIG-MASTER2.XML, KEEP-1.TXT, SOLRCONFIG-SPELLCHECKER.XML, SCHEMA-REVERSED.XML, SOLRCONFIG-SIMPLELOCK.XML, SOLRCONFIG-SOLR-749.XML, SCHEMA-REPLICATION2.XML, SOLRCONFIG-BASIC-LUCENEVERSION31.XML, SOLRCONFIG-PROPINJECT.XML, STOPWORDSWRONGENCODING.TXT, SOLRCONFIG-QUERYSENDER.XML, PHRASESUGGEST.TXT, SCHEMA-BINARYFIELD.XML, SOLRCONFIG-TERMINDEX.XML, SCHEMA-LUCENEMATCHVERSION.XML, KEEP-2.TXT, SOLRCONFIG-REPEATER.XML, BAD-SCHEMA-CODEC-GLOBAL-VS-FT-MISMATCH.XML, SOLRCONFIG-TRANSFORMERS.XML, OPEN-EXCHANGE-RATES.JSON, BAD-SCHEMA-NONTEXT-ANALYZER.XML, CURRENCY.XML, STEMDICT.TXT, SCHEMA-SIM.XML, SOLRCONFIG-ENABLEPLUGIN.XML, SOLRCONFIG-DELPOLICY1.XML, HUNSPELL-TEST.DIC, SOLRCONFIG-BASIC.XML, BAD-MP-SOLRCONFIG.XML, SCHEMA-CHARFILTERS.XML, SOLRCONFIG-FUNCTIONQUERY.XML, BAD-SCHEMA-DUP-DYNAMICFIELD.XML, HUNSPELL-TEST.AFF, BAD-SCHEMA-NOT-INDEXED-BUT-NORMS.XML, HYPHENATION.DTD, SOLRCONFIG-DELPOLICY2.XML, SCHEMA-MINIMAL.XML, STOP-1.TXT, SYNONYMS.TXT, SCHEMA-FOLDING.XML, SCHEMA-REPLICATION1.XML, SOLRCONFIG-NOCACHE.XML, SCHEMASURROUND.XML, SOLRCONFIG_CODEC.XML, SOLRCONFIG-SLAVE.XML, STOPWITHBOM.TXT, SCHEMA-NOT-REQUIRED-UNIQUE-KEY.XML, STOP-2.TXT, SOLRCONFIG-MASTER1.XML, SCHEMA-BM25.XML, PROTWORDS.TXT, SOLRCONFIG-ALTDIRECTORY.XML, DA_COMPOUNDDICTIONARY.TXT, DA_UTF8.XML, SCHEMA-DFR.XML, SCHEMA_CODEC.XML, SCHEMA-STOP-KEEP.XML, SCHEMA12.XML, SOLRCONFIG-SLAVE1.XML, SCHEMA11.XML, SCHEMA15.XML, BAD-SCHEMA-DUP-FIELDTYPE.XML, SCHEMA-SPELLCHECKER.XML, SOLRCONFIG-UPDATE-PROCESSOR-CHAINS.XML, SCHEMA-PHRASESUGGEST.XML, SOLRCONFIG-TLOG.XML, SOLRCONFIG-QUERYSENDER-NOQUERY.XML, SOLRCONFIG-MERGEPOLICY.XML, SCHEMA-NUMERIC.XML, SOLRCONFIG-CACHING.XML, SCHEMA-LMJELINEKMERCER.XML, SOLRCONFIG-MASTER3.XML, SOLRCONFIG-PROPINJECT-INDEXDEFAULT.XML, BAD-SCHEMA-EXTERNAL-FILEFIELD.XML, BAD-SCHEMA-NOT-INDEXED-BUT-TF.XML, STOPTYPES-2.TXT, SCHEMA-COLLATE.XML, SOLRCONFIG-ELEVATE.XML, SCHEMA-TFIDF.XML, SCHEMA-COLLATEFILTER.XML, SCHEMA-COPYFIELD-TEST.XML, SOLRCONFIG-NATIVELOCK.XML, STOPTYPES-1.TXT, COMPOUNDDICTIONARY.TXT, SCHEMA-IB.XML, BAD-SCHEMA-SIM-GLOBAL-VS-FT-MISMATCH.XML, XSLT, SOLRCONFIG-SOLCOREPROPERTIES.XML, FRENCHARTICLES.TXT, SOLRCONFIG-MASTER1-KEEPONEBACKUP.XML, SCHEMA-TRIE.XML, WDFTYPES.TXT, BAD-SCHEMA-DUP-FIELD.XML, SOLRCONFIG-SPELLCHECKCOMPONENT.XML, BAD-SCHEMA-UNIQUEKEY-IS-COPYFIELD-DEST.XML, BAD-SCHEMA-UNIQUEKEY-USES-DEFAULT.XML, SOLRCONFIG-XINCLUDE.XML, SCHEMA-REQUIRED-FIELDS.XML, OLD_SYNONYMS.TXT, SCHEMA-LMDIRICHLET.XML, BAD_SOLRCONFIG.XML, STOPWORDS.TXT, SOLRCONFIG-REQHANDLER.INCL, SOLRCONFIG-LAZYWRITER.XML, ELEVATE.XML, SCHEMA.XML, STOP-SNOWBALL.TXT, SOLRCONFIG-HIGHLIGHT.XML, BAD-SCHEMA-OMIT-TF-BUT-NOT-POS.XML, BAD-SCHEMA-NOT-INDEXED-BUT-POS.XML, SOLRCONFIG_PERF.XML, SOLRCONFIG-MASTER.XML, SOLRCONFIG-PHRASESUGGEST.XML]
[junit4:junit4]   2> 560 T2407 oass.SolrIndexSearcher.<init> Opening Searcher@1f7a5e46 main
[junit4:junit4]   2> 560 T2407 oass.SolrIndexSearcher.getIndexDir WARNING WARNING: Directory impl does not support setting indexDir: org.apache.lucene.store.MockDirectoryWrapper
[junit4:junit4]   2> 561 T2407 oasu.CommitTracker.<init> Hard AutoCommit: disabled
[junit4:junit4]   2> 561 T2407 oasu.CommitTracker.<init> Soft AutoCommit: disabled
[junit4:junit4]   2> 561 T2407 oashc.QueryElevationComponent.inform Loading QueryElevation from: /mnt/ssd/jenkins/workspace/Lucene-Solr-4.x-Linux-Java8-64/checkout/solr/build/solr-core/test-files/solr/collection1/conf/elevate.xml
[junit4:junit4]   2> 566 T2407 oashc.QueryElevationComponent.inform Loading QueryElevation from: /mnt/ssd/jenkins/workspace/Lucene-Solr-4.x-Linux-Java8-64/checkout/solr/build/solr-core/test-files/solr/collection1/conf/elevate.xml
[junit4:junit4]   2> 571 T2437 oasc.SolrCore.registerSearcher [collection1] Registered new searcher Searcher@1f7a5e46 main{StandardDirectoryReader(segments_1:1)}
[junit4:junit4]   2> 571 T2407 oasc.CoreContainer.register registering core: collection1
[junit4:junit4]   2> 571 T2407 oass.SolrDispatchFilter.init user.dir=/mnt/ssd/jenkins/workspace/Lucene-Solr-4.x-Linux-Java8-64/checkout/solr/build/solr-core/test/J1
[junit4:junit4]   2> 571 T2407 oass.SolrDispatchFilter.init SolrDispatchFilter.init() done
[junit4:junit4]   2> 572 T2407 oascsi.HttpClientUtil.createClient Creating new http client, config:maxConnections=128&maxConnectionsPerHost=32&followRedirects=false
[junit4:junit4]   2> 574 T2407 oejs.Server.doStart jetty-8.1.2.v20120308
[junit4:junit4]   2> 575 T2407 oejs.AbstractConnector.doStart Started SocketConnector@0.0.0.0:59152
[junit4:junit4]   2> 576 T2407 oasc.SolrResourceLoader.locateSolrHome JNDI not configured for solr (NoInitialContextEx)
[junit4:junit4]   2> 576 T2407 oasc.SolrResourceLoader.locateSolrHome using system property solr.solr.home: /mnt/ssd/jenkins/workspace/Lucene-Solr-4.x-Linux-Java8-64/checkout/solr/build/solr-core/test-files/solr
[junit4:junit4]   2> 576 T2407 oasc.SolrResourceLoader.<init> new SolrResourceLoader for deduced Solr Home: '/mnt/ssd/jenkins/workspace/Lucene-Solr-4.x-Linux-Java8-64/checkout/solr/build/solr-core/test-files/solr/'
[junit4:junit4]   2> 579 T2407 oass.SolrDispatchFilter.init SolrDispatchFilter.init()
[junit4:junit4]   2> 579 T2407 oasc.SolrResourceLoader.locateSolrHome JNDI not configured for solr (NoInitialContextEx)
[junit4:junit4]   2> 579 T2407 oasc.SolrResourceLoader.locateSolrHome using system property solr.solr.home: /mnt/ssd/jenkins/workspace/Lucene-Solr-4.x-Linux-Java8-64/checkout/solr/build/solr-core/test-files/solr
[junit4:junit4]   2> 579 T2407 oasc.CoreContainer$Initializer.initialize looking for solr.xml: /mnt/ssd/jenkins/workspace/Lucene-Solr-4.x-Linux-Java8-64/checkout/solr/build/solr-core/test-files/solr/solr.xml
[junit4:junit4]   2> 579 T2407 oasc.CoreContainer.<init> New CoreContainer 1064193188
[junit4:junit4]   2> 580 T2407 oasc.CoreContainer.load Loading CoreContainer using Solr Home: '/mnt/ssd/jenkins/workspace/Lucene-Solr-4.x-Linux-Java8-64/checkout/solr/build/solr-core/test-files/solr/'
[junit4:junit4]   2> 580 T2407 oasc.SolrResourceLoader.<init> new SolrResourceLoader for directory: '/mnt/ssd/jenkins/workspace/Lucene-Solr-4.x-Linux-Java8-64/checkout/solr/build/solr-core/test-files/solr/'
[junit4:junit4]   2> 583 T2407 oasc.CoreContainer.load Registering Log Listener
[junit4:junit4]   2> 589 T2407 oashc.HttpShardHandlerFactory.getParameter Setting socketTimeout to: 0
[junit4:junit4]   2> 589 T2407 oashc.HttpShardHandlerFactory.getParameter Setting urlScheme to: http://
[junit4:junit4]   2> 590 T2407 oashc.HttpShardHandlerFactory.getParameter Setting connTimeout to: 0
[junit4:junit4]   2> 590 T2407 oashc.HttpShardHandlerFactory.getParameter Setting maxConnectionsPerHost to: 20
[junit4:junit4]   2> 590 T2407 oashc.HttpShardHandlerFactory.getParameter Setting corePoolSize to: 0
[junit4:junit4]   2> 590 T2407 oashc.HttpShardHandlerFactory.getParameter Setting maximumPoolSize to: 2147483647
[junit4:junit4]   2> 590 T2407 oashc.HttpShardHandlerFactory.getParameter Setting maxThreadIdleTime to: 5
[junit4:junit4]   2> 590 T2407 oashc.HttpShardHandlerFactory.getParameter Setting sizeOfQueue to: -1
[junit4:junit4]   2> 591 T2407 oashc.HttpShardHandlerFactory.getParameter Setting fairnessPolicy to: false
[junit4:junit4]   2> 591 T2407 oascsi.HttpClientUtil.createClient Creating new http client, config:maxConnectionsPerHost=20&maxConnections=10000&socketTimeout=0&connTimeout=0&retry=false
[junit4:junit4]   2> 594 T2407 oasc.CoreContainer.create Creating SolrCore 'collection1' using instanceDir: /mnt/ssd/jenkins/workspace/Lucene-Solr-4.x-Linux-Java8-64/checkout/solr/build/solr-core/test-files/solr/collection1
[junit4:junit4]   2> 594 T2407 oasc.SolrResourceLoader.<init> new SolrResourceLoader for directory: '/mnt/ssd/jenkins/workspace/Lucene-Solr-4.x-Linux-Java8-64/checkout/solr/build/solr-core/test-files/solr/collection1/'
[junit4:junit4]   2> 595 T2407 oasc.SolrResourceLoader.replaceClassLoader Adding 'file:/mnt/ssd/jenkins/workspace/Lucene-Solr-4.x-Linux-Java8-64/checkout/solr/build/solr-core/test-files/solr/collection1/lib/README' to classloader
[junit4:junit4]   2> 595 T2407 oasc.SolrResourceLoader.replaceClassLoader Adding 'file:/mnt/ssd/jenkins/workspace/Lucene-Solr-4.x-Linux-Java8-64/checkout/solr/build/solr-core/test-files/solr/collection1/lib/classes/' to classloader
[junit4:junit4]   2> 606 T2407 oasc.SolrConfig.<init> Using Lucene MatchVersion: LUCENE_40
[junit4:junit4]   2> 634 T2407 oasc.SolrConfig.<init> Loaded SolrConfig: solrconfig-elevate.xml
[junit4:junit4]   2> 634 T2407 oass.IndexSchema.readSchema Reading Solr Schema
[junit4:junit4]   2> 636 T2407 oass.IndexSchema.readSchema Schema name=example
[junit4:junit4]   2> 726 T2407 oass.IndexSchema.readSchema default search field in schema is text
[junit4:junit4]   2> 728 T2407 oass.IndexSchema.readSchema unique key field: id
[junit4:junit4]   2> 729 T2407 oasc.SolrCore.<init> [collection1] Opening new SolrCore at /mnt/ssd/jenkins/workspace/Lucene-Solr-4.x-Linux-Java8-64/checkout/solr/build/solr-core/test-files/solr/collection1/, dataDir=./org.apache.solr.handler.component.DistributedQueryElevationComponentTest-1342023116694/shard2/data/
[junit4:junit4]   2> 729 T2407 oasc.JmxMonitoredMap.<init> JMX monitoring is enabled. Adding Solr mbeans to JMX Server: com.sun.jmx.mbeanserver.JmxMBeanServer@508da027
[junit4:junit4]   2> 730 T2407 oasc.SolrCore.getNewIndexDir WARNING New index directory detected: old=null new=./org.apache.solr.handler.component.DistributedQueryElevationComponentTest-1342023116694/shard2/data/index/
[junit4:junit4]   2> 730 T2407 oasc.SolrCore.initIndex WARNING [collection1] Solr index directory './org.apache.solr.handler.component.DistributedQueryElevationComponentTest-1342023116694/shard2/data/index' doesn't exist. Creating new index...
[junit4:junit4]   2> 731 T2407 oasc.SolrDeletionPolicy.onCommit SolrDeletionPolicy.onCommit: commits:num=1
[junit4:junit4]   2> 		commit{dir=MockDirWrapper(org.apache.lucene.store.RAMDirectory@dc38f10 lockFactory=org.apache.lucene.store.SingleInstanceLockFactory@5cb2c93b),segFN=segments_1,generation=1,filenames=[segments_1]
[junit4:junit4]   2> 731 T2407 oasc.SolrDeletionPolicy.updateCommits newest commit = 1
[junit4:junit4]   2> 732 T2407 oasc.RequestHandlers.initHandlersFromConfig created /update: solr.UpdateRequestHandler
[junit4:junit4]   2> 733 T2407 oasc.RequestHandlers.initHandlersFromConfig created /elevate: org.apache.solr.handler.component.SearchHandler
[junit4:junit4]   2> 733 T2407 oasc.RequestHandlers.initHandlersFromConfig created /dataElevate: org.apache.solr.handler.component.SearchHandler
[junit4:junit4]   2> 733 T2407 oashl.XMLLoader.init xsltCacheLifetimeSeconds=60
[junit4:junit4]   2> 733 T2407 oasc.RequestHandlers.initHandlersFromConfig WARNING no default request handler is registered (either '/select' or 'standard')
[junit4:junit4]   2> 734 T2407 oasc.SolrCore.initDeprecatedSupport WARNING solrconfig.xml uses deprecated <admin/gettableFiles>, Please update your config to use the ShowFileRequestHandler.
[junit4:junit4]   2> 735 T2407 oasc.SolrCore.initDeprecatedSupport WARNING adding ShowFileRequestHandler with hidden files: [MAPPING-ISOLATIN1ACCENT.TXT, SOLRCONFIG-MASTER2.XML, KEEP-1.TXT, SOLRCONFIG-SPELLCHECKER.XML, SCHEMA-REVERSED.XML, SOLRCONFIG-SIMPLELOCK.XML, SOLRCONFIG-SOLR-749.XML, SCHEMA-REPLICATION2.XML, SOLRCONFIG-BASIC-LUCENEVERSION31.XML, SOLRCONFIG-PROPINJECT.XML, STOPWORDSWRONGENCODING.TXT, SOLRCONFIG-QUERYSENDER.XML, PHRASESUGGEST.TXT, SCHEMA-BINARYFIELD.XML, SOLRCONFIG-TERMINDEX.XML, SCHEMA-LUCENEMATCHVERSION.XML, KEEP-2.TXT, SOLRCONFIG-REPEATER.XML, BAD-SCHEMA-CODEC-GLOBAL-VS-FT-MISMATCH.XML, SOLRCONFIG-TRANSFORMERS.XML, OPEN-EXCHANGE-RATES.JSON, BAD-SCHEMA-NONTEXT-ANALYZER.XML, CURRENCY.XML, STEMDICT.TXT, SCHEMA-SIM.XML, SOLRCONFIG-ENABLEPLUGIN.XML, SOLRCONFIG-DELPOLICY1.XML, HUNSPELL-TEST.DIC, SOLRCONFIG-BASIC.XML, BAD-MP-SOLRCONFIG.XML, SCHEMA-CHARFILTERS.XML, SOLRCONFIG-FUNCTIONQUERY.XML, BAD-SCHEMA-DUP-DYNAMICFIELD.XML, HUNSPELL-TEST.AFF, BAD-SCHEMA-NOT-INDEXED-BUT-NORMS.XML, HYPHENATION.DTD, SOLRCONFIG-DELPOLICY2.XML, SCHEMA-MINIMAL.XML, STOP-1.TXT, SYNONYMS.TXT, SCHEMA-FOLDING.XML, SCHEMA-REPLICATION1.XML, SOLRCONFIG-NOCACHE.XML, SCHEMASURROUND.XML, SOLRCONFIG_CODEC.XML, SOLRCONFIG-SLAVE.XML, STOPWITHBOM.TXT, SCHEMA-NOT-REQUIRED-UNIQUE-KEY.XML, STOP-2.TXT, SOLRCONFIG-MASTER1.XML, SCHEMA-BM25.XML, PROTWORDS.TXT, SOLRCONFIG-ALTDIRECTORY.XML, DA_COMPOUNDDICTIONARY.TXT, DA_UTF8.XML, SCHEMA-DFR.XML, SCHEMA_CODEC.XML, SCHEMA-STOP-KEEP.XML, SCHEMA12.XML, SOLRCONFIG-SLAVE1.XML, SCHEMA11.XML, SCHEMA15.XML, BAD-SCHEMA-DUP-FIELDTYPE.XML, SCHEMA-SPELLCHECKER.XML, SOLRCONFIG-UPDATE-PROCESSOR-CHAINS.XML, SCHEMA-PHRASESUGGEST.XML, SOLRCONFIG-TLOG.XML, SOLRCONFIG-QUERYSENDER-NOQUERY.XML, SOLRCONFIG-MERGEPOLICY.XML, SCHEMA-NUMERIC.XML, SOLRCONFIG-CACHING.XML, SCHEMA-LMJELINEKMERCER.XML, SOLRCONFIG-MASTER3.XML, SOLRCONFIG-PROPINJECT-INDEXDEFAULT.XML, BAD-SCHEMA-EXTERNAL-FILEFIELD.XML, BAD-SCHEMA-NOT-INDEXED-BUT-TF.XML, STOPTYPES-2.TXT, SCHEMA-COLLATE.XML, SOLRCONFIG-ELEVATE.XML, SCHEMA-TFIDF.XML, SCHEMA-COLLATEFILTER.XML, SCHEMA-COPYFIELD-TEST.XML, SOLRCONFIG-NATIVELOCK.XML, STOPTYPES-1.TXT, COMPOUNDDICTIONARY.TXT, SCHEMA-IB.XML, BAD-SCHEMA-SIM-GLOBAL-VS-FT-MISMATCH.XML, XSLT, SOLRCONFIG-SOLCOREPROPERTIES.XML, FRENCHARTICLES.TXT, SOLRCONFIG-MASTER1-KEEPONEBACKUP.XML, SCHEMA-TRIE.XML, WDFTYPES.TXT, BAD-SCHEMA-DUP-FIELD.XML, SOLRCONFIG-SPELLCHECKCOMPONENT.XML, BAD-SCHEMA-UNIQUEKEY-IS-COPYFIELD-DEST.XML, BAD-SCHEMA-UNIQUEKEY-USES-DEFAULT.XML, SOLRCONFIG-XINCLUDE.XML, SCHEMA-REQUIRED-FIELDS.XML, OLD_SYNONYMS.TXT, SCHEMA-LMDIRICHLET.XML, BAD_SOLRCONFIG.XML, STOPWORDS.TXT, SOLRCONFIG-REQHANDLER.INCL, SOLRCONFIG-LAZYWRITER.XML, ELEVATE.XML, SCHEMA.XML, STOP-SNOWBALL.TXT, SOLRCONFIG-HIGHLIGHT.XML, BAD-SCHEMA-OMIT-TF-BUT-NOT-POS.XML, BAD-SCHEMA-NOT-INDEXED-BUT-POS.XML, SOLRCONFIG_PERF.XML, SOLRCONFIG-MASTER.XML, SOLRCONFIG-PHRASESUGGEST.XML]
[junit4:junit4]   2> 736 T2407 oass.SolrIndexSearcher.<init> Opening Searcher@47294007 main
[junit4:junit4]   2> 736 T2407 oass.SolrIndexSearcher.getIndexDir WARNING WARNING: Directory impl does not support setting indexDir: org.apache.lucene.store.MockDirectoryWrapper
[junit4:junit4]   2> 737 T2407 oasu.CommitTracker.<init> Hard AutoCommit: disabled
[junit4:junit4]   2> 737 T2407 oasu.CommitTracker.<init> Soft AutoCommit: disabled
[junit4:junit4]   2> 737 T2407 oashc.QueryElevationComponent.inform Loading QueryElevation from: /mnt/ssd/jenkins/workspace/Lucene-Solr-4.x-Linux-Java8-64/checkout/solr/build/solr-core/test-files/solr/collection1/conf/elevate.xml
[junit4:junit4]   2> 742 T2407 oashc.QueryElevationComponent.inform Loading QueryElevation from: /mnt/ssd/jenkins/workspace/Lucene-Solr-4.x-Linux-Java8-64/checkout/solr/build/solr-core/test-files/solr/collection1/conf/elevate.xml
[junit4:junit4]   2> 747 T2447 oasc.SolrCore.registerSearcher [collection1] Registered new searcher Searcher@47294007 main{StandardDirectoryReader(segments_1:1)}
[junit4:junit4]   2> 747 T2407 oasc.CoreContainer.register registering core: collection1
[junit4:junit4]   2> 748 T2407 oass.SolrDispatchFilter.init user.dir=/mnt/ssd/jenkins/workspace/Lucene-Solr-4.x-Linux-Java8-64/checkout/solr/build/solr-core/test/J1
[junit4:junit4]   2> 748 T2407 oass.SolrDispatchFilter.init SolrDispatchFilter.init() done
[junit4:junit4]   2> 748 T2407 oascsi.HttpClientUtil.createClient Creating new http client, config:maxConnections=128&maxConnectionsPerHost=32&followRedirects=false
[junit4:junit4]   2> ASYNC  NEW_CORE C149 name=collection1 org.apache.solr.core.SolrCore@31708f2
[junit4:junit4]   2> 753 T2410 C149 oasu.DirectUpdateHandler2.deleteAll [collection1] REMOVING ALL DOCUMENTS FROM INDEX
[junit4:junit4]   2> 754 T2410 C149 oasc.SolrDeletionPolicy.onInit SolrDeletionPolicy.onInit: commits:num=1
[junit4:junit4]   2> 		commit{dir=MockDirWrapper(org.apache.lucene.store.RAMDirectory@5d4c4973 lockFactory=org.apache.lucene.store.SingleInstanceLockFactory@3fdce2f2),segFN=segments_1,generation=1,filenames=[segments_1]
[junit4:junit4]   2> 754 T2410 C149 oasc.SolrDeletionPolicy.updateCommits newest commit = 1
[junit4:junit4]   2> 754 T2410 C149 UPDATE [collection1] webapp=/solr path=/update params={wt=javabin&version=2} {deleteByQuery=*:*} 0 2
[junit4:junit4]   2> ASYNC  NEW_CORE C150 name=collection1 org.apache.solr.core.SolrCore@557050dd
[junit4:junit4]   2> 757 T2420 C150 oasu.DirectUpdateHandler2.deleteAll [collection1] REMOVING ALL DOCUMENTS FROM INDEX
[junit4:junit4]   2> 758 T2420 C150 oasc.SolrDeletionPolicy.onInit SolrDeletionPolicy.onInit: commits:num=1
[junit4:junit4]   2> 		commit{dir=MockDirWrapper(org.apache.lucene.store.RAMDirectory@40cd08fd lockFactory=org.apache.lucene.store.SingleInstanceLockFactory@5112ddee),segFN=segments_1,generation=1,filenames=[segments_1]
[junit4:junit4]   2> 758 T2420 C150 oasc.SolrDeletionPolicy.updateCommits newest commit = 1
[junit4:junit4]   2> 758 T2420 C150 UPDATE [collection1] webapp=/solr path=/update params={wt=javabin&version=2} {deleteByQuery=*:*} 0 1
[junit4:junit4]   2> ASYNC  NEW_CORE C151 name=collection1 org.apache.solr.core.SolrCore@797ce8fa
[junit4:junit4]   2> 761 T2430 C151 oasu.DirectUpdateHandler2.deleteAll [collection1] REMOVING ALL DOCUMENTS FROM INDEX
[junit4:junit4]   2> 762 T2430 C151 oasc.SolrDeletionPolicy.onInit SolrDeletionPolicy.onInit: commits:num=1
[junit4:junit4]   2> 		commit{dir=MockDirWrapper(org.apache.lucene.store.RAMDirectory@77a3b365 lockFactory=org.apache.lucene.store.SingleInstanceLockFactory@deb7749),segFN=segments_1,generation=1,filenames=[segments_1]
[junit4:junit4]   2> 763 T2430 C151 oasc.SolrDeletionPolicy.updateCommits newest commit = 1
[junit4:junit4]   2> 763 T2430 C151 UPDATE [collection1] webapp=/solr path=/update params={wt=javabin&version=2} {deleteByQuery=*:*} 0 2
[junit4:junit4]   2> ASYNC  NEW_CORE C152 name=collection1 org.apache.solr.core.SolrCore@452b0e7a
[junit4:junit4]   2> 766 T2440 C152 oasu.DirectUpdateHandler2.deleteAll [collection1] REMOVING ALL DOCUMENTS FROM INDEX
[junit4:junit4]   2> 767 T2440 C152 oasc.SolrDeletionPolicy.onInit SolrDeletionPolicy.onInit: commits:num=1
[junit4:junit4]   2> 		commit{dir=MockDirWrapper(org.apache.lucene.store.RAMDirectory@dc38f10 lockFactory=org.apache.lucene.store.SingleInstanceLockFactory@5cb2c93b),segFN=segments_1,generation=1,filenames=[segments_1]
[junit4:junit4]   2> 767 T2440 C152 oasc.SolrDeletionPolicy.updateCommits newest commit = 1
[junit4:junit4]   2> 767 T2440 C152 UPDATE [collection1] webapp=/solr path=/update params={wt=javabin&version=2} {deleteByQuery=*:*} 0 1
[junit4:junit4]   2> 769 T2410 C149 UPDATE [collection1] webapp=/solr path=/update params={wt=javabin&version=2} {add=[1]} 0 0
[junit4:junit4]   2> 771 T2420 C150 UPDATE [collection1] webapp=/solr path=/update params={wt=javabin&version=2} {add=[1]} 0 0
[junit4:junit4]   2> 773 T2410 C149 UPDATE [collection1] webapp=/solr path=/update params={wt=javabin&version=2} {add=[2]} 0 1
[junit4:junit4]   2> 774 T2430 C151 UPDATE [collection1] webapp=/solr path=/update params={wt=javabin&version=2} {add=[2]} 0 0
[junit4:junit4]   2> 776 T2410 C149 UPDATE [collection1] webapp=/solr path=/update params={wt=javabin&version=2} {add=[3]} 0 0
[junit4:junit4]   2> 777 T2440 C152 UPDATE [collection1] webapp=/solr path=/update params={wt=javabin&version=2} {add=[3]} 0 0
[junit4:junit4]   2> 779 T2410 C149 UPDATE [collection1] webapp=/solr path=/update params={wt=javabin&version=2} {add=[4]} 0 0
[junit4:junit4]   2> 780 T2420 C150 UPDATE [collection1] webapp=/solr path=/update params={wt=javabin&version=2} {add=[4]} 0 0
[junit4:junit4]   2> 782 T2410 C149 UPDATE [collection1] webapp=/solr path=/update params={wt=javabin&version=2} {add=[5]} 0 0
[junit4:junit4]   2> 783 T2430 C151 UPDATE [collection1] webapp=/solr path=/update params={wt=javabin&version=2} {add=[5]} 0 0
[junit4:junit4]   2> 785 T2410 C149 UPDATE [collection1] webapp=/solr path=/update params={wt=javabin&version=2} {add=[6]} 0 0
[junit4:junit4]   2> 786 T2440 C152 UPDATE [collection1] webapp=/solr path=/update params={wt=javabin&version=2} {add=[6]} 0 0
[junit4:junit4]   2> 788 T2410 C149 UPDATE [collection1] webapp=/solr path=/update params={wt=javabin&version=2} {add=[7]} 0 0
[junit4:junit4]   2> 789 T2440 C152 UPDATE [collection1] webapp=/solr path=/update params={wt=javabin&version=2} {add=[7]} 0 0
[junit4:junit4]   2> 791 T2410 C149 oasu.DirectUpdateHandler2.commit start commit{flags=0,version=0,optimize=false,openSearcher=true,waitSearcher=true,expungeDeletes=false,softCommit=false}
[junit4:junit4]   2> 792 T2410 C149 oasc.SolrDeletionPolicy.onCommit SolrDeletionPolicy.onCommit: commits:num=2
[junit4:junit4]   2> 		commit{dir=MockDirWrapper(org.apache.lucene.store.RAMDirectory@5d4c4973 lockFactory=org.apache.lucene.store.SingleInstanceLockFactory@3fdce2f2),segFN=segments_1,generation=1,filenames=[segments_1]
[junit4:junit4]   2> 		commit{dir=MockDirWrapper(org.apache.lucene.store.RAMDirectory@5d4c4973 lockFactory=org.apache.lucene.store.SingleInstanceLockFactory@3fdce2f2),segFN=segments_2,generation=2,filenames=[_0.fnm, _0_Lucene40_0.tip, _0_Lucene40_0.tim, _0_MockSep_0.tii, _0_Lucene40_0.frq, _0_Lucene40_0.prx, _0_MockSep_0.frq, _0_MockSep_0.skp, _0_MockSep_0.pos, _0_nrm.cfs, _0_MockSep_0.tib, _0.si, _0_MockSep_0.pyl, _0_nrm.cfe, _0.fdx, segments_2, _0_MockSep_0.doc, _0.fdt]
[junit4:junit4]   2> 792 T2410 C149 oasc.SolrDeletionPolicy.updateCommits newest commit = 2
[junit4:junit4]   2> 793 T2410 C149 oass.SolrIndexSearcher.<init> Opening Searcher@57597da main
[junit4:junit4]   2> 793 T2410 C149 oass.SolrIndexSearcher.getIndexDir WARNING WARNING: Directory impl does not support setting indexDir: org.apache.lucene.store.MockDirectoryWrapper
[junit4:junit4]   2> 793 T2410 C149 oasu.DirectUpdateHandler2.commit end_commit_flush
[junit4:junit4]   2> 793 T2417 oasc.SolrCore.registerSearcher [collection1] Registered new searcher Searcher@57597da main{StandardDirectoryReader(segments_2:4 _0(4.0):C7)}
[junit4:junit4]   2> 793 T2410 C149 UPDATE [collection1] webapp=/solr path=/update params={softCommit=false&wt=javabin&commit=true&waitSearcher=true&version=2} {commit=} 0 2
[junit4:junit4]   2> 795 T2420 C150 oasu.DirectUpdateHandler2.commit start commit{flags=0,version=0,optimize=false,openSearcher=true,waitSearcher=true,expungeDeletes=false,softCommit=false}
[junit4:junit4]   2> 796 T2420 C150 oasc.SolrDeletionPolicy.onCommit SolrDeletionPolicy.onCommit: commits:num=2
[junit4:junit4]   2> 		commit{dir=MockDirWrapper(org.apache.lucene.store.RAMDirectory@40cd08fd lockFactory=org.apache.lucene.store.SingleInstanceLockFactory@5112ddee),segFN=segments_1,generation=1,filenames=[segments_1]
[junit4:junit4]   2> 		commit{dir=MockDirWrapper(org.apache.lucene.store.RAMDirectory@40cd08fd lockFactory=org.apache.lucene.store.SingleInstanceLockFactory@5112ddee),segFN=segments_2,generation=2,filenames=[_0.fnm, _0_Lucene40_0.tip, _0_Lucene40_0.tim, _0_MockSep_0.tii, _0_Lucene40_0.frq, _0_Lucene40_0.prx, _0_MockSep_0.frq, _0_MockSep_0.skp, _0_MockSep_0.pos, _0_nrm.cfs, _0_MockSep_0.tib, _0.si, _0_MockSep_0.pyl, _0_nrm.cfe, _0.fdx, segments_2, _0_MockSep_0.doc, _0.fdt]
[junit4:junit4]   2> 796 T2420 C150 oasc.SolrDeletionPolicy.updateCommits newest commit = 2
[junit4:junit4]   2> 797 T2420 C150 oass.SolrIndexSearcher.<init> Opening Searcher@24c5c442 main
[junit4:junit4]   2> 797 T2420 C150 oass.SolrIndexSearcher.getIndexDir WARNING WARNING: Directory impl does not support setting indexDir: org.apache.lucene.store.MockDirectoryWrapper
[junit4:junit4]   2> 797 T2420 C150 oasu.DirectUpdateHandler2.commit end_commit_flush
[junit4:junit4]   2> 797 T2427 oasc.SolrCore.registerSearcher [collection1] Registered new searcher Searcher@24c5c442 main{StandardDirectoryReader(segments_2:4 _0(4.0):C2)}
[junit4:junit4]   2> 798 T2420 C150 UPDATE [collection1] webapp=/solr path=/update params={softCommit=false&wt=javabin&commit=true&waitSearcher=true&version=2} {commit=} 0 3
[junit4:junit4]   2> 799 T2430 C151 oasu.DirectUpdateHandler2.commit start commit{flags=0,version=0,optimize=false,openSearcher=true,waitSearcher=true,expungeDeletes=false,softCommit=false}
[junit4:junit4]   2> 800 T2430 C151 oasc.SolrDeletionPolicy.onCommit SolrDeletionPolicy.onCommit: commits:num=2
[junit4:junit4]   2> 		commit{dir=MockDirWrapper(org.apache.lucene.store.RAMDirectory@77a3b365 lockFactory=org.apache.lucene.store.SingleInstanceLockFactory@deb7749),segFN=segments_1,generation=1,filenames=[segments_1]
[junit4:junit4]   2> 		commit{dir=MockDirWrapper(org.apache.lucene.store.RAMDirectory@77a3b365 lockFactory=org.apache.lucene.store.SingleInstanceLockFactory@deb7749),segFN=segments_2,generation=2,filenames=[_0.fnm, _0_Lucene40_0.tip, _0_MockSep_0.tii, _0_Lucene40_0.tim, _0_Lucene40_0.frq, _0_Lucene40_0.prx, _0_MockSep_0.frq, _0_MockSep_0.skp, _0_MockSep_0.pos, _0_nrm.cfs, _0_MockSep_0.tib, _0.si, _0_MockSep_0.pyl, _0_nrm.cfe, _0.fdx, segments_2, _0_MockSep_0.doc, _0.fdt]
[junit4:junit4]   2> 800 T2430 C151 oasc.SolrDeletionPolicy.updateCommits newest commit = 2
[junit4:junit4]   2> 801 T2430 C151 oass.SolrIndexSearcher.<init> Opening Searcher@13ff5468 main
[junit4:junit4]   2> 801 T2430 C151 oass.SolrIndexSearcher.getIndexDir WARNING WARNING: Directory impl does not support setting indexDir: org.apache.lucene.store.MockDirectoryWrapper
[junit4:junit4]   2> 801 T2430 C151 oasu.DirectUpdateHandler2.commit end_commit_flush
[junit4:junit4]   2> 801 T2437 oasc.SolrCore.registerSearcher [collection1] Registered new searcher Searcher@13ff5468 main{StandardDirectoryReader(segments_2:4 _0(4.0):C2)}
[junit4:junit4]   2> 801 T2430 C151 UPDATE [collection1] webapp=/solr path=/update params={softCommit=false&wt=javabin&commit=true&waitSearcher=true&version=2} {commit=} 0 2
[junit4:junit4]   2> 803 T2440 C152 oasu.DirectUpdateHandler2.commit start commit{flags=0,version=0,optimize=false,openSearcher=true,waitSearcher=true,expungeDeletes=false,softCommit=false}
[junit4:junit4]   2> 803 T2440 C152 oasc.SolrDeletionPolicy.onCommit SolrDeletionPolicy.onCommit: commits:num=2
[junit4:junit4]   2> 		commit{dir=MockDirWrapper(org.apache.lucene.store.RAMDirectory@dc38f10 lockFactory=org.apache.lucene.store.SingleInstanceLockFactory@5cb2c93b),segFN=segments_1,generation=1,filenames=[segments_1]
[junit4:junit4]   2> 		commit{dir=MockDirWrapper(org.apache.lucene.store.RAMDirectory@dc38f10 lockFactory=org.apache.lucene.store.SingleInstanceLockFactory@5cb2c93b),segFN=segments_2,generation=2,filenames=[_0.fnm, _0_Lucene40_0.tip, _0_MockSep_0.tii, _0_Lucene40_0.tim, _0_Lucene40_0.frq, _0_Lucene40_0.prx, _0_MockSep_0.frq, _0_MockSep_0.skp, _0_MockSep_0.pos, _0_nrm.cfs, _0_MockSep_0.tib, _0.si, _0_MockSep_0.pyl, _0_nrm.cfe, _0.fdx, segments_2, _0_MockSep_0.doc, _0.fdt]
[junit4:junit4]   2> 804 T2440 C152 oasc.SolrDeletionPolicy.updateCommits newest commit = 2
[junit4:junit4]   2> 804 T2440 C152 oass.SolrIndexSearcher.<init> Opening Searcher@55a8bbcd main
[junit4:junit4]   2> 804 T2440 C152 oass.SolrIndexSearcher.getIndexDir WARNING WARNING: Directory impl does not support setting indexDir: org.apache.lucene.store.MockDirectoryWrapper
[junit4:junit4]   2> 804 T2440 C152 oasu.DirectUpdateHandler2.commit end_commit_flush
[junit4:junit4]   2> 805 T2447 oasc.SolrCore.registerSearcher [collection1] Registered new searcher Searcher@55a8bbcd main{StandardDirectoryReader(segments_2:4 _0(4.0):C3)}
[junit4:junit4]   2> 805 T2440 C152 UPDATE [collection1] webapp=/solr path=/update params={softCommit=false&wt=javabin&commit=true&waitSearcher=true&version=2} {commit=} 0 2
[junit4:junit4]   2> 807 T2410 C149 REQ [collection1] webapp=/solr path=/elevate params={wt=javabin&sort=id+desc&distrib=false&version=2&q=*:*&shards.qt=/elevate&rows=500&fl=id,+score,+[elevated]&qt=/elevate} hits=7 status=0 QTime=1 
[junit4:junit4]   2> 811 T2431 C151 REQ [collection1] webapp=/solr path=/elevate params={wt=javabin&sort=id+desc&version=2&q=*:*&rows=500&isShard=true&start=0&NOW=1342023117502&distrib=false&shards.qt=/elevate&fl=id,score&fsv=true&qt=/elevate&shard.url=[::1]:33332/solr|localhost:38245/solr} hits=2 status=0 QTime=0 
[junit4:junit4]   2> 815 T2441 C152 REQ [collection1] webapp=/solr path=/elevate params={wt=javabin&sort=id+desc&version=2&q=*:*&rows=500&isShard=true&start=0&NOW=1342023117502&distrib=false&shards.qt=/elevate&fl=id,score&fsv=true&qt=/elevate&shard.url=localhost:59152/solr|[::1]:33332/solr} hits=3 status=0 QTime=1 
[junit4:junit4]   2> 815 T2421 C150 REQ [collection1] webapp=/solr path=/elevate params={wt=javabin&sort=id+desc&version=2&q=*:*&rows=500&isShard=true&start=0&NOW=1342023117502&distrib=false&shards.qt=/elevate&fl=id,score&fsv=true&qt=/elevate&shard.url=localhost:43491/solr} hits=2 status=0 QTime=1 
[junit4:junit4]   2> 817 T2421 C150 REQ [collection1] webapp=/solr path=/elevate params={wt=javabin&version=2&q=*:*&ids=1.0,4.0&rows=500&isShard=true&NOW=1342023117502&distrib=false&shards.qt=/elevate&fl=id,+score,+[elevated]&qt=/elevate&shard.url=localhost:43491/solr} status=0 QTime=1 
[junit4:junit4]   2> 817 T2441 C152 REQ [collection1] webapp=/solr path=/elevate params={wt=javabin&version=2&q=*:*&ids=7.0,3.0,6.0&rows=500&isShard=true&NOW=1342023117502&distrib=false&shards.qt=/elevate&fl=id,+score,+[elevated]&qt=/elevate&shard.url=localhost:59152/solr|[::1]:33332/solr} status=0 QTime=0 
[junit4:junit4]   2> 817 T2431 C151 REQ [collection1] webapp=/solr path=/elevate params={wt=javabin&version=2&q=*:*&ids=5.0,2.0&rows=500&isShard=true&NOW=1342023117502&distrib=false&shards.qt=/elevate&fl=id,+score,+[elevated]&qt=/elevate&shard.url=[::1]:33332/solr|localhost:38245/solr} status=0 QTime=0 
[junit4:junit4]   2> 818 T2420 C150 REQ [collection1] webapp=/solr path=/elevate params={wt=javabin&shards=localhost:43491/solr,[::1]:33332/solr|localhost:38245/solr,localhost:59152/solr|[::1]:33332/solr&sort=id+desc&version=2&q=*:*&shards.qt=/elevate&rows=500&fl=id,+score,+[elevated]&qt=/elevate} status=0 QTime=9 
[junit4:junit4]   2> 819 T2407 oasc.CoreContainer.shutdown Shutting down CoreContainer instance=432125324
[junit4:junit4]   2> 819 T2407 oasc.SolrCore.close [collection1]  CLOSING SolrCore org.apache.solr.core.SolrCore@31708f2
[junit4:junit4]   2> 820 T2407 oasc.SolrCore.closeSearcher [collection1] Closing main searcher on request.
[junit4:junit4]   2> 820 T2407 oasu.DirectUpdateHandler2.close closing DirectUpdateHandler2{commits=1,autocommits=0,soft autocommits=0,optimizes=0,rollbacks=0,expungeDeletes=0,docsPending=0,adds=0,deletesById=0,deletesByQuery=0,errors=0,cumulative_adds=7,cumulative_deletesById=0,cumulative_deletesByQuery=1,cumulative_errors=0}
[junit4:junit4]   2> 823 T2407 oejsh.ContextHandler.doStop stopped o.e.j.s.ServletContextHandler{/solr,null}
[junit4:junit4]   2> 874 T2407 oasc.CoreContainer.shutdown Shutting down CoreContainer instance=413146354
[junit4:junit4]   2> 875 T2407 oasc.SolrCore.close [collection1]  CLOSING SolrCore org.apache.solr.core.SolrCore@557050dd
[junit4:junit4]   2> 875 T2407 oasc.SolrCore.closeSearcher [collection1] Closing main searcher on request.
[junit4:junit4]   2> 876 T2407 oasu.DirectUpdateHandler2.close closing DirectUpdateHandler2{commits=1,autocommits=0,soft autocommits=0,optimizes=0,rollbacks=0,expungeDeletes=0,docsPending=0,adds=0,deletesById=0,deletesByQuery=0,errors=0,cumulative_adds=2,cumulative_deletesById=0,cumulative_deletesByQuery=1,cumulative_errors=0}
[junit4:junit4]   2> 878 T2407 oejsh.ContextHandler.doStop stopped o.e.j.s.ServletContextHandler{/solr,null}
[junit4:junit4]   2> 930 T2407 oasc.CoreContainer.shutdown Shutting down CoreContainer instance=1005202860
[junit4:junit4]   2> 930 T2407 oasc.SolrCore.close [collection1]  CLOSING SolrCore org.apache.solr.core.SolrCore@797ce8fa
[junit4:junit4]   2> 931 T2407 oasc.SolrCore.closeSearcher [collection1] Closing main searcher on request.
[junit4:junit4]   2> 931 T2407 oasu.DirectUpdateHandler2.close closing DirectUpdateHandler2{commits=1,autocommits=0,soft autocommits=0,optimizes=0,rollbacks=0,expungeDeletes=0,docsPending=0,adds=0,deletesById=0,deletesByQuery=0,errors=0,cumulative_adds=2,cumulative_deletesById=0,cumulative_deletesByQuery=1,cumulative_errors=0}
[junit4:junit4]   2> 933 T2407 oejsh.ContextHandler.doStop stopped o.e.j.s.ServletContextHandler{/solr,null}
[junit4:junit4]   2> 985 T2407 oasc.CoreContainer.shutdown Shutting down CoreContainer instance=1064193188
[junit4:junit4]   2> 985 T2407 oasc.SolrCore.close [collection1]  CLOSING SolrCore org.apache.solr.core.SolrCore@452b0e7a
[junit4:junit4]   2> 986 T2407 oasc.SolrCore.closeSearcher [collection1] Closing main searcher on request.
[junit4:junit4]   2> 986 T2407 oasu.DirectUpdateHandler2.close closing DirectUpdateHandler2{commits=1,autocommits=0,soft autocommits=0,optimizes=0,rollbacks=0,expungeDeletes=0,docsPending=0,adds=0,deletesById=0,deletesByQuery=0,errors=0,cumulative_adds=3,cumulative_deletesById=0,cumulative_deletesByQuery=1,cumulative_errors=0}
[junit4:junit4]   2> 988 T2407 oejsh.ContextHandler.doStop stopped o.e.j.s.ServletContextHandler{/solr,null}
[junit4:junit4]   2> 1039 T2407 oas.SolrTestCaseJ4.tearDown ###Ending testDistribSearch
[junit4:junit4]   2> NOTE: reproduce with: ant test  -Dtestcase=DistributedQueryElevationComponentTest -Dtests.method=testDistribSearch -Dtests.seed=AB68DD5CEEF63A4 -Dtests.multiplier=3 -Dtests.slow=true -Dtests.locale=es_BO -Dtests.timezone=HST -Dtests.file.encoding=UTF-8
[junit4:junit4]   2>
[junit4:junit4]    > (@AfterClass output)
[junit4:junit4]   2> 1055 T2407 oas.SolrTestCaseJ4.deleteCore ###deleteCore
[junit4:junit4]   2> NOTE: test params are: codec=Lucene40: {plow_t=PostingsFormat(name=MockSep), text=Lucene40(minBlockSize=89 maxBlockSize=259), field_t=Lucene40(minBlockSize=89 maxBlockSize=259), id=PostingsFormat(name=MockSep), int_i=Lucene40(minBlockSize=89 maxBlockSize=259)}, sim=RandomSimilarityProvider(queryNorm=false,coord=true): {}, locale=es_BO, timezone=HST
[junit4:junit4]   2> NOTE: Linux 3.2.0-26-generic amd64/Oracle Corporation 1.8.0-ea (64-bit)/cpus=8,threads=1,free=30582640,total=304283648
[junit4:junit4]   2> NOTE: All tests run in this JVM: [CloudStateTest, FileBasedSpellCheckerTest, TestSystemIdResolver, TestWikipediaTokenizerFactory, TestOmitPositions, SolrPluginUtilsTest, TestGroupingSearch, TestTrie, IndexSchemaTest, TestHungarianLightStemFilterFactory, TestIBSimilarityFactory, ZkControllerTest, TestCollationKeyFilterFactory, TestPorterStemFilterFactory, TestRussianLightStemFilterFactory, SoftAutoCommitTest, ResourceLoaderTest, TestLMDirichletSimilarityFactory, SearchHandlerTest, SpellPossibilityIteratorTest, TestRealTimeGet, JsonLoaderTest, TestKeywordMarkerFilterFactory, TestReverseStringFilterFactory, TestDefaultSimilarityFactory, TestElisionFilterFactory, TestJapaneseReadingFormFilterFactory, TestPseudoReturnFields, DebugComponentTest, TestQuerySenderNoQuery, TestLRUCache, TestJmxMonitoredMap, URLClassifyProcessorTest, TestRemoteStreaming, TestRTGBase, ReturnFieldsTest, IndexSchemaRuntimeFieldTest, TestSolrDeletionPolicy1, DistributedTermsComponentTest, TestStressReorder, TestNorwegianMinimalStemFilterFactory, PrimUtilsTest, SpellCheckCollatorTest, PolyFieldTest, SampleTest, TestHunspellStemFilterFactory, SuggesterFSTTest, MultiTermTest, QueryEqualityTest, TestStressLucene, TestJapaneseIterationMarkCharFilterFactory, TestPropInjectDefaults, TestCSVResponseWriter, TestUtils, TestBeiderMorseFilterFactory, TestPortugueseLightStemFilterFactory, StandardRequestHandlerTest, TestStopFilterFactory, TestSuggestSpellingConverter, TestMultiCoreConfBootstrap, TestShingleFilterFactory, TestFastLRUCache, TestJapaneseTokenizerFactory, TermVectorComponentTest, WordBreakSolrSpellCheckerTest, SignatureUpdateProcessorFactoryTest, TestWriterPerf, TestEnglishMinimalStemFilterFactory, TestGermanMinimalStemFilterFactory, TestGalicianMinimalStemFilterFactory, TestDocSet, OverseerTest, FullSolrCloudTest, SpellCheckComponentTest, FullSolrCloudDistribCmdsTest, TestReplicationHandler, LeaderElectionTest, DistributedSpellCheckComponentTest, TestDistributedGrouping, CloudStateUpdateTest, TestDistributedSearch, TestExtendedDismaxParser, BasicZkTest, ZkSolrClientTest, TestFaceting, TestRecovery, TestJoin, SolrCoreTest, IndexBasedSpellCheckerTest, TestRangeQuery, DirectUpdateHandlerTest, TestCoreContainer, TestSort, DirectSolrSpellCheckerTest, ConvertedLegacyTest, PeerSyncTest, QueryElevationComponentTest, SortByFunctionTest, TestBinaryResponseWriter, TestJmxIntegration, TestIndexSearcher, CoreAdminHandlerTest, SolrRequestParserTest, DirectSolrConnectionTest, TestWordDelimiterFilterFactory, DocumentBuilderTest, MBeansHandlerTest, DistributedQueryElevationComponentTest]
[junit4:junit4]   2> 
[junit4:junit4] Completed on J1 in 1.06s, 1 test, 1 error <<< FAILURES!

[...truncated 457 lines...]
BUILD FAILED
/mnt/ssd/jenkins/workspace/Lucene-Solr-4.x-Linux-Java8-64/checkout/build.xml:29: The following error occurred while executing this line:
/mnt/ssd/jenkins/workspace/Lucene-Solr-4.x-Linux-Java8-64/checkout/solr/build.xml:144: The following error occurred while executing this line:
/mnt/ssd/jenkins/workspace/Lucene-Solr-4.x-Linux-Java8-64/checkout/lucene/module-build.xml:62: The following error occurred while executing this line:
/mnt/ssd/jenkins/workspace/Lucene-Solr-4.x-Linux-Java8-64/checkout/lucene/common-build.xml:1095: The following error occurred while executing this line:
/mnt/ssd/jenkins/workspace/Lucene-Solr-4.x-Linux-Java8-64/checkout/lucene/common-build.xml:792: There were test failures: 299 suites, 1062 tests, 2 errors, 5 ignored

Total time: 23 minutes 59 seconds
Build step 'Execute shell' marked build as failure
Archiving artifacts
Recording test results
Email was triggered for: Failure
Sending email for trigger: Failure




Mime
View raw message