lucene-dev mailing list archives

Site index · List index
Message view « Date » · « Thread »
Top « Date » · « Thread »
From Apache Jenkins Server <jenk...@builds.apache.org>
Subject [JENKINS] Lucene-Solr-tests-only-trunk-java7 - Build # 2856 - Still Failing
Date Mon, 02 Jul 2012 08:56:51 GMT
Build: https://builds.apache.org/job/Lucene-Solr-tests-only-trunk-java7/2856/

1 tests failed.
FAILED:  org.apache.solr.cloud.ChaosMonkeySafeLeaderTest.testDistribSearch

Error Message:
Timeout occured while waiting response from server at: http://localhost:29985/solr/collection1

Stack Trace:
org.apache.solr.client.solrj.SolrServerException: Timeout occured while waiting response from
server at: http://localhost:29985/solr/collection1
	at __randomizedtesting.SeedInfo.seed([E0EA17EEEEC270FF:610C99F6999D10C3]:0)
	at org.apache.solr.client.solrj.impl.HttpSolrServer.request(HttpSolrServer.java:413)
	at org.apache.solr.client.solrj.impl.HttpSolrServer.request(HttpSolrServer.java:182)
	at org.apache.solr.client.solrj.request.QueryRequest.process(QueryRequest.java:90)
	at org.apache.solr.client.solrj.SolrServer.query(SolrServer.java:324)
	at org.apache.solr.cloud.FullSolrCloudTest.checkShardConsistency(FullSolrCloudTest.java:1107)
	at org.apache.solr.cloud.ChaosMonkeySafeLeaderTest.doTest(ChaosMonkeySafeLeaderTest.java:114)
	at org.apache.solr.BaseDistributedSearchTestCase.testDistribSearch(BaseDistributedSearchTestCase.java:680)
	at sun.reflect.NativeMethodAccessorImpl.invoke0(Native Method)
	at sun.reflect.NativeMethodAccessorImpl.invoke(NativeMethodAccessorImpl.java:57)
	at sun.reflect.DelegatingMethodAccessorImpl.invoke(DelegatingMethodAccessorImpl.java:43)
	at java.lang.reflect.Method.invoke(Method.java:601)
	at com.carrotsearch.randomizedtesting.RandomizedRunner.invoke(RandomizedRunner.java:1969)
	at com.carrotsearch.randomizedtesting.RandomizedRunner.access$1100(RandomizedRunner.java:132)
	at com.carrotsearch.randomizedtesting.RandomizedRunner$6.evaluate(RandomizedRunner.java:814)
	at com.carrotsearch.randomizedtesting.RandomizedRunner$7.evaluate(RandomizedRunner.java:875)
	at com.carrotsearch.randomizedtesting.RandomizedRunner$8.evaluate(RandomizedRunner.java:889)
	at com.carrotsearch.randomizedtesting.rules.SystemPropertiesRestoreRule$1.evaluate(SystemPropertiesRestoreRule.java:53)
	at org.apache.lucene.util.TestRuleSetupTeardownChained$1.evaluate(TestRuleSetupTeardownChained.java:50)
	at org.apache.lucene.util.TestRuleFieldCacheSanity$1.evaluate(TestRuleFieldCacheSanity.java:32)
	at org.apache.lucene.util.AbstractBeforeAfterRule$1.evaluate(AbstractBeforeAfterRule.java:45)
	at com.carrotsearch.randomizedtesting.rules.SystemPropertiesInvariantRule$1.evaluate(SystemPropertiesInvariantRule.java:55)
	at org.apache.lucene.util.TestRuleReportUncaughtExceptions$1.evaluate(TestRuleReportUncaughtExceptions.java:68)
	at org.apache.lucene.util.TestRuleThreadAndTestName$1.evaluate(TestRuleThreadAndTestName.java:48)
	at org.apache.lucene.util.TestRuleIgnoreAfterMaxFailures$1.evaluate(TestRuleIgnoreAfterMaxFailures.java:70)
	at org.apache.lucene.util.TestRuleMarkFailure$1.evaluate(TestRuleMarkFailure.java:48)
	at com.carrotsearch.randomizedtesting.RandomizedRunner.runSingleTest(RandomizedRunner.java:821)
	at com.carrotsearch.randomizedtesting.RandomizedRunner.access$700(RandomizedRunner.java:132)
	at com.carrotsearch.randomizedtesting.RandomizedRunner$3$1.run(RandomizedRunner.java:669)
	at com.carrotsearch.randomizedtesting.RandomizedRunner$3.evaluate(RandomizedRunner.java:695)
	at com.carrotsearch.randomizedtesting.RandomizedRunner$4.evaluate(RandomizedRunner.java:734)
	at com.carrotsearch.randomizedtesting.RandomizedRunner$5.evaluate(RandomizedRunner.java:745)
	at com.carrotsearch.randomizedtesting.rules.SystemPropertiesRestoreRule$1.evaluate(SystemPropertiesRestoreRule.java:53)
	at org.apache.lucene.util.AbstractBeforeAfterRule$1.evaluate(AbstractBeforeAfterRule.java:45)
	at org.apache.lucene.util.TestRuleReportUncaughtExceptions$1.evaluate(TestRuleReportUncaughtExceptions.java:68)
	at org.apache.lucene.util.TestRuleStoreClassName$1.evaluate(TestRuleStoreClassName.java:38)
	at org.apache.lucene.util.TestRuleIcuHack$1.evaluate(TestRuleIcuHack.java:51)
	at com.carrotsearch.randomizedtesting.rules.SystemPropertiesInvariantRule$1.evaluate(SystemPropertiesInvariantRule.java:55)
	at org.apache.lucene.util.TestRuleNoInstanceHooksOverrides$1.evaluate(TestRuleNoInstanceHooksOverrides.java:53)
	at org.apache.lucene.util.TestRuleNoStaticHooksShadowing$1.evaluate(TestRuleNoStaticHooksShadowing.java:52)
	at org.apache.lucene.util.TestRuleAssertionsRequired$1.evaluate(TestRuleAssertionsRequired.java:36)
	at org.apache.lucene.util.TestRuleMarkFailure$1.evaluate(TestRuleMarkFailure.java:48)
	at org.apache.lucene.util.TestRuleIgnoreAfterMaxFailures$1.evaluate(TestRuleIgnoreAfterMaxFailures.java:70)
	at org.apache.lucene.util.TestRuleIgnoreTestSuites$1.evaluate(TestRuleIgnoreTestSuites.java:55)
	at com.carrotsearch.randomizedtesting.RandomizedRunner.runSuite(RandomizedRunner.java:605)
	at com.carrotsearch.randomizedtesting.RandomizedRunner.access$400(RandomizedRunner.java:132)
	at com.carrotsearch.randomizedtesting.RandomizedRunner$2.run(RandomizedRunner.java:551)
Caused by: java.net.SocketTimeoutException: Read timed out
	at java.net.SocketInputStream.socketRead0(Native Method)
	at java.net.SocketInputStream.read(SocketInputStream.java:150)
	at java.net.SocketInputStream.read(SocketInputStream.java:121)
	at org.apache.http.impl.io.AbstractSessionInputBuffer.fillBuffer(AbstractSessionInputBuffer.java:149)
	at org.apache.http.impl.io.SocketInputBuffer.fillBuffer(SocketInputBuffer.java:111)
	at org.apache.http.impl.io.AbstractSessionInputBuffer.readLine(AbstractSessionInputBuffer.java:264)
	at org.apache.http.impl.conn.DefaultResponseParser.parseHead(DefaultResponseParser.java:98)
	at org.apache.http.impl.io.AbstractMessageParser.parse(AbstractMessageParser.java:252)
	at org.apache.http.impl.AbstractHttpClientConnection.receiveResponseHeader(AbstractHttpClientConnection.java:282)
	at org.apache.http.impl.conn.DefaultClientConnection.receiveResponseHeader(DefaultClientConnection.java:247)
	at org.apache.http.impl.conn.AbstractClientConnAdapter.receiveResponseHeader(AbstractClientConnAdapter.java:216)
	at org.apache.http.protocol.HttpRequestExecutor.doReceiveResponse(HttpRequestExecutor.java:298)
	at org.apache.http.protocol.HttpRequestExecutor.execute(HttpRequestExecutor.java:125)
	at org.apache.http.impl.client.DefaultRequestDirector.tryExecute(DefaultRequestDirector.java:647)
	at org.apache.http.impl.client.DefaultRequestDirector.execute(DefaultRequestDirector.java:464)
	at org.apache.http.impl.client.AbstractHttpClient.execute(AbstractHttpClient.java:820)
	at org.apache.http.impl.client.AbstractHttpClient.execute(AbstractHttpClient.java:754)
	at org.apache.http.impl.client.AbstractHttpClient.execute(AbstractHttpClient.java:732)
	at org.apache.solr.client.solrj.impl.HttpSolrServer.request(HttpSolrServer.java:353)
	... 45 more




Build Log:
[...truncated 42254 lines...]
   [junit4]   2> 144466 T19 oasc.RecoveryStrategy.close WARNING Stopping recovery for core
collection1 zkNodeName=127.0.0.1:38116_solr_collection1
   [junit4]   2> 144466 T19 oasc.SolrCore.close [collection1]  CLOSING SolrCore org.apache.solr.core.SolrCore@444d9ce6
   [junit4]   2> 144468 T19 oasc.SolrCore.closeSearcher [collection1] Closing main searcher
on request.
   [junit4]   2> 144469 T19 oasu.DirectUpdateHandler2.close closing DirectUpdateHandler2{commits=2,autocommits=0,soft
autocommits=0,optimizes=0,rollbacks=0,expungeDeletes=0,docsPending=0,adds=0,deletesById=0,deletesByQuery=0,errors=0,cumulative_adds=302,cumulative_deletesById=134,cumulative_deletesByQuery=0,cumulative_errors=0}
   [junit4]   2> 144470 T19 oasc.RecoveryStrategy.close WARNING Stopping recovery for core
collection1 zkNodeName=127.0.0.1:38116_solr_collection1
   [junit4]   2> 144547 T437 oaz.ClientCnxn$SendThread.run Client session timed out, have
not heard from server in 13111ms for sessionid 0x13846dc294f0020, closing socket connection
and attempting reconnect
   [junit4]   2> 144571 T368 oaz.ClientCnxn$EventThread.run EventThread shut down
   [junit4]   2> 144571 T19 oaz.ZooKeeper.close Session: 0x13846dc294f001b closed
   [junit4]   2> 144572 T19 oejsh.ContextHandler.doStop stopped o.e.j.s.ServletContextHandler{/solr,null}
   [junit4]   2> 144624 T19 oasc.CoreContainer.shutdown Shutting down CoreContainer instance=1479140038
   [junit4]   2> 144624 T19 oasc.RecoveryStrategy.close WARNING Stopping recovery for core
collection1 zkNodeName=127.0.0.1:17879_solr_collection1
   [junit4]   2> 144624 T19 oasc.SolrCore.close [collection1]  CLOSING SolrCore org.apache.solr.core.SolrCore@3f6df5a
   [junit4]   2> 144626 T19 oasc.SolrCore.closeSearcher [collection1] Closing main searcher
on request.
   [junit4]   2> 144627 T19 oasu.DirectUpdateHandler2.close closing DirectUpdateHandler2{commits=2,autocommits=0,soft
autocommits=0,optimizes=0,rollbacks=0,expungeDeletes=0,docsPending=0,adds=0,deletesById=0,deletesByQuery=0,errors=0,cumulative_adds=316,cumulative_deletesById=149,cumulative_deletesByQuery=0,cumulative_errors=0}
   [junit4]   2> 144628 T19 oasc.RecoveryStrategy.close WARNING Stopping recovery for core
collection1 zkNodeName=127.0.0.1:17879_solr_collection1
   [junit4]   2> 144729 T382 oaz.ClientCnxn$EventThread.run EventThread shut down
   [junit4]   2> 144729 T19 oaz.ZooKeeper.close Session: 0x13846dc294f001c closed
   [junit4]   2> 144729 T19 oejsh.ContextHandler.doStop stopped o.e.j.s.ServletContextHandler{/solr,null}
   [junit4]   2> 144782 T19 oasc.CoreContainer.shutdown Shutting down CoreContainer instance=388795395
   [junit4]   2> 144782 T19 oasc.RecoveryStrategy.close WARNING Stopping recovery for core
collection1 zkNodeName=127.0.0.1:28512_solr_collection1
   [junit4]   2> 144782 T19 oasc.SolrCore.close [collection1]  CLOSING SolrCore org.apache.solr.core.SolrCore@512aae83
   [junit4]   2> 144784 T19 oasc.SolrCore.closeSearcher [collection1] Closing main searcher
on request.
   [junit4]   2> 144784 T19 oasu.DirectUpdateHandler2.close closing DirectUpdateHandler2{commits=2,autocommits=0,soft
autocommits=0,optimizes=0,rollbacks=0,expungeDeletes=0,docsPending=0,adds=0,deletesById=0,deletesByQuery=0,errors=0,cumulative_adds=297,cumulative_deletesById=131,cumulative_deletesByQuery=0,cumulative_errors=0}
   [junit4]   2> 144785 T19 oasc.RecoveryStrategy.close WARNING Stopping recovery for core
collection1 zkNodeName=127.0.0.1:28512_solr_collection1
   [junit4]   2> 144886 T19 oaz.ZooKeeper.close Session: 0x13846dc294f001d closed
   [junit4]   2> 144887 T19 oejsh.ContextHandler.doStop stopped o.e.j.s.ServletContextHandler{/solr,null}
   [junit4]   2> 144890 T397 oaz.ClientCnxn$EventThread.run EventThread shut down
   [junit4]   2> 144939 T19 oasc.CoreContainer.shutdown Shutting down CoreContainer instance=1840061338
   [junit4]   2> 144939 T19 oasc.RecoveryStrategy.close WARNING Stopping recovery for core
collection1 zkNodeName=127.0.0.1:56098_solr_collection1
   [junit4]   2> 144939 T19 oasc.SolrCore.close [collection1]  CLOSING SolrCore org.apache.solr.core.SolrCore@5d053579
   [junit4]   2> 144941 T19 oasc.SolrCore.closeSearcher [collection1] Closing main searcher
on request.
   [junit4]   2> 144942 T19 oasu.DirectUpdateHandler2.close closing DirectUpdateHandler2{commits=2,autocommits=0,soft
autocommits=0,optimizes=0,rollbacks=0,expungeDeletes=0,docsPending=0,adds=0,deletesById=0,deletesByQuery=0,errors=0,cumulative_adds=316,cumulative_deletesById=148,cumulative_deletesByQuery=0,cumulative_errors=0}
   [junit4]   2> 144942 T19 oasc.RecoveryStrategy.close WARNING Stopping recovery for core
collection1 zkNodeName=127.0.0.1:56098_solr_collection1
   [junit4]   2> 145003 T423 oaz.ClientCnxn$SendThread.run Client session timed out, have
not heard from server in 13603ms for sessionid 0x13846dc294f001f, closing socket connection
and attempting reconnect
   [junit4]   2> 145043 T411 oaz.ClientCnxn$EventThread.run EventThread shut down
   [junit4]   2> 145043 T19 oaz.ZooKeeper.close Session: 0x13846dc294f001e closed
   [junit4]   2> 145044 T19 oejsh.ContextHandler.doStop stopped o.e.j.s.ServletContextHandler{/solr,null}
   [junit4]   2> 145096 T19 oasc.CoreContainer.shutdown Shutting down CoreContainer instance=898866762
   [junit4]   2> 145096 T19 oasc.RecoveryStrategy.close WARNING Stopping recovery for core
collection1 zkNodeName=127.0.0.1:65182_solr_collection1
   [junit4]   2> 145096 T19 oasc.SolrCore.close [collection1]  CLOSING SolrCore org.apache.solr.core.SolrCore@7e89183d
   [junit4]   2> 145099 T19 oasc.SolrCore.closeSearcher [collection1] Closing main searcher
on request.
   [junit4]   2> 145099 T19 oasu.DirectUpdateHandler2.close closing DirectUpdateHandler2{commits=3,autocommits=0,soft
autocommits=0,optimizes=0,rollbacks=0,expungeDeletes=0,docsPending=0,adds=0,deletesById=0,deletesByQuery=0,errors=0,cumulative_adds=293,cumulative_deletesById=142,cumulative_deletesByQuery=0,cumulative_errors=0}
   [junit4]   2> 145100 T19 oasc.RecoveryStrategy.close WARNING Stopping recovery for core
collection1 zkNodeName=127.0.0.1:65182_solr_collection1
   [junit4]   2> 145104 T424 oaz.ClientCnxn$EventThread.run EventThread shut down
   [junit4]   2> 145104 T19 oaz.ZooKeeper.close Session: 0x13846dc294f001f closed
   [junit4]   2> 145104 T19 oejsh.ContextHandler.doStop stopped o.e.j.s.ServletContextHandler{/solr,null}
   [junit4]   2> 145156 T19 oasc.CoreContainer.shutdown Shutting down CoreContainer instance=1861016831
   [junit4]   2> 145156 T19 oasc.RecoveryStrategy.close WARNING Stopping recovery for core
collection1 zkNodeName=127.0.0.1:49932_solr_collection1
   [junit4]   2> 145156 T19 oasc.SolrCore.close [collection1]  CLOSING SolrCore org.apache.solr.core.SolrCore@4fee370f
   [junit4]   2> 145158 T19 oasc.SolrCore.closeSearcher [collection1] Closing main searcher
on request.
   [junit4]   2> 145158 T19 oasu.DirectUpdateHandler2.close closing DirectUpdateHandler2{commits=3,autocommits=0,soft
autocommits=0,optimizes=0,rollbacks=0,expungeDeletes=0,docsPending=0,adds=0,deletesById=0,deletesByQuery=0,errors=0,cumulative_adds=338,cumulative_deletesById=157,cumulative_deletesByQuery=0,cumulative_errors=0}
   [junit4]   2> 145159 T19 oasc.RecoveryStrategy.close WARNING Stopping recovery for core
collection1 zkNodeName=127.0.0.1:49932_solr_collection1
   [junit4]   2> 145299 T465 oaz.ClientCnxn$SendThread.run Client session timed out, have
not heard from server in 13798ms for sessionid 0x13846dc294f0022, closing socket connection
and attempting reconnect
   [junit4]   2> 145606 T479 oaz.ClientCnxn$SendThread.run Client session timed out, have
not heard from server in 13937ms for sessionid 0x13846dc294f0023, closing socket connection
and attempting reconnect
   [junit4]   2> 145656 T451 oaz.ClientCnxn$SendThread.run Client session timed out, have
not heard from server in 13756ms for sessionid 0x13846dc294f0021, closing socket connection
and attempting reconnect
   [junit4]   2> 146479 T437 oaz.ClientCnxn$SendThread.startConnect Opening socket connection
to server localhost/127.0.0.1:34859
   [junit4]   2> 146722 T465 oaz.ClientCnxn$SendThread.startConnect Opening socket connection
to server localhost/127.0.0.1:34859
   [junit4]   2> 147049 T451 oaz.ClientCnxn$SendThread.startConnect Opening socket connection
to server localhost/127.0.0.1:34859
   [junit4]   2> 147373 T479 oaz.ClientCnxn$SendThread.startConnect Opening socket connection
to server localhost/127.0.0.1:34859
   [junit4]   2> 156750 T438 oaz.ClientCnxn$EventThread.run EventThread shut down
   [junit4]   2> 156750 T19 oaz.ZooKeeper.close Session: 0x13846dc294f0020 closed
   [junit4]   2> 156751 T19 oejsh.ContextHandler.doStop stopped o.e.j.s.ServletContextHandler{/solr,null}
   [junit4]   2> 156803 T19 oasc.CoreContainer.shutdown Shutting down CoreContainer instance=58538877
   [junit4]   2> 156803 T19 oasc.RecoveryStrategy.close WARNING Stopping recovery for core
collection1 zkNodeName=127.0.0.1:13107_solr_collection1
   [junit4]   2> 156804 T19 oasc.SolrCore.close [collection1]  CLOSING SolrCore org.apache.solr.core.SolrCore@1bc5130a
   [junit4]   2> 156806 T19 oasc.SolrCore.closeSearcher [collection1] Closing main searcher
on request.
   [junit4]   2> 156806 T19 oasu.DirectUpdateHandler2.close closing DirectUpdateHandler2{commits=3,autocommits=0,soft
autocommits=0,optimizes=0,rollbacks=0,expungeDeletes=0,docsPending=0,adds=0,deletesById=0,deletesByQuery=0,errors=0,cumulative_adds=306,cumulative_deletesById=139,cumulative_deletesByQuery=0,cumulative_errors=0}
   [junit4]   2> 156807 T19 oasc.RecoveryStrategy.close WARNING Stopping recovery for core
collection1 zkNodeName=127.0.0.1:13107_solr_collection1
   [junit4]   2> 157859 T452 oaz.ClientCnxn$EventThread.run EventThread shut down
   [junit4]   2> 157859 T19 oaz.ZooKeeper.close Session: 0x13846dc294f0021 closed
   [junit4]   2> 157860 T19 oejsh.ContextHandler.doStop stopped o.e.j.s.ServletContextHandler{/solr,null}
   [junit4]   2> 157912 T19 oasc.CoreContainer.shutdown Shutting down CoreContainer instance=944093735
   [junit4]   2> 157912 T19 oasc.RecoveryStrategy.close WARNING Stopping recovery for core
collection1 zkNodeName=127.0.0.1:42303_solr_collection1
   [junit4]   2> 157912 T19 oasc.SolrCore.close [collection1]  CLOSING SolrCore org.apache.solr.core.SolrCore@258167fd
   [junit4]   2> 157914 T19 oasc.SolrCore.closeSearcher [collection1] Closing main searcher
on request.
   [junit4]   2> 157915 T19 oasu.DirectUpdateHandler2.close closing DirectUpdateHandler2{commits=3,autocommits=0,soft
autocommits=0,optimizes=0,rollbacks=0,expungeDeletes=0,docsPending=0,adds=0,deletesById=0,deletesByQuery=0,errors=0,cumulative_adds=270,cumulative_deletesById=129,cumulative_deletesByQuery=0,cumulative_errors=0}
   [junit4]   2> 157916 T19 oasc.RecoveryStrategy.close WARNING Stopping recovery for core
collection1 zkNodeName=127.0.0.1:42303_solr_collection1
   [junit4]   2> 158018 T466 oaz.ClientCnxn$EventThread.run EventThread shut down
   [junit4]   2> 158018 T19 oaz.ZooKeeper.close Session: 0x13846dc294f0022 closed
   [junit4]   2> 158019 T19 oejsh.ContextHandler.doStop stopped o.e.j.s.ServletContextHandler{/solr,null}
   [junit4]   2> 158071 T19 oasc.CoreContainer.shutdown Shutting down CoreContainer instance=1573108579
   [junit4]   2> 158071 T19 oasc.RecoveryStrategy.close WARNING Stopping recovery for core
collection1 zkNodeName=127.0.0.1:32482_solr_collection1
   [junit4]   2> 158071 T19 oasc.SolrCore.close [collection1]  CLOSING SolrCore org.apache.solr.core.SolrCore@6d52482a
   [junit4]   2> 158075 T19 oasc.SolrCore.closeSearcher [collection1] Closing main searcher
on request.
   [junit4]   2> 158075 T19 oasu.DirectUpdateHandler2.close closing DirectUpdateHandler2{commits=3,autocommits=0,soft
autocommits=0,optimizes=0,rollbacks=0,expungeDeletes=0,docsPending=0,adds=0,deletesById=0,deletesByQuery=0,errors=0,cumulative_adds=301,cumulative_deletesById=134,cumulative_deletesByQuery=0,cumulative_errors=0}
   [junit4]   2> 158076 T19 oasc.RecoveryStrategy.close WARNING Stopping recovery for core
collection1 zkNodeName=127.0.0.1:32482_solr_collection1
   [junit4]   2> 158178 T480 oaz.ClientCnxn$EventThread.run EventThread shut down
   [junit4]   2> 158178 T19 oaz.ZooKeeper.close Session: 0x13846dc294f0023 closed
   [junit4]   2> 158179 T19 oejsh.ContextHandler.doStop stopped o.e.j.s.ServletContextHandler{/solr,null}
   [junit4]   2> 158548 T19 oas.SolrTestCaseJ4.tearDown ###Ending testDistribSearch
   [junit4]   1> I ran for 25.671sec. I stopped 0 and I started 0. I also expired 0 and
caused 0 connection losses
   [junit4]   2> NOTE: reproduce with: ant test  -Dtestcase=ChaosMonkeySafeLeaderTest -Dtests.method=testDistribSearch
-Dtests.seed=E0EA17EEEEC270FF -Dtests.multiplier=3 -Dtests.slow=true -Dtests.locale=tr -Dtests.timezone=America/Montevideo
-Dargs="-Dfile.encoding=US-ASCII"
   [junit4]   1> 
   [junit4]   2>
   [junit4]    > (@AfterClass output)
   [junit4]   2> 158597 T19 oas.SolrTestCaseJ4.deleteCore ###deleteCore
   [junit4]   2> NOTE: test params are: codec=Lucene40: {}, sim=DefaultSimilarity, locale=tr,
timezone=America/Montevideo
   [junit4]   2> NOTE: FreeBSD 9.0-RELEASE amd64/Oracle Corporation 1.7.0_04 (64-bit)/cpus=16,threads=2,free=276470264,total=450887680
   [junit4]   2> NOTE: All tests run in this JVM: [UniqFieldsUpdateProcessorFactoryTest,
TestOmitPositions, ResourceLoaderTest, TermVectorComponentTest, TestArbitraryIndexDir, ChaosMonkeySafeLeaderTest]
   [junit4]   2> 
   [junit4] Completed on J1 in 158.62s, 1 test, 1 error <<< FAILURES!
[...truncated 639 lines...]

[...truncated 42994 lines...]

[...truncated 42994 lines...]

[...truncated 42994 lines...]

[...truncated 42994 lines...]

[...truncated 42994 lines...]



Mime
View raw message