lucene-dev mailing list archives

Site index · List index
Message view « Date » · « Thread »
Top « Date » · « Thread »
From Apache Jenkins Server <jenk...@builds.apache.org>
Subject [JENKINS] Lucene-Solr-tests-only-4.x - Build # 329 - Still Failing
Date Tue, 24 Jul 2012 21:41:11 GMT
Build: https://builds.apache.org/job/Lucene-Solr-tests-only-4.x/329/

1 tests failed.
FAILED:  org.apache.solr.cloud.FullSolrCloudTest.testDistribSearch

Error Message:
Timeout occured while waiting response from server at: http://localhost:63218/solr/collection1

Stack Trace:
org.apache.solr.client.solrj.SolrServerException: Timeout occured while waiting response from
server at: http://localhost:63218/solr/collection1
	at __randomizedtesting.SeedInfo.seed([FA6B9D84D0BC8140:7B8D139CA7E3E17C]:0)
	at org.apache.solr.client.solrj.impl.HttpSolrServer.request(HttpSolrServer.java:410)
	at org.apache.solr.client.solrj.impl.HttpSolrServer.request(HttpSolrServer.java:182)
	at org.apache.solr.client.solrj.request.AbstractUpdateRequest.process(AbstractUpdateRequest.java:117)
	at org.apache.solr.cloud.FullSolrCloudTest.index_specific(FullSolrCloudTest.java:503)
	at org.apache.solr.cloud.FullSolrCloudTest.brindDownShardIndexSomeDocsAndRecover(FullSolrCloudTest.java:739)
	at org.apache.solr.cloud.FullSolrCloudTest.doTest(FullSolrCloudTest.java:562)
	at org.apache.solr.BaseDistributedSearchTestCase.testDistribSearch(BaseDistributedSearchTestCase.java:679)
	at sun.reflect.NativeMethodAccessorImpl.invoke0(Native Method)
	at sun.reflect.NativeMethodAccessorImpl.invoke(NativeMethodAccessorImpl.java:57)
	at sun.reflect.DelegatingMethodAccessorImpl.invoke(DelegatingMethodAccessorImpl.java:43)
	at java.lang.reflect.Method.invoke(Method.java:616)
	at com.carrotsearch.randomizedtesting.RandomizedRunner.invoke(RandomizedRunner.java:1995)
	at com.carrotsearch.randomizedtesting.RandomizedRunner.access$1100(RandomizedRunner.java:132)
	at com.carrotsearch.randomizedtesting.RandomizedRunner$6.evaluate(RandomizedRunner.java:818)
	at com.carrotsearch.randomizedtesting.RandomizedRunner$7.evaluate(RandomizedRunner.java:877)
	at com.carrotsearch.randomizedtesting.RandomizedRunner$8.evaluate(RandomizedRunner.java:891)
	at com.carrotsearch.randomizedtesting.rules.SystemPropertiesRestoreRule$1.evaluate(SystemPropertiesRestoreRule.java:53)
	at org.apache.lucene.util.TestRuleSetupTeardownChained$1.evaluate(TestRuleSetupTeardownChained.java:50)
	at org.apache.lucene.util.TestRuleFieldCacheSanity$1.evaluate(TestRuleFieldCacheSanity.java:32)
	at org.apache.lucene.util.AbstractBeforeAfterRule$1.evaluate(AbstractBeforeAfterRule.java:45)
	at com.carrotsearch.randomizedtesting.rules.SystemPropertiesInvariantRule$1.evaluate(SystemPropertiesInvariantRule.java:55)
	at org.apache.lucene.util.TestRuleReportUncaughtExceptions$1.evaluate(TestRuleReportUncaughtExceptions.java:68)
	at org.apache.lucene.util.TestRuleThreadAndTestName$1.evaluate(TestRuleThreadAndTestName.java:48)
	at org.apache.lucene.util.TestRuleIgnoreAfterMaxFailures$1.evaluate(TestRuleIgnoreAfterMaxFailures.java:70)
	at org.apache.lucene.util.TestRuleMarkFailure$1.evaluate(TestRuleMarkFailure.java:48)
	at com.carrotsearch.randomizedtesting.RandomizedRunner.runSingleTest(RandomizedRunner.java:825)
	at com.carrotsearch.randomizedtesting.RandomizedRunner.access$700(RandomizedRunner.java:132)
	at com.carrotsearch.randomizedtesting.RandomizedRunner$3$1.run(RandomizedRunner.java:671)
	at com.carrotsearch.randomizedtesting.RandomizedRunner$3.evaluate(RandomizedRunner.java:697)
	at com.carrotsearch.randomizedtesting.RandomizedRunner$4.evaluate(RandomizedRunner.java:736)
	at com.carrotsearch.randomizedtesting.RandomizedRunner$5.evaluate(RandomizedRunner.java:747)
	at com.carrotsearch.randomizedtesting.rules.SystemPropertiesRestoreRule$1.evaluate(SystemPropertiesRestoreRule.java:53)
	at org.apache.lucene.util.AbstractBeforeAfterRule$1.evaluate(AbstractBeforeAfterRule.java:45)
	at org.apache.lucene.util.TestRuleReportUncaughtExceptions$1.evaluate(TestRuleReportUncaughtExceptions.java:68)
	at org.apache.lucene.util.TestRuleStoreClassName$1.evaluate(TestRuleStoreClassName.java:38)
	at org.apache.lucene.util.TestRuleIcuHack$1.evaluate(TestRuleIcuHack.java:51)
	at com.carrotsearch.randomizedtesting.rules.SystemPropertiesInvariantRule$1.evaluate(SystemPropertiesInvariantRule.java:55)
	at org.apache.lucene.util.TestRuleNoInstanceHooksOverrides$1.evaluate(TestRuleNoInstanceHooksOverrides.java:53)
	at org.apache.lucene.util.TestRuleNoStaticHooksShadowing$1.evaluate(TestRuleNoStaticHooksShadowing.java:52)
	at org.apache.lucene.util.TestRuleAssertionsRequired$1.evaluate(TestRuleAssertionsRequired.java:36)
	at org.apache.lucene.util.TestRuleMarkFailure$1.evaluate(TestRuleMarkFailure.java:48)
	at org.apache.lucene.util.TestRuleIgnoreAfterMaxFailures$1.evaluate(TestRuleIgnoreAfterMaxFailures.java:70)
	at org.apache.lucene.util.TestRuleIgnoreTestSuites$1.evaluate(TestRuleIgnoreTestSuites.java:55)
	at com.carrotsearch.randomizedtesting.RandomizedRunner.runSuite(RandomizedRunner.java:605)
	at com.carrotsearch.randomizedtesting.RandomizedRunner.access$400(RandomizedRunner.java:132)
	at com.carrotsearch.randomizedtesting.RandomizedRunner$2.run(RandomizedRunner.java:551)
Caused by: java.net.SocketTimeoutException: Read timed out
	at java.net.SocketInputStream.socketRead0(Native Method)
	at java.net.SocketInputStream.read(SocketInputStream.java:146)
	at org.apache.http.impl.io.AbstractSessionInputBuffer.fillBuffer(AbstractSessionInputBuffer.java:149)
	at org.apache.http.impl.io.SocketInputBuffer.fillBuffer(SocketInputBuffer.java:111)
	at org.apache.http.impl.io.AbstractSessionInputBuffer.readLine(AbstractSessionInputBuffer.java:264)
	at org.apache.http.impl.conn.DefaultResponseParser.parseHead(DefaultResponseParser.java:98)
	at org.apache.http.impl.io.AbstractMessageParser.parse(AbstractMessageParser.java:252)
	at org.apache.http.impl.AbstractHttpClientConnection.receiveResponseHeader(AbstractHttpClientConnection.java:282)
	at org.apache.http.impl.conn.DefaultClientConnection.receiveResponseHeader(DefaultClientConnection.java:247)
	at org.apache.http.impl.conn.AbstractClientConnAdapter.receiveResponseHeader(AbstractClientConnAdapter.java:216)
	at org.apache.http.protocol.HttpRequestExecutor.doReceiveResponse(HttpRequestExecutor.java:298)
	at org.apache.http.protocol.HttpRequestExecutor.execute(HttpRequestExecutor.java:125)
	at org.apache.http.impl.client.DefaultRequestDirector.tryExecute(DefaultRequestDirector.java:647)
	at org.apache.http.impl.client.DefaultRequestDirector.execute(DefaultRequestDirector.java:464)
	at org.apache.http.impl.client.AbstractHttpClient.execute(AbstractHttpClient.java:820)
	at org.apache.http.impl.client.AbstractHttpClient.execute(AbstractHttpClient.java:754)
	at org.apache.http.impl.client.AbstractHttpClient.execute(AbstractHttpClient.java:732)
	at org.apache.solr.client.solrj.impl.HttpSolrServer.request(HttpSolrServer.java:353)
	... 45 more




Build Log:
[...truncated 11413 lines...]
[junit4:junit4]   2> 141680 T187 oasc.ChaosMonkey.monkeyLog monkey: stop shard! 63218
[junit4:junit4]   2> 141680 T187 oasc.CoreContainer.shutdown Shutting down CoreContainer
instance=958888183
[junit4:junit4]   2> 141680 T187 oasc.RecoveryStrategy.close WARNING Stopping recovery
for core collection1 zkNodeName=127.0.0.1:63218_solr_collection1
[junit4:junit4]   2> 143287 T258 oaz.ClientCnxn$SendThread.startConnect Opening socket
connection to server localhost/127.0.0.1:27122
[junit4:junit4]   2> 153728 T259 oaz.ClientCnxn$EventThread.run EventThread shut down
[junit4:junit4]   2> 153728 T187 oaz.ZooKeeper.close Session: 0x138bae11db80006 closed
[junit4:junit4]   2> 153729 T187 oejsh.ContextHandler.doStop stopped o.e.j.s.ServletContextHandler{/solr,null}
[junit4:junit4]   2>  C7_STATE=coll:collection1 core:collection1 props:{shard=shard2, roles=null,
leader=true, state=active, core=collection1, collection=collection1, node_name=127.0.0.1:63218_solr,
base_url=http://127.0.0.1:63218/solr}
[junit4:junit4]   2> 153780 T257 C7 P63218 REQ /update {wt=javabin&version=2} status=503
QTime=56888 
[junit4:junit4]   2> 153782 T257 C7 P63218 oasc.SolrException.log SEVERE null:org.eclipse.jetty.io.EofException
[junit4:junit4]   2> 		at org.eclipse.jetty.server.HttpOutput.write(HttpOutput.java:154)
[junit4:junit4]   2> 		at org.eclipse.jetty.server.HttpOutput.write(HttpOutput.java:101)
[junit4:junit4]   2> 		at org.apache.solr.common.util.FastOutputStream.flushBuffer(FastOutputStream.java:185)
[junit4:junit4]   2> 		at org.apache.solr.common.util.JavaBinCodec.marshal(JavaBinCodec.java:94)
[junit4:junit4]   2> 		at org.apache.solr.response.BinaryResponseWriter.write(BinaryResponseWriter.java:49)
[junit4:junit4]   2> 		at org.apache.solr.servlet.SolrDispatchFilter.writeResponse(SolrDispatchFilter.java:403)
[junit4:junit4]   2> 		at org.apache.solr.servlet.SolrDispatchFilter.doFilter(SolrDispatchFilter.java:288)
[junit4:junit4]   2> 		at org.eclipse.jetty.servlet.ServletHandler$CachedChain.doFilter(ServletHandler.java:1337)
[junit4:junit4]   2> 		at org.eclipse.jetty.servlet.ServletHandler.doHandle(ServletHandler.java:484)
[junit4:junit4]   2> 		at org.eclipse.jetty.server.session.SessionHandler.doHandle(SessionHandler.java:231)
[junit4:junit4]   2> 		at org.eclipse.jetty.server.handler.ScopedHandler.handle(ScopedHandler.java:119)
[junit4:junit4]   2> 		at org.eclipse.jetty.server.handler.GzipHandler.handle(GzipHandler.java:267)
[junit4:junit4]   2> 		at org.eclipse.jetty.server.handler.ContextHandler.doHandle(ContextHandler.java:1067)
[junit4:junit4]   2> 		at org.eclipse.jetty.servlet.ServletHandler.doScope(ServletHandler.java:413)
[junit4:junit4]   2> 		at org.eclipse.jetty.server.session.SessionHandler.doScope(SessionHandler.java:192)
[junit4:junit4]   2> 		at org.eclipse.jetty.server.handler.ContextHandler.doScope(ContextHandler.java:999)
[junit4:junit4]   2> 		at org.eclipse.jetty.server.handler.ScopedHandler.handle(ScopedHandler.java:117)
[junit4:junit4]   2> 		at org.eclipse.jetty.server.handler.HandlerWrapper.handle(HandlerWrapper.java:111)
[junit4:junit4]   2> 		at org.eclipse.jetty.server.Server.handle(Server.java:351)
[junit4:junit4]   2> 		at org.eclipse.jetty.server.AbstractHttpConnection.handleRequest(AbstractHttpConnection.java:454)
[junit4:junit4]   2> 		at org.eclipse.jetty.server.BlockingHttpConnection.handleRequest(BlockingHttpConnection.java:47)
[junit4:junit4]   2> 		at org.eclipse.jetty.server.AbstractHttpConnection.content(AbstractHttpConnection.java:900)
[junit4:junit4]   2> 		at org.eclipse.jetty.server.AbstractHttpConnection$RequestHandler.content(AbstractHttpConnection.java:954)
[junit4:junit4]   2> 		at org.eclipse.jetty.http.HttpParser.parseNext(HttpParser.java:952)
[junit4:junit4]   2> 		at org.eclipse.jetty.http.HttpParser.parseAvailable(HttpParser.java:235)
[junit4:junit4]   2> 		at org.eclipse.jetty.server.BlockingHttpConnection.handle(BlockingHttpConnection.java:66)
[junit4:junit4]   2> 		at org.eclipse.jetty.server.bio.SocketConnector$ConnectorEndPoint.run(SocketConnector.java:254)
[junit4:junit4]   2> 		at org.eclipse.jetty.util.thread.QueuedThreadPool.runJob(QueuedThreadPool.java:599)
[junit4:junit4]   2> 		at org.eclipse.jetty.util.thread.QueuedThreadPool$3.run(QueuedThreadPool.java:534)
[junit4:junit4]   2> 		at java.lang.Thread.run(Thread.java:679)
[junit4:junit4]   2> 	
[junit4:junit4]   2> 153783 T257 C7 P63218 oasc.SolrException.log SEVERE null:org.eclipse.jetty.io.EofException
[junit4:junit4]   2> 		at org.eclipse.jetty.server.HttpOutput.write(HttpOutput.java:154)
[junit4:junit4]   2> 		at org.eclipse.jetty.server.HttpOutput.write(HttpOutput.java:101)
[junit4:junit4]   2> 		at org.apache.solr.common.util.FastOutputStream.flushBuffer(FastOutputStream.java:185)
[junit4:junit4]   2> 		at org.apache.solr.common.util.JavaBinCodec.marshal(JavaBinCodec.java:94)
[junit4:junit4]   2> 		at org.apache.solr.response.BinaryResponseWriter.write(BinaryResponseWriter.java:49)
[junit4:junit4]   2> 		at org.apache.solr.servlet.SolrDispatchFilter.writeResponse(SolrDispatchFilter.java:403)
[junit4:junit4]   2> 		at org.apache.solr.servlet.SolrDispatchFilter.doFilter(SolrDispatchFilter.java:288)
[junit4:junit4]   2> 		at org.eclipse.jetty.servlet.ServletHandler$CachedChain.doFilter(ServletHandler.java:1337)
[junit4:junit4]   2> 		at org.eclipse.jetty.servlet.ServletHandler.doHandle(ServletHandler.java:484)
[junit4:junit4]   2> 		at org.eclipse.jetty.server.session.SessionHandler.doHandle(SessionHandler.java:231)
[junit4:junit4]   2> 		at org.eclipse.jetty.server.handler.ScopedHandler.handle(ScopedHandler.java:119)
[junit4:junit4]   2> 		at org.eclipse.jetty.server.handler.GzipHandler.handle(GzipHandler.java:267)
[junit4:junit4]   2> 		at org.eclipse.jetty.server.handler.ContextHandler.doHandle(ContextHandler.java:1067)
[junit4:junit4]   2> 		at org.eclipse.jetty.servlet.ServletHandler.doScope(ServletHandler.java:413)
[junit4:junit4]   2> 		at org.eclipse.jetty.server.session.SessionHandler.doScope(SessionHandler.java:192)
[junit4:junit4]   2> 		at org.eclipse.jetty.server.handler.ContextHandler.doScope(ContextHandler.java:999)
[junit4:junit4]   2> 		at org.eclipse.jetty.server.handler.ScopedHandler.handle(ScopedHandler.java:117)
[junit4:junit4]   2> 		at org.eclipse.jetty.server.handler.HandlerWrapper.handle(HandlerWrapper.java:111)
[junit4:junit4]   2> 		at org.eclipse.jetty.server.Server.handle(Server.java:351)
[junit4:junit4]   2> 		at org.eclipse.jetty.server.AbstractHttpConnection.handleRequest(AbstractHttpConnection.java:454)
[junit4:junit4]   2> 		at org.eclipse.jetty.server.BlockingHttpConnection.handleRequest(BlockingHttpConnection.java:47)
[junit4:junit4]   2> 		at org.eclipse.jetty.server.AbstractHttpConnection.content(AbstractHttpConnection.java:900)
[junit4:junit4]   2> 		at org.eclipse.jetty.server.AbstractHttpConnection$RequestHandler.content(AbstractHttpConnection.java:954)
[junit4:junit4]   2> 		at org.eclipse.jetty.http.HttpParser.parseNext(HttpParser.java:952)
[junit4:junit4]   2> 		at org.eclipse.jetty.http.HttpParser.parseAvailable(HttpParser.java:235)
[junit4:junit4]   2> 		at org.eclipse.jetty.server.BlockingHttpConnection.handle(BlockingHttpConnection.java:66)
[junit4:junit4]   2> 		at org.eclipse.jetty.server.bio.SocketConnector$ConnectorEndPoint.run(SocketConnector.java:254)
[junit4:junit4]   2> 		at org.eclipse.jetty.util.thread.QueuedThreadPool.runJob(QueuedThreadPool.java:599)
[junit4:junit4]   2> 		at org.eclipse.jetty.util.thread.QueuedThreadPool$3.run(QueuedThreadPool.java:534)
[junit4:junit4]   2> 		at java.lang.Thread.run(Thread.java:679)
[junit4:junit4]   2> 	
[junit4:junit4]   2> 153788 T257 C7 P63218 oasc.SolrCore.close [collection1]  CLOSING SolrCore
org.apache.solr.core.SolrCore@1d8b74de
[junit4:junit4]   2> 153794 T257 C7 P63218 oasc.SolrCore.closeSearcher [collection1] Closing
main searcher on request.
[junit4:junit4]   2> 153796 T257 C7 P63218 oasu.DirectUpdateHandler2.close closing DirectUpdateHandler2{commits=6,autocommits=0,soft
autocommits=0,optimizes=0,rollbacks=0,expungeDeletes=0,docsPending=0,adds=0,deletesById=0,deletesByQuery=0,errors=0,cumulative_adds=36,cumulative_deletesById=0,cumulative_deletesByQuery=0,cumulative_errors=0}
[junit4:junit4]   2> 153797 T257 C7 P63218 oasc.RecoveryStrategy.close WARNING Stopping
recovery for core collection1 zkNodeName=127.0.0.1:63218_solr_collection1
[junit4:junit4]   2> 153853 T187 oas.SolrTestCaseJ4.tearDown ###Ending testDistribSearch
[junit4:junit4]   1>      /solr/collections/control_collection/leader_elect/control_shard
(1)
[junit4:junit4]   1>       /solr/collections/control_collection/leader_elect/control_shard/election
(1)
[junit4:junit4]   1>        /solr/collections/control_collection/leader_elect/control_shard/election/88025668762730498-127.0.0.1:64428_solr_collection1-n_0000000000
(0)
[junit4:junit4]   1>     /solr/collections/control_collection/leaders (1)
[junit4:junit4]   1>      /solr/collections/control_collection/leaders/control_shard (0)
[junit4:junit4]   1>      DATA:
[junit4:junit4]   1>          {
[junit4:junit4]   1>            "core":"collection1",
[junit4:junit4]   1>            "node_name":"127.0.0.1:64428_solr",
[junit4:junit4]   1>            "base_url":"http://127.0.0.1:64428/solr"}
[junit4:junit4]   1>   /solr/clusterstate.json (0)
[junit4:junit4]   1>   DATA:
[junit4:junit4]   1>       {
[junit4:junit4]   1>         "collection1":{
[junit4:junit4]   1>           "shard1":{
[junit4:junit4]   1>             "127.0.0.1:29609_solr_collection1":{
[junit4:junit4]   1>               "shard":"shard1",
[junit4:junit4]   1>               "leader":"true",
[junit4:junit4]   1>               "roles":null,
[junit4:junit4]   1>               "state":"active",
[junit4:junit4]   1>               "core":"collection1",
[junit4:junit4]   1>               "collection":"collection1",
[junit4:junit4]   1>               "node_name":"127.0.0.1:29609_solr",
[junit4:junit4]   1>               "base_url":"http://127.0.0.1:29609/solr"},
[junit4:junit4]   1>             "127.0.0.1:23956_solr_collection1":{
[junit4:junit4]   1>               "shard":"shard1",
[junit4:junit4]   1>               "roles":null,
[junit4:junit4]   1>               "state":"active",
[junit4:junit4]   1>               "core":"collection1",
[junit4:junit4]   1>               "collection":"collection1",
[junit4:junit4]   1>               "node_name":"127.0.0.1:23956_solr",
[junit4:junit4]   1>               "base_url":"http://127.0.0.1:23956/solr"}},
[junit4:junit4]   1>           "shard2":{
[junit4:junit4]   1>             "127.0.0.1:17967_solr_collection1":{
[junit4:junit4]   1>               "shard":"shard2",
[junit4:junit4]   1>               "roles":null,
[junit4:junit4]   1>               "state":"active",
[junit4:junit4]   1>               "core":"collection1",
[junit4:junit4]   1>               "collection":"collection1",
[junit4:junit4]   1>               "node_name":"127.0.0.1:17967_solr",
[junit4:junit4]   1>               "base_url":"http://127.0.0.1:17967/solr"},
[junit4:junit4]   1>             "127.0.0.1:63218_solr_collection1":{
[junit4:junit4]   1>               "shard":"shard2",
[junit4:junit4]   1>               "leader":"true",
[junit4:junit4]   1>               "roles":null,
[junit4:junit4]   1>               "state":"active",
[junit4:junit4]   1>               "core":"collection1",
[junit4:junit4]   1>               "collection":"collection1",
[junit4:junit4]   1>               "node_name":"127.0.0.1:63218_solr",
[junit4:junit4]   1>               "base_url":"http://127.0.0.1:63218/solr"}}},
[junit4:junit4]   1>         "control_collection":{"control_shard":{"127.0.0.1:64428_solr_collection1":{
[junit4:junit4]   1>               "shard":"control_shard",
[junit4:junit4]   1>               "leader":"true",
[junit4:junit4]   1>               "roles":null,
[junit4:junit4]   1>               "state":"active",
[junit4:junit4]   1>               "core":"collection1",
[junit4:junit4]   1>               "collection":"control_collection",
[junit4:junit4]   1>               "node_name":"127.0.0.1:64428_solr",
[junit4:junit4]   1>               "base_url":"http://127.0.0.1:64428/solr"}}}}
[junit4:junit4]   1>  /zookeeper (1)
[junit4:junit4]   1>  DATA:
[junit4:junit4]   1>      
[junit4:junit4]   1> 
[junit4:junit4]   2> NOTE: reproduce with: ant test  -Dtestcase=FullSolrCloudTest -Dtests.method=testDistribSearch
-Dtests.seed=FA6B9D84D0BC8140 -Dtests.multiplier=3 -Dtests.slow=true -Dtests.locale=ar_QA
-Dtests.timezone=Africa/Luanda -Dtests.file.encoding=UTF-8
[junit4:junit4]   1> 
[junit4:junit4]   2>
[junit4:junit4]    > (@AfterClass output)
[junit4:junit4]   2> 153886 T187 oas.SolrTestCaseJ4.deleteCore ###deleteCore
[junit4:junit4]   2> NOTE: test params are: codec=Lucene40: {n_f1=PostingsFormat(name=MockRandom),
foo_b=PostingsFormat(name=Asserting), foo_d=MockFixedIntBlock(blockSize=291), foo_f=PostingsFormat(name=Asserting),
n_tl1=PostingsFormat(name=MockRandom), n_d1=PostingsFormat(name=Lucene40WithOrds), rnd_b=MockFixedIntBlock(blockSize=291),
intDefault=PostingsFormat(name=MockRandom), n_td1=PostingsFormat(name=MockRandom), id=MockFixedIntBlock(blockSize=291),
timestamp=PostingsFormat(name=Lucene40WithOrds), range_facet_sl=MockFixedIntBlock(blockSize=291),
range_facet_si=PostingsFormat(name=Lucene40WithOrds), oddField_s=MockFixedIntBlock(blockSize=291),
multiDefault=PostingsFormat(name=Lucene40WithOrds), n_tf1=PostingsFormat(name=Lucene40WithOrds),
n_dt1=PostingsFormat(name=MockRandom), n_ti1=MockFixedIntBlock(blockSize=291), range_facet_l=PostingsFormat(name=Lucene40WithOrds),
text=PostingsFormat(name=Asserting), _version_=PostingsFormat(name=MockRandom), SubjectTerms_mfacet=PostingsFormat(name=MockRandom),
a_t=PostingsFormat(name=Lucene40WithOrds), n_tdt1=PostingsFormat(name=MockRandom), other_tl1=PostingsFormat(name=MockRandom),
n_l1=PostingsFormat(name=Lucene40WithOrds), a_si=PostingsFormat(name=MockRandom)}, sim=RandomSimilarityProvider(queryNorm=true,coord=false):
{}, locale=ar_QA, timezone=Africa/Luanda
[junit4:junit4]   2> NOTE: FreeBSD 9.0-RELEASE amd64/Sun Microsystems Inc. 1.6.0_32 (64-bit)/cpus=16,threads=2,free=116658392,total=231669760
[junit4:junit4]   2> NOTE: All tests run in this JVM: [TestStressReorder, TestMultiCoreConfBootstrap,
SortByFunctionTest, TestRealTimeGet, QueryParsingTest, SuggesterFSTTest, FullSolrCloudTest]
[junit4:junit4]   2> 
[junit4:junit4] Completed on J1 in 153.90s, 1 test, 1 error <<< FAILURES!
[...truncated 794 lines...]

[...truncated 12358 lines...]

[...truncated 12358 lines...]

[...truncated 12358 lines...]

[...truncated 12358 lines...]

[...truncated 12343 lines...]
BUILD FAILED
/usr/home/hudson/hudson-slave/workspace/Lucene-Solr-tests-only-4.x/checkout/build.xml:29:
The following error occurred while executing this line:
/usr/home/hudson/hudson-slave/workspace/Lucene-Solr-tests-only-4.x/checkout/solr/build.xml:144:
The following error occurred while executing this line:
/usr/home/hudson/hudson-slave/workspace/Lucene-Solr-tests-only-4.x/checkout/lucene/module-build.xml:62:
The following error occurred while executing this line:
/usr/home/hudson/hudson-slave/workspace/Lucene-Solr-tests-only-4.x/checkout/lucene/common-build.xml:1094:
The following error occurred while executing this line:
/usr/home/hudson/hudson-slave/workspace/Lucene-Solr-tests-only-4.x/checkout/lucene/common-build.xml:789:
There were test failures: 305 suites, 1085 tests, 1 error, 5 ignored

Total time: 29 minutes 21 seconds
Build step 'Execute shell' marked build as failure
Archiving artifacts
Recording test results
Publishing Clover coverage report...
No Clover report will be published due to a Build Failure
Email was triggered for: Failure
Sending email for trigger: Failure



Mime
View raw message