lucene-dev mailing list archives

Site index · List index
Message view « Date » · « Thread »
Top « Date » · « Thread »
From Policeman Jenkins Server <jenk...@sd-datasolutions.de>
Subject [JENKINS] Lucene-Solr-4.x-Linux-Java8-64 - Build # 2 - Still Failing!
Date Tue, 03 Jul 2012 09:46:32 GMT
Build: http://jenkins.sd-datasolutions.de/job/Lucene-Solr-4.x-Linux-Java8-64/2/

1 tests failed.
FAILED:  org.apache.solr.handler.component.SpellCheckComponentTest.testPerDictionary

Error Message:
mismatch: '0'!='2' @ spellcheck/suggestions/bar/startOffset

Stack Trace:
java.lang.RuntimeException: mismatch: '0'!='2' @ spellcheck/suggestions/bar/startOffset
	at __randomizedtesting.SeedInfo.seed([1FA56F87F03032D0:D8AB9B2FF85C2798]:0)
	at org.apache.solr.SolrTestCaseJ4.assertJQ(SolrTestCaseJ4.java:547)
	at org.apache.solr.SolrTestCaseJ4.assertJQ(SolrTestCaseJ4.java:495)
	at org.apache.solr.handler.component.SpellCheckComponentTest.testPerDictionary(SpellCheckComponentTest.java:102)
	at sun.reflect.NativeMethodAccessorImpl.invoke0(Native Method)
	at sun.reflect.NativeMethodAccessorImpl.invoke(NativeMethodAccessorImpl.java:57)
	at sun.reflect.DelegatingMethodAccessorImpl.invoke(DelegatingMethodAccessorImpl.java:43)
	at java.lang.reflect.Method.invoke(Method.java:474)
	at com.carrotsearch.randomizedtesting.RandomizedRunner.invoke(RandomizedRunner.java:1969)
	at com.carrotsearch.randomizedtesting.RandomizedRunner.access$1100(RandomizedRunner.java:132)
	at com.carrotsearch.randomizedtesting.RandomizedRunner$6.evaluate(RandomizedRunner.java:814)
	at com.carrotsearch.randomizedtesting.RandomizedRunner$7.evaluate(RandomizedRunner.java:875)
	at com.carrotsearch.randomizedtesting.RandomizedRunner$8.evaluate(RandomizedRunner.java:889)
	at com.carrotsearch.randomizedtesting.rules.SystemPropertiesRestoreRule$1.evaluate(SystemPropertiesRestoreRule.java:53)
	at org.apache.lucene.util.TestRuleSetupTeardownChained$1.evaluate(TestRuleSetupTeardownChained.java:50)
	at org.apache.lucene.util.TestRuleFieldCacheSanity$1.evaluate(TestRuleFieldCacheSanity.java:32)
	at org.apache.lucene.util.AbstractBeforeAfterRule$1.evaluate(AbstractBeforeAfterRule.java:45)
	at com.carrotsearch.randomizedtesting.rules.SystemPropertiesInvariantRule$1.evaluate(SystemPropertiesInvariantRule.java:55)
	at org.apache.lucene.util.TestRuleReportUncaughtExceptions$1.evaluate(TestRuleReportUncaughtExceptions.java:68)
	at org.apache.lucene.util.TestRuleThreadAndTestName$1.evaluate(TestRuleThreadAndTestName.java:48)
	at org.apache.lucene.util.TestRuleIgnoreAfterMaxFailures$1.evaluate(TestRuleIgnoreAfterMaxFailures.java:70)
	at org.apache.lucene.util.TestRuleMarkFailure$1.evaluate(TestRuleMarkFailure.java:48)
	at com.carrotsearch.randomizedtesting.RandomizedRunner.runSingleTest(RandomizedRunner.java:821)
	at com.carrotsearch.randomizedtesting.RandomizedRunner.access$700(RandomizedRunner.java:132)
	at com.carrotsearch.randomizedtesting.RandomizedRunner$3$1.run(RandomizedRunner.java:669)
	at com.carrotsearch.randomizedtesting.RandomizedRunner$3.evaluate(RandomizedRunner.java:695)
	at com.carrotsearch.randomizedtesting.RandomizedRunner$4.evaluate(RandomizedRunner.java:734)
	at com.carrotsearch.randomizedtesting.RandomizedRunner$5.evaluate(RandomizedRunner.java:745)
	at com.carrotsearch.randomizedtesting.rules.SystemPropertiesRestoreRule$1.evaluate(SystemPropertiesRestoreRule.java:53)
	at org.apache.lucene.util.AbstractBeforeAfterRule$1.evaluate(AbstractBeforeAfterRule.java:45)
	at org.apache.lucene.util.TestRuleReportUncaughtExceptions$1.evaluate(TestRuleReportUncaughtExceptions.java:68)
	at org.apache.lucene.util.TestRuleStoreClassName$1.evaluate(TestRuleStoreClassName.java:38)
	at org.apache.lucene.util.TestRuleIcuHack$1.evaluate(TestRuleIcuHack.java:51)
	at com.carrotsearch.randomizedtesting.rules.SystemPropertiesInvariantRule$1.evaluate(SystemPropertiesInvariantRule.java:55)
	at org.apache.lucene.util.TestRuleNoInstanceHooksOverrides$1.evaluate(TestRuleNoInstanceHooksOverrides.java:53)
	at org.apache.lucene.util.TestRuleNoStaticHooksShadowing$1.evaluate(TestRuleNoStaticHooksShadowing.java:52)
	at org.apache.lucene.util.TestRuleAssertionsRequired$1.evaluate(TestRuleAssertionsRequired.java:36)
	at org.apache.lucene.util.TestRuleMarkFailure$1.evaluate(TestRuleMarkFailure.java:48)
	at org.apache.lucene.util.TestRuleIgnoreAfterMaxFailures$1.evaluate(TestRuleIgnoreAfterMaxFailures.java:70)
	at org.apache.lucene.util.TestRuleIgnoreTestSuites$1.evaluate(TestRuleIgnoreTestSuites.java:55)
	at com.carrotsearch.randomizedtesting.RandomizedRunner.runSuite(RandomizedRunner.java:605)
	at com.carrotsearch.randomizedtesting.RandomizedRunner.access$400(RandomizedRunner.java:132)
	at com.carrotsearch.randomizedtesting.RandomizedRunner$2.run(RandomizedRunner.java:551)




Build Log:
[...truncated 8111 lines...]
   [junit4] Suite: org.apache.solr.handler.component.SpellCheckComponentTest
   [junit4]    > (@BeforeClass output)
   [junit4]   2> 0 T1699 oas.SolrTestCaseJ4.initCore ####initCore
   [junit4]   2> Creating dataDir: /mnt/ssd/jenkins/workspace/Lucene-Solr-4.x-Linux-Java8-64/checkout/solr/build/solr-core/test/J1/./solrtest-SpellCheckComponentTest-1341308687892
   [junit4]   2> 0 T1699 oasc.SolrResourceLoader.<init> new SolrResourceLoader for
directory: '/mnt/ssd/jenkins/workspace/Lucene-Solr-4.x-Linux-Java8-64/checkout/solr/build/solr-core/test-files/solr/collection1/'
   [junit4]   2> 1 T1699 oasc.SolrResourceLoader.replaceClassLoader Adding 'file:/mnt/ssd/jenkins/workspace/Lucene-Solr-4.x-Linux-Java8-64/checkout/solr/build/solr-core/test-files/solr/collection1/lib/classes/'
to classloader
   [junit4]   2> 1 T1699 oasc.SolrResourceLoader.replaceClassLoader Adding 'file:/mnt/ssd/jenkins/workspace/Lucene-Solr-4.x-Linux-Java8-64/checkout/solr/build/solr-core/test-files/solr/collection1/lib/README'
to classloader
   [junit4]   2> 22 T1699 oasc.SolrConfig.<init> Using Lucene MatchVersion: LUCENE_40
   [junit4]   2> 52 T1699 oasc.SolrConfig.<init> Loaded SolrConfig: solrconfig-spellcheckcomponent.xml
   [junit4]   2> 52 T1699 oass.IndexSchema.readSchema Reading Solr Schema
   [junit4]   2> 55 T1699 oass.IndexSchema.readSchema Schema name=test
   [junit4]   2> 406 T1699 oass.OpenExchangeRatesOrgProvider.init Initialized with rates=open-exchange-rates.json,
refreshInterval=1440.
   [junit4]   2> 410 T1699 oass.IndexSchema.readSchema default search field in schema is
text
   [junit4]   2> 412 T1699 oass.IndexSchema.readSchema unique key field: id
   [junit4]   2> 415 T1699 oass.FileExchangeRateProvider.reload Reloading exchange rates
from file currency.xml
   [junit4]   2> 417 T1699 oass.FileExchangeRateProvider.reload Reloading exchange rates
from file currency.xml
   [junit4]   2> 418 T1699 oass.OpenExchangeRatesOrgProvider.reload Reloading exchange
rates from open-exchange-rates.json
   [junit4]   2> 418 T1699 oass.OpenExchangeRatesOrgProvider.reload Reloading exchange
rates from open-exchange-rates.json
   [junit4]   2> 419 T1699 oasc.SolrResourceLoader.locateSolrHome JNDI not configured for
solr (NoInitialContextEx)
   [junit4]   2> 419 T1699 oasc.SolrResourceLoader.locateSolrHome using system property
solr.solr.home: /mnt/ssd/jenkins/workspace/Lucene-Solr-4.x-Linux-Java8-64/checkout/solr/build/solr-core/test-files/solr
   [junit4]   2> 419 T1699 oasc.SolrResourceLoader.<init> new SolrResourceLoader
for directory: '/mnt/ssd/jenkins/workspace/Lucene-Solr-4.x-Linux-Java8-64/checkout/solr/build/solr-core/test-files/solr/'
   [junit4]   2> 419 T1699 oasc.CoreContainer.<init> New CoreContainer 500302697
   [junit4]   2> 419 T1699 oasc.SolrCore.<init> [collection1] Opening new SolrCore
at /mnt/ssd/jenkins/workspace/Lucene-Solr-4.x-Linux-Java8-64/checkout/solr/build/solr-core/test-files/solr/collection1/,
dataDir=/mnt/ssd/jenkins/workspace/Lucene-Solr-4.x-Linux-Java8-64/checkout/solr/build/solr-core/test/J1/./solrtest-SpellCheckComponentTest-1341308687892/
   [junit4]   2> 419 T1699 oasc.SolrCore.<init> JMX monitoring not detected for core:
collection1
   [junit4]   2> 419 T1699 oasc.SolrCore.getNewIndexDir WARNING New index directory detected:
old=null new=/mnt/ssd/jenkins/workspace/Lucene-Solr-4.x-Linux-Java8-64/checkout/solr/build/solr-core/test/J1/./solrtest-SpellCheckComponentTest-1341308687892/index/
   [junit4]   2> 420 T1699 oasc.SolrCore.initIndex WARNING [collection1] Solr index directory
'/mnt/ssd/jenkins/workspace/Lucene-Solr-4.x-Linux-Java8-64/checkout/solr/build/solr-core/test/J1/./solrtest-SpellCheckComponentTest-1341308687892/index'
doesn't exist. Creating new index...
   [junit4]   2> 421 T1699 oasc.SolrDeletionPolicy.onCommit SolrDeletionPolicy.onCommit:
commits:num=1
   [junit4]   2> 		commit{dir=MockDirWrapper(org.apache.lucene.store.RAMDirectory@46ddf1ca
lockFactory=org.apache.lucene.store.NativeFSLockFactory@47e6bd15),segFN=segments_1,generation=1,filenames=[segments_1]
   [junit4]   2> 421 T1699 oasc.SolrDeletionPolicy.updateCommits newest commit = 1
   [junit4]   2> 422 T1699 oasc.RequestHandlers.initHandlersFromConfig created standard:
solr.StandardRequestHandler
   [junit4]   2> 422 T1699 oasc.RequestHandlers.initHandlersFromConfig created spellCheckCompRH:
org.apache.solr.handler.component.SearchHandler
   [junit4]   2> 422 T1699 oasc.RequestHandlers.initHandlersFromConfig created spellCheckCompRH1:
org.apache.solr.handler.component.SearchHandler
   [junit4]   2> 422 T1699 oasc.RequestHandlers.initHandlersFromConfig created spellCheckWithWordbreak:
org.apache.solr.handler.component.SearchHandler
   [junit4]   2> 424 T1699 oass.SolrIndexSearcher.<init> Opening Searcher@7d8e9635
main
   [junit4]   2> 424 T1699 oass.SolrIndexSearcher.<init> WARNING WARNING: Directory
impl does not support setting indexDir: org.apache.lucene.store.MockDirectoryWrapper
   [junit4]   2> 425 T1699 oasu.CommitTracker.<init> Hard AutoCommit: disabled
   [junit4]   2> 425 T1699 oasu.CommitTracker.<init> Soft AutoCommit: disabled
   [junit4]   2> 425 T1699 oashc.SpellCheckComponent.inform Initializing spell checkers
   [junit4]   2> 429 T1699 oashc.SpellCheckComponent.inform Registering newSearcher listener
for spellchecker: default
   [junit4]   2> 434 T1699 oashc.SpellCheckComponent.inform Registering newSearcher listener
for spellchecker: default_teststop
   [junit4]   2> 435 T1699 oass.DirectSolrSpellChecker.init init: {name=direct,classname=solr.DirectSolrSpellChecker,minQueryLength=3,maxQueryFrequency=100.0,field=teststop}
   [junit4]   2> 435 T1699 oass.DirectSolrSpellChecker.init init: {name=direct_lowerfilt,classname=solr.DirectSolrSpellChecker,minQueryLength=3,maxQueryFrequency=100.0,field=lowerfilt}
   [junit4]   2> 439 T1699 oashc.SpellCheckComponent.inform Registering newSearcher listener
for spellchecker: threshold
   [junit4]   2> 440 T1699 oass.DirectSolrSpellChecker.init init: {name=threshold_direct,classname=solr.DirectSolrSpellChecker,field=lowerfilt,spellcheckIndexDir=spellcheckerThreshold,buildOnCommit=true,thresholdTokenFrequency=0.29}
   [junit4]   2> 440 T1699 oashc.SpellCheckComponent.inform Registering newSearcher listener
for spellchecker: threshold_direct
   [junit4]   2> 445 T1699 oashc.SpellCheckComponent.inform Registering newSearcher listener
for spellchecker: multipleFields
   [junit4]   2> 458 T1699 oashc.SpellCheckComponent.inform Registering newSearcher listener
for spellchecker: freq
   [junit4]   2> 463 T1699 oashc.SpellCheckComponent.inform Registering newSearcher listener
for spellchecker: fqcn
   [junit4]   2> 464 T1699 oashc.HttpShardHandlerFactory.getParameter Setting socketTimeout
to: 0
   [junit4]   2> 464 T1699 oashc.HttpShardHandlerFactory.getParameter Setting urlScheme
to: http://
   [junit4]   2> 464 T1699 oashc.HttpShardHandlerFactory.getParameter Setting connTimeout
to: 0
   [junit4]   2> 464 T1699 oashc.HttpShardHandlerFactory.getParameter Setting maxConnectionsPerHost
to: 20
   [junit4]   2> 465 T1699 oashc.HttpShardHandlerFactory.getParameter Setting corePoolSize
to: 0
   [junit4]   2> 465 T1699 oashc.HttpShardHandlerFactory.getParameter Setting maximumPoolSize
to: 2147483647
   [junit4]   2> 465 T1699 oashc.HttpShardHandlerFactory.getParameter Setting maxThreadIdleTime
to: 5
   [junit4]   2> 465 T1699 oashc.HttpShardHandlerFactory.getParameter Setting sizeOfQueue
to: -1
   [junit4]   2> 466 T1699 oashc.HttpShardHandlerFactory.getParameter Setting fairnessPolicy
to: false
   [junit4]   2> 466 T1699 oascsi.HttpClientUtil.createClient Creating new http client,
config:maxConnectionsPerHost=20&maxConnections=10000&socketTimeout=0&connTimeout=0&retry=false
   [junit4]   2> 468 T1700 oasc.SolrCore.registerSearcher [collection1] Registered new
searcher Searcher@7d8e9635 main{StandardDirectoryReader(segments_1:1)}
   [junit4]   2> 468 T1699 oasc.CoreContainer.register registering core: collection1
   [junit4]   2> 469 T1699 oas.SolrTestCaseJ4.initCore ####initCore end
   [junit4]   2> 
   [junit4] ERROR   0.47s J1 | SpellCheckComponentTest.testPerDictionary
   [junit4]    > Throwable #1: java.lang.RuntimeException: mismatch: '0'!='2' @ spellcheck/suggestions/bar/startOffset
   [junit4]    > 	at __randomizedtesting.SeedInfo.seed([1FA56F87F03032D0:D8AB9B2FF85C2798]:0)
   [junit4]    > 	at org.apache.solr.SolrTestCaseJ4.assertJQ(SolrTestCaseJ4.java:547)
   [junit4]    > 	at org.apache.solr.SolrTestCaseJ4.assertJQ(SolrTestCaseJ4.java:495)
   [junit4]    > 	at org.apache.solr.handler.component.SpellCheckComponentTest.testPerDictionary(SpellCheckComponentTest.java:102)
   [junit4]    > 	at sun.reflect.NativeMethodAccessorImpl.invoke0(Native Method)
   [junit4]    > 	at sun.reflect.NativeMethodAccessorImpl.invoke(NativeMethodAccessorImpl.java:57)
   [junit4]    > 	at sun.reflect.DelegatingMethodAccessorImpl.invoke(DelegatingMethodAccessorImpl.java:43)
   [junit4]    > 	at java.lang.reflect.Method.invoke(Method.java:474)
   [junit4]    > 	at com.carrotsearch.randomizedtesting.RandomizedRunner.invoke(RandomizedRunner.java:1969)
   [junit4]    > 	at com.carrotsearch.randomizedtesting.RandomizedRunner.access$1100(RandomizedRunner.java:132)
   [junit4]    > 	at com.carrotsearch.randomizedtesting.RandomizedRunner$6.evaluate(RandomizedRunner.java:814)
   [junit4]    > 	at com.carrotsearch.randomizedtesting.RandomizedRunner$7.evaluate(RandomizedRunner.java:875)
   [junit4]    > 	at com.carrotsearch.randomizedtesting.RandomizedRunner$8.evaluate(RandomizedRunner.java:889)
   [junit4]    > 	at com.carrotsearch.randomizedtesting.rules.SystemPropertiesRestoreRule$1.evaluate(SystemPropertiesRestoreRule.java:53)
   [junit4]    > 	at org.apache.lucene.util.TestRuleSetupTeardownChained$1.evaluate(TestRuleSetupTeardownChained.java:50)
   [junit4]    > 	at org.apache.lucene.util.TestRuleFieldCacheSanity$1.evaluate(TestRuleFieldCacheSanity.java:32)
   [junit4]    > 	at org.apache.lucene.util.AbstractBeforeAfterRule$1.evaluate(AbstractBeforeAfterRule.java:45)
   [junit4]    > 	at com.carrotsearch.randomizedtesting.rules.SystemPropertiesInvariantRule$1.evaluate(SystemPropertiesInvariantRule.java:55)
   [junit4]    > 	at org.apache.lucene.util.TestRuleReportUncaughtExceptions$1.evaluate(TestRuleReportUncaughtExceptions.java:68)
   [junit4]    > 	at org.apache.lucene.util.TestRuleThreadAndTestName$1.evaluate(TestRuleThreadAndTestName.java:48)
   [junit4]    > 	at org.apache.lucene.util.TestRuleIgnoreAfterMaxFailures$1.evaluate(TestRuleIgnoreAfterMaxFailures.java:70)
   [junit4]    > 	at org.apache.lucene.util.TestRuleMarkFailure$1.evaluate(TestRuleMarkFailure.java:48)
   [junit4]    > 	at com.carrotsearch.randomizedtesting.RandomizedRunner.runSingleTest(RandomizedRunner.java:821)
   [junit4]    > 	at com.carrotsearch.randomizedtesting.RandomizedRunner.access$700(RandomizedRunner.java:132)
   [junit4]    > 	at com.carrotsearch.randomizedtesting.RandomizedRunner$3$1.run(RandomizedRunner.java:669)
   [junit4]    > 	at com.carrotsearch.randomizedtesting.RandomizedRunner$3.evaluate(RandomizedRunner.java:695)
   [junit4]    > 	at com.carrotsearch.randomizedtesting.RandomizedRunner$4.evaluate(RandomizedRunner.java:734)
   [junit4]    > 	at com.carrotsearch.randomizedtesting.RandomizedRunner$5.evaluate(RandomizedRunner.java:745)
   [junit4]    > 	at com.carrotsearch.randomizedtesting.rules.SystemPropertiesRestoreRule$1.evaluate(SystemPropertiesRestoreRule.java:53)
   [junit4]    > 	at org.apache.lucene.util.AbstractBeforeAfterRule$1.evaluate(AbstractBeforeAfterRule.java:45)
   [junit4]    > 	at org.apache.lucene.util.TestRuleReportUncaughtExceptions$1.evaluate(TestRuleReportUncaughtExceptions.java:68)
   [junit4]    > 	at org.apache.lucene.util.TestRuleStoreClassName$1.evaluate(TestRuleStoreClassName.java:38)
   [junit4]    > 	at org.apache.lucene.util.TestRuleIcuHack$1.evaluate(TestRuleIcuHack.java:51)
   [junit4]    > 	at com.carrotsearch.randomizedtesting.rules.SystemPropertiesInvariantRule$1.evaluate(SystemPropertiesInvariantRule.java:55)
   [junit4]    > 	at org.apache.lucene.util.TestRuleNoInstanceHooksOverrides$1.evaluate(TestRuleNoInstanceHooksOverrides.java:53)
   [junit4]    > 	at org.apache.lucene.util.TestRuleNoStaticHooksShadowing$1.evaluate(TestRuleNoStaticHooksShadowing.java:52)
   [junit4]    > 	at org.apache.lucene.util.TestRuleAssertionsRequired$1.evaluate(TestRuleAssertionsRequired.java:36)
   [junit4]    > 	at org.apache.lucene.util.TestRuleMarkFailure$1.evaluate(TestRuleMarkFailure.java:48)
   [junit4]    > 	at org.apache.lucene.util.TestRuleIgnoreAfterMaxFailures$1.evaluate(TestRuleIgnoreAfterMaxFailures.java:70)
   [junit4]    > 	at org.apache.lucene.util.TestRuleIgnoreTestSuites$1.evaluate(TestRuleIgnoreTestSuites.java:55)
   [junit4]    > 	at com.carrotsearch.randomizedtesting.RandomizedRunner.runSuite(RandomizedRunner.java:605)
   [junit4]    > 	at com.carrotsearch.randomizedtesting.RandomizedRunner.access$400(RandomizedRunner.java:132)
   [junit4]    > 	at com.carrotsearch.randomizedtesting.RandomizedRunner$2.run(RandomizedRunner.java:551)
   [junit4]    > 
   [junit4]   2> 470 T1699 oas.SolrTestCaseJ4.setUp ###Starting testPerDictionary
   [junit4]   2> ASYNC  NEW_CORE C80 name=collection1 org.apache.solr.core.SolrCore@6ccf0e08
   [junit4]   2> 475 T1699 C80 oasc.SolrDeletionPolicy.onInit SolrDeletionPolicy.onInit:
commits:num=1
   [junit4]   2> 		commit{dir=MockDirWrapper(org.apache.lucene.store.RAMDirectory@46ddf1ca
lockFactory=org.apache.lucene.store.NativeFSLockFactory@47e6bd15),segFN=segments_1,generation=1,filenames=[segments_1]
   [junit4]   2> 475 T1699 C80 oasc.SolrDeletionPolicy.updateCommits newest commit = 1
   [junit4]   2> 476 T1699 C80 UPDATE [collection1] webapp=null path=null params={} {add=[0]}
0 3
   [junit4]   2> 481 T1699 C80 UPDATE [collection1] webapp=null path=null params={} {add=[1]}
0 0
   [junit4]   2> 486 T1699 C80 UPDATE [collection1] webapp=null path=null params={} {add=[2]}
0 0
   [junit4]   2> 490 T1699 C80 UPDATE [collection1] webapp=null path=null params={} {add=[3]}
0 0
   [junit4]   2> 495 T1699 C80 UPDATE [collection1] webapp=null path=null params={} {add=[4]}
0 0
   [junit4]   2> 500 T1699 C80 UPDATE [collection1] webapp=null path=null params={} {add=[5]}
0 0
   [junit4]   2> 505 T1699 C80 UPDATE [collection1] webapp=null path=null params={} {add=[6]}
0 1
   [junit4]   2> 514 T1699 C80 UPDATE [collection1] webapp=null path=null params={} {add=[7]}
0 0
   [junit4]   2> 518 T1699 C80 UPDATE [collection1] webapp=null path=null params={} {add=[8]}
0 0
   [junit4]   2> 522 T1699 C80 UPDATE [collection1] webapp=null path=null params={} {add=[9]}
0 1
   [junit4]   2> 526 T1699 C80 oasu.DirectUpdateHandler2.commit start commit{flags=0,version=0,optimize=false,openSearcher=true,waitSearcher=true,expungeDeletes=false,softCommit=false}
   [junit4]   2> 527 T1699 C80 oasc.SolrDeletionPolicy.onCommit SolrDeletionPolicy.onCommit:
commits:num=2
   [junit4]   2> 		commit{dir=MockDirWrapper(org.apache.lucene.store.RAMDirectory@46ddf1ca
lockFactory=org.apache.lucene.store.NativeFSLockFactory@47e6bd15),segFN=segments_1,generation=1,filenames=[segments_1]
   [junit4]   2> 		commit{dir=MockDirWrapper(org.apache.lucene.store.RAMDirectory@46ddf1ca
lockFactory=org.apache.lucene.store.NativeFSLockFactory@47e6bd15),segFN=segments_2,generation=2,filenames=[_0.si,
segments_2, _0.fdt, _0_Lucene40_0.frq, _0_nrm.cfe, _0_Lucene40_0.prx, _0.fdx, _0_nrm.cfs,
_0_Lucene40_0.tim, _0_Lucene40_0.tip, _0.fnm]
   [junit4]   2> 528 T1699 C80 oasc.SolrDeletionPolicy.updateCommits newest commit = 2
   [junit4]   2> 529 T1699 C80 oass.SolrIndexSearcher.<init> Opening Searcher@2b035520
main
   [junit4]   2> 529 T1699 C80 oass.SolrIndexSearcher.<init> WARNING WARNING: Directory
impl does not support setting indexDir: org.apache.lucene.store.MockDirectoryWrapper
   [junit4]   2> 529 T1700 oashc.SpellCheckComponent$SpellCheckerListener.buildSpellIndex
Building spell index for spell checker: default
   [junit4]   2> 529 T1699 C80 oasu.DirectUpdateHandler2.commit end_commit_flush
   [junit4]   2> 616 T1700 oashc.SpellCheckComponent$SpellCheckerListener.buildSpellIndex
Building spell index for spell checker: default_teststop
   [junit4]   2> 687 T1700 oashc.SpellCheckComponent$SpellCheckerListener.buildSpellIndex
Building spell index for spell checker: threshold
   [junit4]   2> 720 T1700 oashc.SpellCheckComponent$SpellCheckerListener.buildSpellIndex
Building spell index for spell checker: threshold_direct
   [junit4]   2> 720 T1700 oashc.SpellCheckComponent$SpellCheckerListener.buildSpellIndex
Building spell index for spell checker: multipleFields
   [junit4]   2> 754 T1700 oashc.SpellCheckComponent$SpellCheckerListener.buildSpellIndex
Building spell index for spell checker: freq
   [junit4]   2> 792 T1700 oashc.SpellCheckComponent$SpellCheckerListener.buildSpellIndex
Building spell index for spell checker: fqcn
   [junit4]   2> 833 T1700 oasc.SolrCore.registerSearcher [collection1] Registered new
searcher Searcher@2b035520 main{StandardDirectoryReader(segments_2:3 _0(4.0):C10)}
   [junit4]   2> 834 T1699 C80 UPDATE [collection1] webapp=null path=null params={} {commit=}
0 308
   [junit4]   2> 836 T1699 C80 REQ [collection1] webapp=null path=null params={spellcheck.build=true&spellcheck=true&spellcheck..perDict.foo=bar&spellcheck.dictionary=perDict&json.nl=map&qt=spellCheckCompRH&spellcheck..perDict.bar=foo&q=documemt}
hits=0 status=0 QTime=1 
   [junit4]   2> 836 T1699 oas.SolrTestCaseJ4.assertJQ SEVERE query failed JSON validation.
error=mismatch: '0'!='2' @ spellcheck/suggestions/bar/startOffset
   [junit4]   2> 	 expected =/spellcheck/suggestions/bar=={"numFound":1, "startOffset":0,
"endOffset":1, "suggestion":["foo"]}
   [junit4]   2> 	 response = {
   [junit4]   2> 	  "responseHeader":{
   [junit4]   2> 	    "status":0,
   [junit4]   2> 	    "QTime":1},
   [junit4]   2> 	  "command":"build",
   [junit4]   2> 	  "response":{"numFound":0,"start":0,"docs":[]
   [junit4]   2> 	  },
   [junit4]   2> 	  "spellcheck":{
   [junit4]   2> 	    "suggestions":{
   [junit4]   2> 	      "foo":{
   [junit4]   2> 	        "numFound":1,
   [junit4]   2> 	        "startOffset":0,
   [junit4]   2> 	        "endOffset":1,
   [junit4]   2> 	        "suggestion":["bar"]},
   [junit4]   2> 	      "bar":{
   [junit4]   2> 	        "numFound":1,
   [junit4]   2> 	        "startOffset":2,
   [junit4]   2> 	        "endOffset":3,
   [junit4]   2> 	        "suggestion":["foo"]}}}}
   [junit4]   2> 	
   [junit4]   2> 	 request = spellcheck.build=true&spellcheck=true&spellcheck..perDict.foo=bar&spellcheck.dictionary=perDict&json.nl=map&qt=spellCheckCompRH&spellcheck..perDict.bar=foo&q=documemt
   [junit4]   2> 837 T1699 oas.SolrTestCaseJ4.tearDown ###Ending testPerDictionary
   [junit4]   2> 839 T1699 C80 oasu.DirectUpdateHandler2.deleteAll [collection1] REMOVING
ALL DOCUMENTS FROM INDEX
   [junit4]   2> 839 T1699 C80 UPDATE [collection1] webapp=null path=null params={} {deleteByQuery=*:*}
0 0
   [junit4]   2> 842 T1699 C80 oasu.DirectUpdateHandler2.commit start commit{flags=0,version=0,optimize=false,openSearcher=true,waitSearcher=true,expungeDeletes=false,softCommit=false}
   [junit4]   2> 842 T1699 C80 oasc.SolrDeletionPolicy.onCommit SolrDeletionPolicy.onCommit:
commits:num=2
   [junit4]   2> 		commit{dir=MockDirWrapper(org.apache.lucene.store.RAMDirectory@46ddf1ca
lockFactory=org.apache.lucene.store.NativeFSLockFactory@47e6bd15),segFN=segments_2,generation=2,filenames=[_0.si,
segments_2, _0.fdt, _0_Lucene40_0.frq, _0_nrm.cfe, _0_Lucene40_0.prx, _0.fdx, _0_nrm.cfs,
_0_Lucene40_0.tim, _0_Lucene40_0.tip, _0.fnm]
   [junit4]   2> 		commit{dir=MockDirWrapper(org.apache.lucene.store.RAMDirectory@46ddf1ca
lockFactory=org.apache.lucene.store.NativeFSLockFactory@47e6bd15),segFN=segments_3,generation=3,filenames=[segments_3]
   [junit4]   2> 843 T1699 C80 oasc.SolrDeletionPolicy.updateCommits newest commit = 3
   [junit4]   2> 843 T1699 C80 oass.SolrIndexSearcher.<init> Opening Searcher@5ff8a691
main
   [junit4]   2> 843 T1699 C80 oass.SolrIndexSearcher.<init> WARNING WARNING: Directory
impl does not support setting indexDir: org.apache.lucene.store.MockDirectoryWrapper
   [junit4]   2> 843 T1700 oashc.SpellCheckComponent$SpellCheckerListener.buildSpellIndex
Building spell index for spell checker: default
   [junit4]   2> 843 T1699 C80 oasu.DirectUpdateHandler2.commit end_commit_flush
   [junit4]   2> 853 T1700 oashc.SpellCheckComponent$SpellCheckerListener.buildSpellIndex
Building spell index for spell checker: default_teststop
   [junit4]   2> 860 T1700 oashc.SpellCheckComponent$SpellCheckerListener.buildSpellIndex
Building spell index for spell checker: threshold
   [junit4]   2> 869 T1700 oashc.SpellCheckComponent$SpellCheckerListener.buildSpellIndex
Building spell index for spell checker: threshold_direct
   [junit4]   2> 869 T1700 oashc.SpellCheckComponent$SpellCheckerListener.buildSpellIndex
Building spell index for spell checker: multipleFields
   [junit4]   2> 878 T1700 oashc.SpellCheckComponent$SpellCheckerListener.buildSpellIndex
Building spell index for spell checker: freq
   [junit4]   2> 889 T1700 oashc.SpellCheckComponent$SpellCheckerListener.buildSpellIndex
Building spell index for spell checker: fqcn
   [junit4]   2> 898 T1700 oasc.SolrCore.registerSearcher [collection1] Registered new
searcher Searcher@5ff8a691 main{StandardDirectoryReader(segments_3:4)}
   [junit4]   2> 898 T1699 C80 UPDATE [collection1] webapp=null path=null params={} {commit=}
0 56
   [junit4]   2> NOTE: reproduce with: ant test  -Dtestcase=SpellCheckComponentTest -Dtests.method=testPerDictionary
-Dtests.seed=1FA56F87F03032D0 -Dtests.multiplier=3 -Dtests.slow=true -Dtests.locale=fi_FI
-Dtests.timezone=Etc/GMT-0 -Dargs="-Dfile.encoding=UTF-8"
   [junit4]   2>
   [junit4]    > (@AfterClass output)
   [junit4]   2> 3824 T1699 oas.SolrTestCaseJ4.deleteCore ###deleteCore
   [junit4]   2> 3824 T1699 oasc.CoreContainer.shutdown Shutting down CoreContainer instance=500302697
   [junit4]   2> 3824 T1699 oasc.SolrCore.close [collection1]  CLOSING SolrCore org.apache.solr.core.SolrCore@6ccf0e08
   [junit4]   2> 3824 T1699 oasc.SolrCore.closeSearcher [collection1] Closing main searcher
on request.
   [junit4]   2> 3824 T1699 oasu.DirectUpdateHandler2.close closing DirectUpdateHandler2{commits=20,autocommits=0,soft
autocommits=0,optimizes=0,rollbacks=0,expungeDeletes=0,docsPending=0,adds=0,deletesById=0,deletesByQuery=0,errors=0,cumulative_adds=92,cumulative_deletesById=0,cumulative_deletesByQuery=9,cumulative_errors=0}
   [junit4]   2> NOTE: test params are: codec=Lucene40: {end2=MockFixedIntBlock(blockSize=1406),
end4=Pulsing40(freqCutoff=12 minBlockSize=86 maxBlockSize=256), gram1=PostingsFormat(name=MockSep),
gram3=PostingsFormat(name=Lucene40WithOrds), start2=PostingsFormat(name=Lucene40WithOrds),
end1=PostingsFormat(name=MockSep), end3=PostingsFormat(name=Lucene40WithOrds), start4=PostingsFormat(name=MockSep),
gram4=Pulsing40(freqCutoff=12 minBlockSize=86 maxBlockSize=256), word=PostingsFormat(name=MockSep),
start3=MockFixedIntBlock(blockSize=1406), gram2=MockFixedIntBlock(blockSize=1406), start1=Pulsing40(freqCutoff=12
minBlockSize=86 maxBlockSize=256)}, sim=DefaultSimilarity, locale=fi_FI, timezone=Etc/GMT-0
   [junit4]   2> NOTE: Linux 2.6.32-41-server amd64/Oracle Corporation 1.8.0-ea (64-bit)/cpus=8,threads=1,free=9974456,total=279248896
   [junit4]   2> NOTE: All tests run in this JVM: [QueryEqualityTest, SignatureUpdateProcessorFactoryTest,
TestPorterStemFilterFactory, TestGreekStemFilterFactory, TestReverseStringFilterFactory, ResourceLoaderTest,
TestGermanNormalizationFilterFactory, SpellPossibilityIteratorTest, CSVRequestHandlerTest,
TestIBSimilarityFactory, TestRussianFilters, TestSolrDeletionPolicy2, TestCSVResponseWriter,
ZkControllerTest, SolrCoreTest, LeaderElectionTest, TestHunspellStemFilterFactory, TestGermanMinimalStemFilterFactory,
TestHindiFilters, TestChineseFilterFactory, HighlighterConfigTest, TestQuerySenderNoQuery,
DistanceFunctionTest, TestRecovery, SortByFunctionTest, IndexSchemaTest, TestCJKBigramFilterFactory,
WordBreakSolrSpellCheckerTest, UUIDFieldTest, TestLRUCache, ReturnFieldsTest, TestNumberUtils,
TestRangeQuery, TestHungarianLightStemFilterFactory, LoggingHandlerTest, DebugComponentTest,
IndexSchemaRuntimeFieldTest, FullSolrCloudTest, TestRussianLightStemFilterFactory, SpellCheckCollatorTest,
SampleTest, TestLMJelinekMercerSimilarityFactory, OverseerTest, CommonGramsFilterFactoryTest,
TestPortugueseLightStemFilterFactory, TermVectorComponentTest, IndexReaderFactoryTest, PeerSyncTest,
TestJapaneseTokenizerFactory, TestSuggestSpellingConverter, TestPseudoReturnFields, SolrPluginUtilsTest,
DirectSolrConnectionTest, TestWriterPerf, TestKeywordMarkerFilterFactory, TestLuceneMatchVersion,
TestKeepFilterFactory, TestFastLRUCache, TestCzechStemFilterFactory, TestQueryTypes, SpellingQueryConverterTest,
TestOmitPositions, PolyFieldTest, TestMultiWordSynonyms, TestWikipediaTokenizerFactory, URLClassifyProcessorTest,
UniqFieldsUpdateProcessorFactoryTest, FieldMutatingUpdateProcessorTest, DocumentBuilderTest,
TestBeiderMorseFilterFactory, TestJapaneseReadingFormFilterFactory, FieldAnalysisRequestHandlerTest,
TestGroupingSearch, TestUtils, UpdateParamsTest, BadIndexSchemaTest, ZkSolrClientTest, TestCoreContainer,
TestReplicationHandler, TestIndonesianStemFilterFactory, TestBinaryResponseWriter, TestNGramFilters,
NotRequiredUniqueKeyTest, NoCacheHeaderTest, TestPluginEnable, TestPropInjectDefaults, TestSort,
TimeZoneUtilsTest, TestMultiCoreConfBootstrap, MultiTermTest, TestEnglishMinimalStemFilterFactory,
TestGalicianMinimalStemFilterFactory, TestRealTimeGet, TestSolrDeletionPolicy1, TestStopFilterFactory,
SuggesterFSTTest, DocumentAnalysisRequestHandlerTest, SoftAutoCommitTest, TestXIncludeConfig,
TestLMDirichletSimilarityFactory, SpellCheckComponentTest]
   [junit4]   2> 
   [junit4] Completed on J1 in 3.85s, 9 tests, 1 error <<< FAILURES!

[...truncated 333 lines...]
BUILD FAILED
/mnt/ssd/jenkins/workspace/Lucene-Solr-4.x-Linux-Java8-64/checkout/build.xml:29: The following
error occurred while executing this line:
/mnt/ssd/jenkins/workspace/Lucene-Solr-4.x-Linux-Java8-64/checkout/solr/build.xml:144: The
following error occurred while executing this line:
/mnt/ssd/jenkins/workspace/Lucene-Solr-4.x-Linux-Java8-64/checkout/lucene/module-build.xml:62:
The following error occurred while executing this line:
/mnt/ssd/jenkins/workspace/Lucene-Solr-4.x-Linux-Java8-64/checkout/lucene/common-build.xml:1046:
The following error occurred while executing this line:
/mnt/ssd/jenkins/workspace/Lucene-Solr-4.x-Linux-Java8-64/checkout/lucene/common-build.xml:759:
There were test failures: 290 suites, 1052 tests, 1 error, 5 ignored

Total time: 47 minutes 19 seconds
Build step 'Execute shell' marked build as failure
Archiving artifacts
Recording test results
Email was triggered for: Failure
Sending email for trigger: Failure




Mime
View raw message