lucene-dev mailing list archives

Site index · List index
Message view « Date » · « Thread »
Top « Date » · « Thread »
From Policeman Jenkins Server <jenk...@sd-datasolutions.de>
Subject [JENKINS] Lucene-Solr-trunk-Linux-Java8-64 - Build # 18 - Still Failing!
Date Mon, 16 Jul 2012 20:51:42 GMT
Build: http://jenkins.sd-datasolutions.de/job/Lucene-Solr-trunk-Linux-Java8-64/18/

1 tests failed.
REGRESSION:  org.apache.solr.handler.component.SpellCheckComponentTest.testPerDictionary

Error Message:
mismatch: '0'!='2' @ spellcheck/suggestions/bar/startOffset

Stack Trace:
java.lang.RuntimeException: mismatch: '0'!='2' @ spellcheck/suggestions/bar/startOffset
	at __randomizedtesting.SeedInfo.seed([A08C2E52FD6C8C89:6782DAFAF50099C1]:0)
	at org.apache.solr.SolrTestCaseJ4.assertJQ(SolrTestCaseJ4.java:573)
	at org.apache.solr.SolrTestCaseJ4.assertJQ(SolrTestCaseJ4.java:521)
	at org.apache.solr.handler.component.SpellCheckComponentTest.testPerDictionary(SpellCheckComponentTest.java:102)
	at sun.reflect.NativeMethodAccessorImpl.invoke0(Native Method)
	at sun.reflect.NativeMethodAccessorImpl.invoke(NativeMethodAccessorImpl.java:57)
	at sun.reflect.DelegatingMethodAccessorImpl.invoke(DelegatingMethodAccessorImpl.java:43)
	at java.lang.reflect.Method.invoke(Method.java:474)
	at com.carrotsearch.randomizedtesting.RandomizedRunner.invoke(RandomizedRunner.java:1995)
	at com.carrotsearch.randomizedtesting.RandomizedRunner.access$1100(RandomizedRunner.java:132)
	at com.carrotsearch.randomizedtesting.RandomizedRunner$6.evaluate(RandomizedRunner.java:818)
	at com.carrotsearch.randomizedtesting.RandomizedRunner$7.evaluate(RandomizedRunner.java:877)
	at com.carrotsearch.randomizedtesting.RandomizedRunner$8.evaluate(RandomizedRunner.java:891)
	at com.carrotsearch.randomizedtesting.rules.SystemPropertiesRestoreRule$1.evaluate(SystemPropertiesRestoreRule.java:53)
	at org.apache.lucene.util.TestRuleSetupTeardownChained$1.evaluate(TestRuleSetupTeardownChained.java:50)
	at org.apache.lucene.util.TestRuleFieldCacheSanity$1.evaluate(TestRuleFieldCacheSanity.java:32)
	at org.apache.lucene.util.AbstractBeforeAfterRule$1.evaluate(AbstractBeforeAfterRule.java:45)
	at com.carrotsearch.randomizedtesting.rules.SystemPropertiesInvariantRule$1.evaluate(SystemPropertiesInvariantRule.java:55)
	at org.apache.lucene.util.TestRuleReportUncaughtExceptions$1.evaluate(TestRuleReportUncaughtExceptions.java:68)
	at org.apache.lucene.util.TestRuleThreadAndTestName$1.evaluate(TestRuleThreadAndTestName.java:48)
	at org.apache.lucene.util.TestRuleIgnoreAfterMaxFailures$1.evaluate(TestRuleIgnoreAfterMaxFailures.java:70)
	at org.apache.lucene.util.TestRuleMarkFailure$1.evaluate(TestRuleMarkFailure.java:48)
	at com.carrotsearch.randomizedtesting.RandomizedRunner.runSingleTest(RandomizedRunner.java:825)
	at com.carrotsearch.randomizedtesting.RandomizedRunner.access$700(RandomizedRunner.java:132)
	at com.carrotsearch.randomizedtesting.RandomizedRunner$3$1.run(RandomizedRunner.java:671)
	at com.carrotsearch.randomizedtesting.RandomizedRunner$3.evaluate(RandomizedRunner.java:697)
	at com.carrotsearch.randomizedtesting.RandomizedRunner$4.evaluate(RandomizedRunner.java:736)
	at com.carrotsearch.randomizedtesting.RandomizedRunner$5.evaluate(RandomizedRunner.java:747)
	at com.carrotsearch.randomizedtesting.rules.SystemPropertiesRestoreRule$1.evaluate(SystemPropertiesRestoreRule.java:53)
	at org.apache.lucene.util.AbstractBeforeAfterRule$1.evaluate(AbstractBeforeAfterRule.java:45)
	at org.apache.lucene.util.TestRuleReportUncaughtExceptions$1.evaluate(TestRuleReportUncaughtExceptions.java:68)
	at org.apache.lucene.util.TestRuleStoreClassName$1.evaluate(TestRuleStoreClassName.java:38)
	at org.apache.lucene.util.TestRuleIcuHack$1.evaluate(TestRuleIcuHack.java:51)
	at com.carrotsearch.randomizedtesting.rules.SystemPropertiesInvariantRule$1.evaluate(SystemPropertiesInvariantRule.java:55)
	at org.apache.lucene.util.TestRuleNoInstanceHooksOverrides$1.evaluate(TestRuleNoInstanceHooksOverrides.java:53)
	at org.apache.lucene.util.TestRuleNoStaticHooksShadowing$1.evaluate(TestRuleNoStaticHooksShadowing.java:52)
	at org.apache.lucene.util.TestRuleAssertionsRequired$1.evaluate(TestRuleAssertionsRequired.java:36)
	at org.apache.lucene.util.TestRuleMarkFailure$1.evaluate(TestRuleMarkFailure.java:48)
	at org.apache.lucene.util.TestRuleIgnoreAfterMaxFailures$1.evaluate(TestRuleIgnoreAfterMaxFailures.java:70)
	at org.apache.lucene.util.TestRuleIgnoreTestSuites$1.evaluate(TestRuleIgnoreTestSuites.java:55)
	at com.carrotsearch.randomizedtesting.RandomizedRunner.runSuite(RandomizedRunner.java:605)
	at com.carrotsearch.randomizedtesting.RandomizedRunner.access$400(RandomizedRunner.java:132)
	at com.carrotsearch.randomizedtesting.RandomizedRunner$2.run(RandomizedRunner.java:551)




Build Log:
[...truncated 16438 lines...]
[junit4:junit4] Suite: org.apache.solr.handler.component.SpellCheckComponentTest
[junit4:junit4]    > (@BeforeClass output)
[junit4:junit4]   2> 0 T1537 oas.SolrTestCaseJ4.initCore ####initCore
[junit4:junit4]   2> Creating dataDir: /mnt/ssd/jenkins/workspace/Lucene-Solr-trunk-Linux-Java8-64/checkout/solr/build/solr-core/test/J0/./solrtest-SpellCheckComponentTest-1342471760631
[junit4:junit4]   2> 0 T1537 oasc.SolrResourceLoader.<init> new SolrResourceLoader
for directory: '/mnt/ssd/jenkins/workspace/Lucene-Solr-trunk-Linux-Java8-64/checkout/solr/build/solr-core/test-files/solr/collection1/'
[junit4:junit4]   2> 0 T1537 oasc.SolrResourceLoader.replaceClassLoader Adding 'file:/mnt/ssd/jenkins/workspace/Lucene-Solr-trunk-Linux-Java8-64/checkout/solr/build/solr-core/test-files/solr/collection1/lib/README'
to classloader
[junit4:junit4]   2> 0 T1537 oasc.SolrResourceLoader.replaceClassLoader Adding 'file:/mnt/ssd/jenkins/workspace/Lucene-Solr-trunk-Linux-Java8-64/checkout/solr/build/solr-core/test-files/solr/collection1/lib/classes/'
to classloader
[junit4:junit4]   2> 13 T1537 oasc.SolrConfig.<init> Using Lucene MatchVersion: LUCENE_50
[junit4:junit4]   2> 38 T1537 oasc.SolrConfig.<init> Loaded SolrConfig: solrconfig-spellcheckcomponent.xml
[junit4:junit4]   2> 39 T1537 oass.IndexSchema.readSchema Reading Solr Schema
[junit4:junit4]   2> 41 T1537 oass.IndexSchema.readSchema Schema name=test
[junit4:junit4]   2> 299 T1537 oass.OpenExchangeRatesOrgProvider.init Initialized with
rates=open-exchange-rates.json, refreshInterval=1440.
[junit4:junit4]   2> 303 T1537 oass.IndexSchema.readSchema default search field in schema
is text
[junit4:junit4]   2> 304 T1537 oass.IndexSchema.readSchema unique key field: id
[junit4:junit4]   2> 307 T1537 oass.FileExchangeRateProvider.reload Reloading exchange
rates from file currency.xml
[junit4:junit4]   2> 308 T1537 oass.FileExchangeRateProvider.reload Reloading exchange
rates from file currency.xml
[junit4:junit4]   2> 310 T1537 oass.OpenExchangeRatesOrgProvider.reload Reloading exchange
rates from open-exchange-rates.json
[junit4:junit4]   2> 310 T1537 oass.OpenExchangeRatesOrgProvider.reload Reloading exchange
rates from open-exchange-rates.json
[junit4:junit4]   2> 310 T1537 oasc.SolrResourceLoader.locateSolrHome JNDI not configured
for solr (NoInitialContextEx)
[junit4:junit4]   2> 310 T1537 oasc.SolrResourceLoader.locateSolrHome using system property
solr.solr.home: /mnt/ssd/jenkins/workspace/Lucene-Solr-trunk-Linux-Java8-64/checkout/solr/build/solr-core/test-files/solr
[junit4:junit4]   2> 311 T1537 oasc.SolrResourceLoader.<init> new SolrResourceLoader
for directory: '/mnt/ssd/jenkins/workspace/Lucene-Solr-trunk-Linux-Java8-64/checkout/solr/build/solr-core/test-files/solr/'
[junit4:junit4]   2> 311 T1537 oasc.CoreContainer.<init> New CoreContainer 149511971
[junit4:junit4]   2> 311 T1537 oasc.SolrCore.<init> [collection1] Opening new SolrCore
at /mnt/ssd/jenkins/workspace/Lucene-Solr-trunk-Linux-Java8-64/checkout/solr/build/solr-core/test-files/solr/collection1/,
dataDir=/mnt/ssd/jenkins/workspace/Lucene-Solr-trunk-Linux-Java8-64/checkout/solr/build/solr-core/test/J0/./solrtest-SpellCheckComponentTest-1342471760631/
[junit4:junit4]   2> 311 T1537 oasc.SolrCore.<init> JMX monitoring not detected for
core: collection1
[junit4:junit4]   2> 311 T1537 oasc.SolrCore.getNewIndexDir WARNING New index directory
detected: old=null new=/mnt/ssd/jenkins/workspace/Lucene-Solr-trunk-Linux-Java8-64/checkout/solr/build/solr-core/test/J0/./solrtest-SpellCheckComponentTest-1342471760631/index/
[junit4:junit4]   2> 311 T1537 oasc.SolrCore.initIndex WARNING [collection1] Solr index
directory '/mnt/ssd/jenkins/workspace/Lucene-Solr-trunk-Linux-Java8-64/checkout/solr/build/solr-core/test/J0/./solrtest-SpellCheckComponentTest-1342471760631/index'
doesn't exist. Creating new index...
[junit4:junit4]   2> 313 T1537 oasc.SolrDeletionPolicy.onCommit SolrDeletionPolicy.onCommit:
commits:num=1
[junit4:junit4]   2> 		commit{dir=MockDirWrapper(org.apache.lucene.store.RAMDirectory@1164f767
lockFactory=org.apache.lucene.store.NativeFSLockFactory@27df9b4),segFN=segments_1,generation=1,filenames=[segments_1]
[junit4:junit4]   2> 313 T1537 oasc.SolrDeletionPolicy.updateCommits newest commit = 1
[junit4:junit4]   2> 313 T1537 oasc.RequestHandlers.initHandlersFromConfig created standard:
solr.StandardRequestHandler
[junit4:junit4]   2> 314 T1537 oasc.RequestHandlers.initHandlersFromConfig created spellCheckCompRH:
org.apache.solr.handler.component.SearchHandler
[junit4:junit4]   2> 314 T1537 oasc.RequestHandlers.initHandlersFromConfig created spellCheckCompRH1:
org.apache.solr.handler.component.SearchHandler
[junit4:junit4]   2> 314 T1537 oasc.RequestHandlers.initHandlersFromConfig created spellCheckWithWordbreak:
org.apache.solr.handler.component.SearchHandler
[junit4:junit4]   2> 315 T1537 oass.SolrIndexSearcher.<init> Opening Searcher@78e9591c
main
[junit4:junit4]   2> 316 T1537 oass.SolrIndexSearcher.getIndexDir WARNING WARNING: Directory
impl does not support setting indexDir: org.apache.lucene.store.MockDirectoryWrapper
[junit4:junit4]   2> 316 T1537 oasu.CommitTracker.<init> Hard AutoCommit: disabled
[junit4:junit4]   2> 316 T1537 oasu.CommitTracker.<init> Soft AutoCommit: disabled
[junit4:junit4]   2> 316 T1537 oashc.SpellCheckComponent.inform Initializing spell checkers
[junit4:junit4]   2> 318 T1537 oashc.SpellCheckComponent.inform Registering newSearcher
listener for spellchecker: default
[junit4:junit4]   2> 320 T1537 oashc.SpellCheckComponent.inform Registering newSearcher
listener for spellchecker: default_teststop
[junit4:junit4]   2> 320 T1537 oass.DirectSolrSpellChecker.init init: {name=direct,classname=solr.DirectSolrSpellChecker,minQueryLength=3,maxQueryFrequency=100.0,field=teststop}
[junit4:junit4]   2> 321 T1537 oass.DirectSolrSpellChecker.init init: {name=direct_lowerfilt,classname=solr.DirectSolrSpellChecker,minQueryLength=3,maxQueryFrequency=100.0,field=lowerfilt}
[junit4:junit4]   2> 323 T1537 oashc.SpellCheckComponent.inform Registering newSearcher
listener for spellchecker: threshold
[junit4:junit4]   2> 323 T1537 oass.DirectSolrSpellChecker.init init: {name=threshold_direct,classname=solr.DirectSolrSpellChecker,field=lowerfilt,spellcheckIndexDir=spellcheckerThreshold,buildOnCommit=true,thresholdTokenFrequency=0.29}
[junit4:junit4]   2> 323 T1537 oashc.SpellCheckComponent.inform Registering newSearcher
listener for spellchecker: threshold_direct
[junit4:junit4]   2> 325 T1537 oashc.SpellCheckComponent.inform Registering newSearcher
listener for spellchecker: multipleFields
[junit4:junit4]   2> 331 T1537 oashc.SpellCheckComponent.inform Registering newSearcher
listener for spellchecker: freq
[junit4:junit4]   2> 335 T1537 oashc.SpellCheckComponent.inform Registering newSearcher
listener for spellchecker: fqcn
[junit4:junit4]   2> 335 T1537 oashc.HttpShardHandlerFactory.getParameter Setting socketTimeout
to: 0
[junit4:junit4]   2> 335 T1537 oashc.HttpShardHandlerFactory.getParameter Setting urlScheme
to: http://
[junit4:junit4]   2> 335 T1537 oashc.HttpShardHandlerFactory.getParameter Setting connTimeout
to: 0
[junit4:junit4]   2> 336 T1537 oashc.HttpShardHandlerFactory.getParameter Setting maxConnectionsPerHost
to: 20
[junit4:junit4]   2> 336 T1537 oashc.HttpShardHandlerFactory.getParameter Setting corePoolSize
to: 0
[junit4:junit4]   2> 336 T1537 oashc.HttpShardHandlerFactory.getParameter Setting maximumPoolSize
to: 2147483647
[junit4:junit4]   2> 336 T1537 oashc.HttpShardHandlerFactory.getParameter Setting maxThreadIdleTime
to: 5
[junit4:junit4]   2> 336 T1537 oashc.HttpShardHandlerFactory.getParameter Setting sizeOfQueue
to: -1
[junit4:junit4]   2> 336 T1537 oashc.HttpShardHandlerFactory.getParameter Setting fairnessPolicy
to: false
[junit4:junit4]   2> 336 T1537 oascsi.HttpClientUtil.createClient Creating new http client,
config:maxConnectionsPerHost=20&maxConnections=10000&socketTimeout=0&connTimeout=0&retry=false
[junit4:junit4]   2> 338 T1538 oasc.SolrCore.registerSearcher [collection1] Registered
new searcher Searcher@78e9591c main{StandardDirectoryReader(segments_1:1)}
[junit4:junit4]   2> 338 T1537 oasc.CoreContainer.register registering core: collection1
[junit4:junit4]   2> 339 T1537 oas.SolrTestCaseJ4.initCore ####initCore end
[junit4:junit4]   2> 
[junit4:junit4] ERROR   0.56s J0 | SpellCheckComponentTest.testPerDictionary
[junit4:junit4]    > Throwable #1: java.lang.RuntimeException: mismatch: '0'!='2' @ spellcheck/suggestions/bar/startOffset
[junit4:junit4]    > 	at __randomizedtesting.SeedInfo.seed([A08C2E52FD6C8C89:6782DAFAF50099C1]:0)
[junit4:junit4]    > 	at org.apache.solr.SolrTestCaseJ4.assertJQ(SolrTestCaseJ4.java:573)
[junit4:junit4]    > 	at org.apache.solr.SolrTestCaseJ4.assertJQ(SolrTestCaseJ4.java:521)
[junit4:junit4]    > 	at org.apache.solr.handler.component.SpellCheckComponentTest.testPerDictionary(SpellCheckComponentTest.java:102)
[junit4:junit4]    > 	at sun.reflect.NativeMethodAccessorImpl.invoke0(Native Method)
[junit4:junit4]    > 	at sun.reflect.NativeMethodAccessorImpl.invoke(NativeMethodAccessorImpl.java:57)
[junit4:junit4]    > 	at sun.reflect.DelegatingMethodAccessorImpl.invoke(DelegatingMethodAccessorImpl.java:43)
[junit4:junit4]    > 	at java.lang.reflect.Method.invoke(Method.java:474)
[junit4:junit4]    > 	at com.carrotsearch.randomizedtesting.RandomizedRunner.invoke(RandomizedRunner.java:1995)
[junit4:junit4]    > 	at com.carrotsearch.randomizedtesting.RandomizedRunner.access$1100(RandomizedRunner.java:132)
[junit4:junit4]    > 	at com.carrotsearch.randomizedtesting.RandomizedRunner$6.evaluate(RandomizedRunner.java:818)
[junit4:junit4]    > 	at com.carrotsearch.randomizedtesting.RandomizedRunner$7.evaluate(RandomizedRunner.java:877)
[junit4:junit4]    > 	at com.carrotsearch.randomizedtesting.RandomizedRunner$8.evaluate(RandomizedRunner.java:891)
[junit4:junit4]    > 	at com.carrotsearch.randomizedtesting.rules.SystemPropertiesRestoreRule$1.evaluate(SystemPropertiesRestoreRule.java:53)
[junit4:junit4]    > 	at org.apache.lucene.util.TestRuleSetupTeardownChained$1.evaluate(TestRuleSetupTeardownChained.java:50)
[junit4:junit4]    > 	at org.apache.lucene.util.TestRuleFieldCacheSanity$1.evaluate(TestRuleFieldCacheSanity.java:32)
[junit4:junit4]    > 	at org.apache.lucene.util.AbstractBeforeAfterRule$1.evaluate(AbstractBeforeAfterRule.java:45)
[junit4:junit4]    > 	at com.carrotsearch.randomizedtesting.rules.SystemPropertiesInvariantRule$1.evaluate(SystemPropertiesInvariantRule.java:55)
[junit4:junit4]    > 	at org.apache.lucene.util.TestRuleReportUncaughtExceptions$1.evaluate(TestRuleReportUncaughtExceptions.java:68)
[junit4:junit4]    > 	at org.apache.lucene.util.TestRuleThreadAndTestName$1.evaluate(TestRuleThreadAndTestName.java:48)
[junit4:junit4]    > 	at org.apache.lucene.util.TestRuleIgnoreAfterMaxFailures$1.evaluate(TestRuleIgnoreAfterMaxFailures.java:70)
[junit4:junit4]    > 	at org.apache.lucene.util.TestRuleMarkFailure$1.evaluate(TestRuleMarkFailure.java:48)
[junit4:junit4]    > 	at com.carrotsearch.randomizedtesting.RandomizedRunner.runSingleTest(RandomizedRunner.java:825)
[junit4:junit4]    > 	at com.carrotsearch.randomizedtesting.RandomizedRunner.access$700(RandomizedRunner.java:132)
[junit4:junit4]    > 	at com.carrotsearch.randomizedtesting.RandomizedRunner$3$1.run(RandomizedRunner.java:671)
[junit4:junit4]    > 	at com.carrotsearch.randomizedtesting.RandomizedRunner$3.evaluate(RandomizedRunner.java:697)
[junit4:junit4]    > 	at com.carrotsearch.randomizedtesting.RandomizedRunner$4.evaluate(RandomizedRunner.java:736)
[junit4:junit4]    > 	at com.carrotsearch.randomizedtesting.RandomizedRunner$5.evaluate(RandomizedRunner.java:747)
[junit4:junit4]    > 	at com.carrotsearch.randomizedtesting.rules.SystemPropertiesRestoreRule$1.evaluate(SystemPropertiesRestoreRule.java:53)
[junit4:junit4]    > 	at org.apache.lucene.util.AbstractBeforeAfterRule$1.evaluate(AbstractBeforeAfterRule.java:45)
[junit4:junit4]    > 	at org.apache.lucene.util.TestRuleReportUncaughtExceptions$1.evaluate(TestRuleReportUncaughtExceptions.java:68)
[junit4:junit4]    > 	at org.apache.lucene.util.TestRuleStoreClassName$1.evaluate(TestRuleStoreClassName.java:38)
[junit4:junit4]    > 	at org.apache.lucene.util.TestRuleIcuHack$1.evaluate(TestRuleIcuHack.java:51)
[junit4:junit4]    > 	at com.carrotsearch.randomizedtesting.rules.SystemPropertiesInvariantRule$1.evaluate(SystemPropertiesInvariantRule.java:55)
[junit4:junit4]    > 	at org.apache.lucene.util.TestRuleNoInstanceHooksOverrides$1.evaluate(TestRuleNoInstanceHooksOverrides.java:53)
[junit4:junit4]    > 	at org.apache.lucene.util.TestRuleNoStaticHooksShadowing$1.evaluate(TestRuleNoStaticHooksShadowing.java:52)
[junit4:junit4]    > 	at org.apache.lucene.util.TestRuleAssertionsRequired$1.evaluate(TestRuleAssertionsRequired.java:36)
[junit4:junit4]    > 	at org.apache.lucene.util.TestRuleMarkFailure$1.evaluate(TestRuleMarkFailure.java:48)
[junit4:junit4]    > 	at org.apache.lucene.util.TestRuleIgnoreAfterMaxFailures$1.evaluate(TestRuleIgnoreAfterMaxFailures.java:70)
[junit4:junit4]    > 	at org.apache.lucene.util.TestRuleIgnoreTestSuites$1.evaluate(TestRuleIgnoreTestSuites.java:55)
[junit4:junit4]    > 	at com.carrotsearch.randomizedtesting.RandomizedRunner.runSuite(RandomizedRunner.java:605)
[junit4:junit4]    > 	at com.carrotsearch.randomizedtesting.RandomizedRunner.access$400(RandomizedRunner.java:132)
[junit4:junit4]    > 	at com.carrotsearch.randomizedtesting.RandomizedRunner$2.run(RandomizedRunner.java:551)
[junit4:junit4]    > 
[junit4:junit4]   2> 2794 T1537 oas.SolrTestCaseJ4.setUp ###Starting testPerDictionary
[junit4:junit4]   2> 2797 T1537 C76 UPDATE [collection1] webapp=null path=null params={}
{add=[0]} 0 0
[junit4:junit4]   2> 2801 T1537 C76 UPDATE [collection1] webapp=null path=null params={}
{add=[1]} 0 1
[junit4:junit4]   2> 2803 T1537 C76 UPDATE [collection1] webapp=null path=null params={}
{add=[2]} 0 0
[junit4:junit4]   2> 2806 T1537 C76 UPDATE [collection1] webapp=null path=null params={}
{add=[3]} 0 0
[junit4:junit4]   2> 2809 T1537 C76 UPDATE [collection1] webapp=null path=null params={}
{add=[4]} 0 0
[junit4:junit4]   2> 2812 T1537 C76 UPDATE [collection1] webapp=null path=null params={}
{add=[5]} 0 1
[junit4:junit4]   2> 2815 T1537 C76 UPDATE [collection1] webapp=null path=null params={}
{add=[6]} 0 0
[junit4:junit4]   2> 2818 T1537 C76 UPDATE [collection1] webapp=null path=null params={}
{add=[7]} 0 0
[junit4:junit4]   2> 2821 T1537 C76 UPDATE [collection1] webapp=null path=null params={}
{add=[8]} 0 1
[junit4:junit4]   2> 2824 T1537 C76 UPDATE [collection1] webapp=null path=null params={}
{add=[9]} 0 1
[junit4:junit4]   2> 2826 T1537 C76 oasu.DirectUpdateHandler2.commit start commit{flags=0,version=0,optimize=false,openSearcher=true,waitSearcher=true,expungeDeletes=false,softCommit=false}
[junit4:junit4]   2> 2828 T1537 C76 oasc.SolrDeletionPolicy.onCommit SolrDeletionPolicy.onCommit:
commits:num=2
[junit4:junit4]   2> 		commit{dir=MockDirWrapper(org.apache.lucene.store.RAMDirectory@1164f767
lockFactory=org.apache.lucene.store.NativeFSLockFactory@27df9b4),segFN=segments_a,generation=10,filenames=[segments_a]
[junit4:junit4]   2> 		commit{dir=MockDirWrapper(org.apache.lucene.store.RAMDirectory@1164f767
lockFactory=org.apache.lucene.store.NativeFSLockFactory@27df9b4),segFN=segments_b,generation=11,filenames=[_5_Pulsing40_0.prx,
_5_Pulsing40_0.frq, _5_MockSep_0.tii, _5_nrm.cfs, _5.fdt, _5_Memory_0.ram, _5_MockRandom_0.tii,
_5.fdx, _5_MockRandom_0.sd, _5_MockSep_0.pyl, _5_MockRandom_0.frq, _5_nrm.cfe, _5_Pulsing40_0.tim,
_5_MockSep_0.pos, _5_MockSep_0.doc, _5.si, _5_MockSep_0.frq, _5_Pulsing40_0.tip, _5.fnm, segments_b,
_5_MockRandom_0.tib, _5_MockRandom_0.prx, _5_MockSep_0.tib, _5_MockSep_0.skp]
[junit4:junit4]   2> 2829 T1537 C76 oasc.SolrDeletionPolicy.updateCommits newest commit
= 11
[junit4:junit4]   2> 2830 T1537 C76 oass.SolrIndexSearcher.<init> Opening Searcher@2d5747e7
main
[junit4:junit4]   2> 2830 T1537 C76 oass.SolrIndexSearcher.getIndexDir WARNING WARNING:
Directory impl does not support setting indexDir: org.apache.lucene.store.MockDirectoryWrapper
[junit4:junit4]   2> 2830 T1538 oashc.SpellCheckComponent$SpellCheckerListener.buildSpellIndex
Building spell index for spell checker: default
[junit4:junit4]   2> 2830 T1537 C76 oasu.DirectUpdateHandler2.commit end_commit_flush
[junit4:junit4]   2> 2863 T1538 oashc.SpellCheckComponent$SpellCheckerListener.buildSpellIndex
Building spell index for spell checker: default_teststop
[junit4:junit4]   2> 2883 T1538 oashc.SpellCheckComponent$SpellCheckerListener.buildSpellIndex
Building spell index for spell checker: threshold
[junit4:junit4]   2> 2923 T1538 oashc.SpellCheckComponent$SpellCheckerListener.buildSpellIndex
Building spell index for spell checker: threshold_direct
[junit4:junit4]   2> 2923 T1538 oashc.SpellCheckComponent$SpellCheckerListener.buildSpellIndex
Building spell index for spell checker: multipleFields
[junit4:junit4]   2> 2963 T1538 oashc.SpellCheckComponent$SpellCheckerListener.buildSpellIndex
Building spell index for spell checker: freq
[junit4:junit4]   2> 3014 T1538 oashc.SpellCheckComponent$SpellCheckerListener.buildSpellIndex
Building spell index for spell checker: fqcn
[junit4:junit4]   2> 3054 T1538 oasc.SolrCore.registerSearcher [collection1] Registered
new searcher Searcher@2d5747e7 main{StandardDirectoryReader(segments_b:17 _5(5.0):C10)}
[junit4:junit4]   2> 3055 T1537 C76 UPDATE [collection1] webapp=null path=null params={}
{commit=} 0 229
[junit4:junit4]   2> 3056 T1537 C76 REQ [collection1] webapp=null path=null params={json.nl=map&spellcheck..perDict.foo=bar&spellcheck=true&qt=spellCheckCompRH&spellcheck.build=true&spellcheck..perDict.bar=foo&q=documemt&spellcheck.dictionary=perDict}
hits=0 status=0 QTime=0 
[junit4:junit4]   2> 3057 T1537 oas.SolrTestCaseJ4.assertJQ SEVERE query failed JSON validation.
error=mismatch: '0'!='2' @ spellcheck/suggestions/bar/startOffset
[junit4:junit4]   2> 	 expected =/spellcheck/suggestions/bar=={"numFound":1, "startOffset":0,
"endOffset":1, "suggestion":["foo"]}
[junit4:junit4]   2> 	 response = {
[junit4:junit4]   2> 	  "responseHeader":{
[junit4:junit4]   2> 	    "status":0,
[junit4:junit4]   2> 	    "QTime":0},
[junit4:junit4]   2> 	  "command":"build",
[junit4:junit4]   2> 	  "response":{"numFound":0,"start":0,"docs":[]
[junit4:junit4]   2> 	  },
[junit4:junit4]   2> 	  "spellcheck":{
[junit4:junit4]   2> 	    "suggestions":{
[junit4:junit4]   2> 	      "foo":{
[junit4:junit4]   2> 	        "numFound":1,
[junit4:junit4]   2> 	        "startOffset":0,
[junit4:junit4]   2> 	        "endOffset":1,
[junit4:junit4]   2> 	        "suggestion":["bar"]},
[junit4:junit4]   2> 	      "bar":{
[junit4:junit4]   2> 	        "numFound":1,
[junit4:junit4]   2> 	        "startOffset":2,
[junit4:junit4]   2> 	        "endOffset":3,
[junit4:junit4]   2> 	        "suggestion":["foo"]}}}}
[junit4:junit4]   2> 	
[junit4:junit4]   2> 	 request = json.nl=map&spellcheck..perDict.foo=bar&spellcheck=true&qt=spellCheckCompRH&spellcheck.build=true&spellcheck..perDict.bar=foo&q=documemt&spellcheck.dictionary=perDict
[junit4:junit4]   2> 3058 T1537 oas.SolrTestCaseJ4.tearDown ###Ending testPerDictionary
[junit4:junit4]   2> 3068 T1537 C76 oasu.DirectUpdateHandler2.deleteAll [collection1] REMOVING
ALL DOCUMENTS FROM INDEX
[junit4:junit4]   2> 3069 T1537 C76 UPDATE [collection1] webapp=null path=null params={}
{deleteByQuery=*:*} 0 1
[junit4:junit4]   2> 3072 T1537 C76 oasu.DirectUpdateHandler2.commit start commit{flags=0,version=0,optimize=false,openSearcher=true,waitSearcher=true,expungeDeletes=false,softCommit=false}
[junit4:junit4]   2> 3073 T1537 C76 oasc.SolrDeletionPolicy.onCommit SolrDeletionPolicy.onCommit:
commits:num=2
[junit4:junit4]   2> 		commit{dir=MockDirWrapper(org.apache.lucene.store.RAMDirectory@1164f767
lockFactory=org.apache.lucene.store.NativeFSLockFactory@27df9b4),segFN=segments_b,generation=11,filenames=[_5_Pulsing40_0.prx,
_5_Pulsing40_0.frq, _5_MockSep_0.tii, _5_nrm.cfs, _5.fdt, _5_Memory_0.ram, _5_MockRandom_0.tii,
_5.fdx, _5_MockRandom_0.sd, _5_MockSep_0.pyl, _5_MockRandom_0.frq, _5_nrm.cfe, _5_Pulsing40_0.tim,
_5_MockSep_0.pos, _5_MockSep_0.doc, _5.si, _5_MockSep_0.frq, _5_Pulsing40_0.tip, _5.fnm, segments_b,
_5_MockRandom_0.tib, _5_MockRandom_0.prx, _5_MockSep_0.tib, _5_MockSep_0.skp]
[junit4:junit4]   2> 		commit{dir=MockDirWrapper(org.apache.lucene.store.RAMDirectory@1164f767
lockFactory=org.apache.lucene.store.NativeFSLockFactory@27df9b4),segFN=segments_c,generation=12,filenames=[segments_c]
[junit4:junit4]   2> 3073 T1537 C76 oasc.SolrDeletionPolicy.updateCommits newest commit
= 12
[junit4:junit4]   2> 3074 T1537 C76 oass.SolrIndexSearcher.<init> Opening Searcher@29fee8e2
main
[junit4:junit4]   2> 3074 T1537 C76 oass.SolrIndexSearcher.getIndexDir WARNING WARNING:
Directory impl does not support setting indexDir: org.apache.lucene.store.MockDirectoryWrapper
[junit4:junit4]   2> 3074 T1538 oashc.SpellCheckComponent$SpellCheckerListener.buildSpellIndex
Building spell index for spell checker: default
[junit4:junit4]   2> 3074 T1537 C76 oasu.DirectUpdateHandler2.commit end_commit_flush
[junit4:junit4]   2> 3085 T1538 oashc.SpellCheckComponent$SpellCheckerListener.buildSpellIndex
Building spell index for spell checker: default_teststop
[junit4:junit4]   2> 3103 T1538 oashc.SpellCheckComponent$SpellCheckerListener.buildSpellIndex
Building spell index for spell checker: threshold
[junit4:junit4]   2> 3123 T1538 oashc.SpellCheckComponent$SpellCheckerListener.buildSpellIndex
Building spell index for spell checker: threshold_direct
[junit4:junit4]   2> 3124 T1538 oashc.SpellCheckComponent$SpellCheckerListener.buildSpellIndex
Building spell index for spell checker: multipleFields
[junit4:junit4]   2> 3165 T1538 oashc.SpellCheckComponent$SpellCheckerListener.buildSpellIndex
Building spell index for spell checker: freq
[junit4:junit4]   2> 3214 T1538 oashc.SpellCheckComponent$SpellCheckerListener.buildSpellIndex
Building spell index for spell checker: fqcn
[junit4:junit4]   2> 3274 T1538 oasc.SolrCore.registerSearcher [collection1] Registered
new searcher Searcher@29fee8e2 main{StandardDirectoryReader(segments_c:18)}
[junit4:junit4]   2> 3275 T1537 C76 UPDATE [collection1] webapp=null path=null params={}
{commit=} 0 203
[junit4:junit4]   2> NOTE: reproduce with: ant test  -Dtestcase=SpellCheckComponentTest
-Dtests.method=testPerDictionary -Dtests.seed=A08C2E52FD6C8C89 -Dtests.multiplier=3 -Dtests.slow=true
-Dtests.locale=ar_SD -Dtests.timezone=GB-Eire -Dtests.file.encoding=ISO-8859-1
[junit4:junit4]   2>
[junit4:junit4]    > (@AfterClass output)
[junit4:junit4]   2> 6352 T1537 oas.SolrTestCaseJ4.deleteCore ###deleteCore
[junit4:junit4]   2> 6352 T1537 oasc.CoreContainer.shutdown Shutting down CoreContainer
instance=149511971
[junit4:junit4]   2> 6352 T1537 oasc.SolrCore.close [collection1]  CLOSING SolrCore org.apache.solr.core.SolrCore@4fcfce14
[junit4:junit4]   2> 6353 T1537 oasc.SolrCore.closeSearcher [collection1] Closing main
searcher on request.
[junit4:junit4]   2> 6353 T1537 oasu.DirectUpdateHandler2.close closing DirectUpdateHandler2{commits=20,autocommits=0,soft
autocommits=0,optimizes=0,rollbacks=0,expungeDeletes=0,docsPending=0,adds=0,deletesById=0,deletesByQuery=0,errors=0,cumulative_adds=92,cumulative_deletesById=0,cumulative_deletesByQuery=9,cumulative_errors=0}
[junit4:junit4]   2> NOTE: test params are: codec=Lucene40: {lowerfilt=PostingsFormat(name=MockSep),
range_facet_l=PostingsFormat(name=MockRandom), word=PostingsFormat(name=MockRandom), gram4=Pulsing40(freqCutoff=20
minBlockSize=76 maxBlockSize=169), range_facet_sl=Pulsing40(freqCutoff=20 minBlockSize=76
maxBlockSize=169), start4=PostingsFormat(name=MockRandom), range_facet_si=PostingsFormat(name=MockSep),
start1=Pulsing40(freqCutoff=20 minBlockSize=76 maxBlockSize=169), id=PostingsFormat(name=Memory
doPackFST= true), end1=PostingsFormat(name=MockRandom), gram2=PostingsFormat(name=Memory doPackFST=
true), timestamp=PostingsFormat(name=MockRandom), end3=PostingsFormat(name=MockSep), start3=PostingsFormat(name=Memory
doPackFST= true), gram3=PostingsFormat(name=MockSep), gram1=PostingsFormat(name=MockRandom),
intDefault=PostingsFormat(name=MockRandom), lowerfilt1and2=PostingsFormat(name=MockSep), multiDefault=PostingsFormat(name=MockSep),
end2=PostingsFormat(name=Memory doPackFST= true), start2=PostingsFormat(name=MockSep), end4=Pulsing40(freqCutoff=20
minBlockSize=76 maxBlockSize=169)}, sim=DefaultSimilarity, locale=ar_SD, timezone=GB-Eire
[junit4:junit4]   2> NOTE: Linux 3.2.0-26-generic amd64/Oracle Corporation 1.8.0-ea (64-bit)/cpus=8,threads=1,free=231094000,total=453836800
[junit4:junit4]   2> NOTE: All tests run in this JVM: [TestLatvianStemFilterFactory, CacheHeaderTest,
PrimitiveFieldTypeTest, TestStandardFactories, TestPhraseSuggestions, ConvertedLegacyTest,
TestFunctionQuery, TestExtendedDismaxParser, TestNorwegianLightStemFilterFactory, TestJapaneseKatakanaStemFilterFactory,
BasicFunctionalityTest, SuggesterTSTTest, TestDelimitedPayloadTokenFilterFactory, TestPhoneticFilterFactory,
DistributedQueryElevationComponentTest, TestLFUCache, TestBM25SimilarityFactory, CurrencyFieldTest,
TestHTMLStripCharFilterFactory, DirectUpdateHandlerTest, TestJapaneseIterationMarkCharFilterFactory,
TestJapaneseBaseFormFilterFactory, TestBrazilianStemFilterFactory, TestFinnishLightStemFilterFactory,
TestFaceting, TestQueryUtils, AutoCommitTest, DisMaxRequestHandlerTest, TestBinaryField, TestFoldingMultitermQuery,
DistributedSpellCheckComponentTest, TestDistributedSearch, TestFiltering, SolrRequestParserTest,
TestReversedWildcardFilterFactory, TestRemoveDuplicatesTokenFilterFactory, TestMappingCharFilterFactory,
ShowFileRequestHandlerTest, NumericFieldsTest, FastVectorHighlighterTest, BadComponentTest,
TestTrimFilterFactory, TestIndexingPerformance, AnalysisAfterCoreReloadTest, SpatialFilterTest,
TestMergePolicyConfig, FullSolrCloudDistribCmdsTest, SuggesterWFSTTest, UpdateRequestProcessorFactoryTest,
TestSwedishLightStemFilterFactory, JSONWriterTest, TestPropInject, TestArabicFilters, TestHashPartitioner,
TestSurroundQueryParser, LegacyHTMLStripCharFilterTest, RequestHandlersTest, SolrIndexConfigTest,
RequiredFieldsTest, CoreAdminHandlerTest, TestPortugueseMinimalStemFilterFactory, TestTypeTokenFilterFactory,
TestUpdate, TestRandomFaceting, TestRTGBase, TestBadConfig, MinimalSchemaTest, DefaultValueUpdateProcessorTest,
TestGalicianStemFilterFactory, OverseerTest, RecoveryZkTest, SpellCheckComponentTest]
[junit4:junit4]   2> 
[junit4:junit4] Completed on J0 in 6.44s, 9 tests, 1 error <<< FAILURES!

[...truncated 441 lines...]
BUILD FAILED
/mnt/ssd/jenkins/workspace/Lucene-Solr-trunk-Linux-Java8-64/checkout/build.xml:29: The following
error occurred while executing this line:
/mnt/ssd/jenkins/workspace/Lucene-Solr-trunk-Linux-Java8-64/checkout/solr/build.xml:144: The
following error occurred while executing this line:
/mnt/ssd/jenkins/workspace/Lucene-Solr-trunk-Linux-Java8-64/checkout/lucene/module-build.xml:62:
The following error occurred while executing this line:
/mnt/ssd/jenkins/workspace/Lucene-Solr-trunk-Linux-Java8-64/checkout/lucene/common-build.xml:1093:
The following error occurred while executing this line:
/mnt/ssd/jenkins/workspace/Lucene-Solr-trunk-Linux-Java8-64/checkout/lucene/common-build.xml:788:
There were test failures: 294 suites, 1050 tests, 1 error, 5 ignored

Total time: 18 minutes 32 seconds
Build step 'Execute shell' marked build as failure
Archiving artifacts
Recording test results
Email was triggered for: Failure
Sending email for trigger: Failure




Mime
View raw message