lucene-dev mailing list archives

Site index · List index
Message view « Date » · « Thread »
Top « Date » · « Thread »
From Policeman Jenkins Server <jenk...@sd-datasolutions.de>
Subject [JENKINS] Lucene-Solr-trunk-Linux-Java8-64 - Build # 3 - Still Failing!
Date Sun, 01 Jul 2012 23:28:05 GMT
Build: http://jenkins.sd-datasolutions.de/job/Lucene-Solr-trunk-Linux-Java8-64/3/

2 tests failed.
REGRESSION:  org.apache.solr.handler.component.DistributedQueryElevationComponentTest.testDistribSearch

Error Message:
Index: 18, Size: 18

Stack Trace:
java.lang.IndexOutOfBoundsException: Index: 18, Size: 18
	at __randomizedtesting.SeedInfo.seed([D0EF2B85675FDCE:8CE87CA0212A9DF2]:0)
	at java.util.ArrayList.rangeCheck(ArrayList.java:603)
	at java.util.ArrayList.get(ArrayList.java:381)
	at org.apache.solr.common.util.NamedList.getName(NamedList.java:127)
	at org.apache.solr.BaseDistributedSearchTestCase.compare(BaseDistributedSearchTestCase.java:467)
	at org.apache.solr.BaseDistributedSearchTestCase.compare(BaseDistributedSearchTestCase.java:613)
	at org.apache.solr.BaseDistributedSearchTestCase.compare(BaseDistributedSearchTestCase.java:501)
	at org.apache.solr.BaseDistributedSearchTestCase.compare(BaseDistributedSearchTestCase.java:613)
	at org.apache.solr.BaseDistributedSearchTestCase.compare(BaseDistributedSearchTestCase.java:501)
	at org.apache.solr.BaseDistributedSearchTestCase.compareResponses(BaseDistributedSearchTestCase.java:668)
	at org.apache.solr.BaseDistributedSearchTestCase.query(BaseDistributedSearchTestCase.java:393)
	at org.apache.solr.handler.component.DistributedQueryElevationComponentTest.doTest(DistributedQueryElevationComponentTest.java:81)
	at org.apache.solr.BaseDistributedSearchTestCase.testDistribSearch(BaseDistributedSearchTestCase.java:680)
	at sun.reflect.NativeMethodAccessorImpl.invoke0(Native Method)
	at sun.reflect.NativeMethodAccessorImpl.invoke(NativeMethodAccessorImpl.java:57)
	at sun.reflect.DelegatingMethodAccessorImpl.invoke(DelegatingMethodAccessorImpl.java:43)
	at java.lang.reflect.Method.invoke(Method.java:474)
	at com.carrotsearch.randomizedtesting.RandomizedRunner.invoke(RandomizedRunner.java:1969)
	at com.carrotsearch.randomizedtesting.RandomizedRunner.access$1100(RandomizedRunner.java:132)
	at com.carrotsearch.randomizedtesting.RandomizedRunner$6.evaluate(RandomizedRunner.java:814)
	at com.carrotsearch.randomizedtesting.RandomizedRunner$7.evaluate(RandomizedRunner.java:875)
	at com.carrotsearch.randomizedtesting.RandomizedRunner$8.evaluate(RandomizedRunner.java:889)
	at com.carrotsearch.randomizedtesting.rules.SystemPropertiesRestoreRule$1.evaluate(SystemPropertiesRestoreRule.java:53)
	at org.apache.lucene.util.TestRuleSetupTeardownChained$1.evaluate(TestRuleSetupTeardownChained.java:50)
	at org.apache.lucene.util.TestRuleFieldCacheSanity$1.evaluate(TestRuleFieldCacheSanity.java:32)
	at org.apache.lucene.util.AbstractBeforeAfterRule$1.evaluate(AbstractBeforeAfterRule.java:45)
	at com.carrotsearch.randomizedtesting.rules.SystemPropertiesInvariantRule$1.evaluate(SystemPropertiesInvariantRule.java:55)
	at org.apache.lucene.util.TestRuleReportUncaughtExceptions$1.evaluate(TestRuleReportUncaughtExceptions.java:68)
	at org.apache.lucene.util.TestRuleThreadAndTestName$1.evaluate(TestRuleThreadAndTestName.java:48)
	at org.apache.lucene.util.TestRuleIgnoreAfterMaxFailures$1.evaluate(TestRuleIgnoreAfterMaxFailures.java:70)
	at org.apache.lucene.util.TestRuleMarkFailure$1.evaluate(TestRuleMarkFailure.java:48)
	at com.carrotsearch.randomizedtesting.RandomizedRunner.runSingleTest(RandomizedRunner.java:821)
	at com.carrotsearch.randomizedtesting.RandomizedRunner.access$700(RandomizedRunner.java:132)
	at com.carrotsearch.randomizedtesting.RandomizedRunner$3$1.run(RandomizedRunner.java:669)
	at com.carrotsearch.randomizedtesting.RandomizedRunner$3.evaluate(RandomizedRunner.java:695)
	at com.carrotsearch.randomizedtesting.RandomizedRunner$4.evaluate(RandomizedRunner.java:734)
	at com.carrotsearch.randomizedtesting.RandomizedRunner$5.evaluate(RandomizedRunner.java:745)
	at com.carrotsearch.randomizedtesting.rules.SystemPropertiesRestoreRule$1.evaluate(SystemPropertiesRestoreRule.java:53)
	at org.apache.lucene.util.AbstractBeforeAfterRule$1.evaluate(AbstractBeforeAfterRule.java:45)
	at org.apache.lucene.util.TestRuleReportUncaughtExceptions$1.evaluate(TestRuleReportUncaughtExceptions.java:68)
	at org.apache.lucene.util.TestRuleStoreClassName$1.evaluate(TestRuleStoreClassName.java:38)
	at org.apache.lucene.util.TestRuleIcuHack$1.evaluate(TestRuleIcuHack.java:51)
	at com.carrotsearch.randomizedtesting.rules.SystemPropertiesInvariantRule$1.evaluate(SystemPropertiesInvariantRule.java:55)
	at org.apache.lucene.util.TestRuleNoInstanceHooksOverrides$1.evaluate(TestRuleNoInstanceHooksOverrides.java:53)
	at org.apache.lucene.util.TestRuleNoStaticHooksShadowing$1.evaluate(TestRuleNoStaticHooksShadowing.java:52)
	at org.apache.lucene.util.TestRuleAssertionsRequired$1.evaluate(TestRuleAssertionsRequired.java:36)
	at org.apache.lucene.util.TestRuleMarkFailure$1.evaluate(TestRuleMarkFailure.java:48)
	at org.apache.lucene.util.TestRuleIgnoreAfterMaxFailures$1.evaluate(TestRuleIgnoreAfterMaxFailures.java:70)
	at org.apache.lucene.util.TestRuleIgnoreTestSuites$1.evaluate(TestRuleIgnoreTestSuites.java:55)
	at com.carrotsearch.randomizedtesting.RandomizedRunner.runSuite(RandomizedRunner.java:605)
	at com.carrotsearch.randomizedtesting.RandomizedRunner.access$400(RandomizedRunner.java:132)
	at com.carrotsearch.randomizedtesting.RandomizedRunner$2.run(RandomizedRunner.java:551)


REGRESSION:  org.apache.solr.handler.component.SpellCheckComponentTest.testPerDictionary

Error Message:
mismatch: '0'!='2' @ spellcheck/suggestions/bar/startOffset

Stack Trace:
java.lang.RuntimeException: mismatch: '0'!='2' @ spellcheck/suggestions/bar/startOffset
	at __randomizedtesting.SeedInfo.seed([D0EF2B85675FDCE:CA0006105E19E886]:0)
	at org.apache.solr.SolrTestCaseJ4.assertJQ(SolrTestCaseJ4.java:547)
	at org.apache.solr.SolrTestCaseJ4.assertJQ(SolrTestCaseJ4.java:495)
	at org.apache.solr.handler.component.SpellCheckComponentTest.testPerDictionary(SpellCheckComponentTest.java:102)
	at sun.reflect.NativeMethodAccessorImpl.invoke0(Native Method)
	at sun.reflect.NativeMethodAccessorImpl.invoke(NativeMethodAccessorImpl.java:57)
	at sun.reflect.DelegatingMethodAccessorImpl.invoke(DelegatingMethodAccessorImpl.java:43)
	at java.lang.reflect.Method.invoke(Method.java:474)
	at com.carrotsearch.randomizedtesting.RandomizedRunner.invoke(RandomizedRunner.java:1969)
	at com.carrotsearch.randomizedtesting.RandomizedRunner.access$1100(RandomizedRunner.java:132)
	at com.carrotsearch.randomizedtesting.RandomizedRunner$6.evaluate(RandomizedRunner.java:814)
	at com.carrotsearch.randomizedtesting.RandomizedRunner$7.evaluate(RandomizedRunner.java:875)
	at com.carrotsearch.randomizedtesting.RandomizedRunner$8.evaluate(RandomizedRunner.java:889)
	at com.carrotsearch.randomizedtesting.rules.SystemPropertiesRestoreRule$1.evaluate(SystemPropertiesRestoreRule.java:53)
	at org.apache.lucene.util.TestRuleSetupTeardownChained$1.evaluate(TestRuleSetupTeardownChained.java:50)
	at org.apache.lucene.util.TestRuleFieldCacheSanity$1.evaluate(TestRuleFieldCacheSanity.java:32)
	at org.apache.lucene.util.AbstractBeforeAfterRule$1.evaluate(AbstractBeforeAfterRule.java:45)
	at com.carrotsearch.randomizedtesting.rules.SystemPropertiesInvariantRule$1.evaluate(SystemPropertiesInvariantRule.java:55)
	at org.apache.lucene.util.TestRuleReportUncaughtExceptions$1.evaluate(TestRuleReportUncaughtExceptions.java:68)
	at org.apache.lucene.util.TestRuleThreadAndTestName$1.evaluate(TestRuleThreadAndTestName.java:48)
	at org.apache.lucene.util.TestRuleIgnoreAfterMaxFailures$1.evaluate(TestRuleIgnoreAfterMaxFailures.java:70)
	at org.apache.lucene.util.TestRuleMarkFailure$1.evaluate(TestRuleMarkFailure.java:48)
	at com.carrotsearch.randomizedtesting.RandomizedRunner.runSingleTest(RandomizedRunner.java:821)
	at com.carrotsearch.randomizedtesting.RandomizedRunner.access$700(RandomizedRunner.java:132)
	at com.carrotsearch.randomizedtesting.RandomizedRunner$3$1.run(RandomizedRunner.java:669)
	at com.carrotsearch.randomizedtesting.RandomizedRunner$3.evaluate(RandomizedRunner.java:695)
	at com.carrotsearch.randomizedtesting.RandomizedRunner$4.evaluate(RandomizedRunner.java:734)
	at com.carrotsearch.randomizedtesting.RandomizedRunner$5.evaluate(RandomizedRunner.java:745)
	at com.carrotsearch.randomizedtesting.rules.SystemPropertiesRestoreRule$1.evaluate(SystemPropertiesRestoreRule.java:53)
	at org.apache.lucene.util.AbstractBeforeAfterRule$1.evaluate(AbstractBeforeAfterRule.java:45)
	at org.apache.lucene.util.TestRuleReportUncaughtExceptions$1.evaluate(TestRuleReportUncaughtExceptions.java:68)
	at org.apache.lucene.util.TestRuleStoreClassName$1.evaluate(TestRuleStoreClassName.java:38)
	at org.apache.lucene.util.TestRuleIcuHack$1.evaluate(TestRuleIcuHack.java:51)
	at com.carrotsearch.randomizedtesting.rules.SystemPropertiesInvariantRule$1.evaluate(SystemPropertiesInvariantRule.java:55)
	at org.apache.lucene.util.TestRuleNoInstanceHooksOverrides$1.evaluate(TestRuleNoInstanceHooksOverrides.java:53)
	at org.apache.lucene.util.TestRuleNoStaticHooksShadowing$1.evaluate(TestRuleNoStaticHooksShadowing.java:52)
	at org.apache.lucene.util.TestRuleAssertionsRequired$1.evaluate(TestRuleAssertionsRequired.java:36)
	at org.apache.lucene.util.TestRuleMarkFailure$1.evaluate(TestRuleMarkFailure.java:48)
	at org.apache.lucene.util.TestRuleIgnoreAfterMaxFailures$1.evaluate(TestRuleIgnoreAfterMaxFailures.java:70)
	at org.apache.lucene.util.TestRuleIgnoreTestSuites$1.evaluate(TestRuleIgnoreTestSuites.java:55)
	at com.carrotsearch.randomizedtesting.RandomizedRunner.runSuite(RandomizedRunner.java:605)
	at com.carrotsearch.randomizedtesting.RandomizedRunner.access$400(RandomizedRunner.java:132)
	at com.carrotsearch.randomizedtesting.RandomizedRunner$2.run(RandomizedRunner.java:551)




Build Log:
[...truncated 7483 lines...]
   [junit4] Suite: org.apache.solr.handler.component.SpellCheckComponentTest
   [junit4]    > (@BeforeClass output)
   [junit4]   2> 0 T306 oas.SolrTestCaseJ4.initCore ####initCore
   [junit4]   2> Creating dataDir: /mnt/ssd/jenkins/workspace/Lucene-Solr-trunk-Linux-Java8-64/checkout/solr/build/solr-core/test/J1/./solrtest-SpellCheckComponentTest-1341184901900
   [junit4]   2> 0 T306 oasc.SolrResourceLoader.<init> new SolrResourceLoader for directory: '/mnt/ssd/jenkins/workspace/Lucene-Solr-trunk-Linux-Java8-64/checkout/solr/build/solr-core/test-files/solr/collection1/'
   [junit4]   2> 1 T306 oasc.SolrResourceLoader.replaceClassLoader Adding 'file:/mnt/ssd/jenkins/workspace/Lucene-Solr-trunk-Linux-Java8-64/checkout/solr/build/solr-core/test-files/solr/collection1/lib/classes/' to classloader
   [junit4]   2> 1 T306 oasc.SolrResourceLoader.replaceClassLoader Adding 'file:/mnt/ssd/jenkins/workspace/Lucene-Solr-trunk-Linux-Java8-64/checkout/solr/build/solr-core/test-files/solr/collection1/lib/README' to classloader
   [junit4]   2> 16 T306 oasc.SolrConfig.<init> Using Lucene MatchVersion: LUCENE_50
   [junit4]   2> 45 T306 oasc.SolrConfig.<init> Loaded SolrConfig: solrconfig-spellcheckcomponent.xml
   [junit4]   2> 45 T306 oass.IndexSchema.readSchema Reading Solr Schema
   [junit4]   2> 48 T306 oass.IndexSchema.readSchema Schema name=test
   [junit4]   2> 325 T306 oass.OpenExchangeRatesOrgProvider.init Initialized with rates=open-exchange-rates.json, refreshInterval=1440.
   [junit4]   2> 331 T306 oass.IndexSchema.readSchema default search field in schema is text
   [junit4]   2> 333 T306 oass.IndexSchema.readSchema unique key field: id
   [junit4]   2> 344 T306 oass.FileExchangeRateProvider.reload Reloading exchange rates from file currency.xml
   [junit4]   2> 349 T306 oass.FileExchangeRateProvider.reload Reloading exchange rates from file currency.xml
   [junit4]   2> 351 T306 oass.OpenExchangeRatesOrgProvider.reload Reloading exchange rates from open-exchange-rates.json
   [junit4]   2> 352 T306 oass.OpenExchangeRatesOrgProvider.reload Reloading exchange rates from open-exchange-rates.json
   [junit4]   2> 352 T306 oasc.SolrResourceLoader.locateSolrHome JNDI not configured for solr (NoInitialContextEx)
   [junit4]   2> 353 T306 oasc.SolrResourceLoader.locateSolrHome using system property solr.solr.home: /mnt/ssd/jenkins/workspace/Lucene-Solr-trunk-Linux-Java8-64/checkout/solr/build/solr-core/test-files/solr
   [junit4]   2> 353 T306 oasc.SolrResourceLoader.<init> new SolrResourceLoader for directory: '/mnt/ssd/jenkins/workspace/Lucene-Solr-trunk-Linux-Java8-64/checkout/solr/build/solr-core/test-files/solr/'
   [junit4]   2> 353 T306 oasc.CoreContainer.<init> New CoreContainer 495678686
   [junit4]   2> 353 T306 oasc.SolrCore.<init> [collection1] Opening new SolrCore at /mnt/ssd/jenkins/workspace/Lucene-Solr-trunk-Linux-Java8-64/checkout/solr/build/solr-core/test-files/solr/collection1/, dataDir=/mnt/ssd/jenkins/workspace/Lucene-Solr-trunk-Linux-Java8-64/checkout/solr/build/solr-core/test/J1/./solrtest-SpellCheckComponentTest-1341184901900/
   [junit4]   2> 353 T306 oasc.SolrCore.<init> JMX monitoring not detected for core: collection1
   [junit4]   2> 354 T306 oasc.SolrCore.getNewIndexDir WARNING New index directory detected: old=null new=/mnt/ssd/jenkins/workspace/Lucene-Solr-trunk-Linux-Java8-64/checkout/solr/build/solr-core/test/J1/./solrtest-SpellCheckComponentTest-1341184901900/index/
   [junit4]   2> 354 T306 oasc.SolrCore.initIndex WARNING [collection1] Solr index directory '/mnt/ssd/jenkins/workspace/Lucene-Solr-trunk-Linux-Java8-64/checkout/solr/build/solr-core/test/J1/./solrtest-SpellCheckComponentTest-1341184901900/index' doesn't exist. Creating new index...
   [junit4]   2> 357 T306 oasc.SolrDeletionPolicy.onCommit SolrDeletionPolicy.onCommit: commits:num=1
   [junit4]   2> 		commit{dir=MockDirWrapper(org.apache.lucene.store.RAMDirectory@2ea5a9f9 lockFactory=org.apache.lucene.store.NativeFSLockFactory@1ec0351b),segFN=segments_1,generation=1,filenames=[segments_1]
   [junit4]   2> 357 T306 oasc.SolrDeletionPolicy.updateCommits newest commit = 1
   [junit4]   2> 358 T306 oasc.RequestHandlers.initHandlersFromConfig created standard: solr.StandardRequestHandler
   [junit4]   2> 358 T306 oasc.RequestHandlers.initHandlersFromConfig created spellCheckCompRH: org.apache.solr.handler.component.SearchHandler
   [junit4]   2> 358 T306 oasc.RequestHandlers.initHandlersFromConfig created spellCheckCompRH1: org.apache.solr.handler.component.SearchHandler
   [junit4]   2> 358 T306 oasc.RequestHandlers.initHandlersFromConfig created spellCheckWithWordbreak: org.apache.solr.handler.component.SearchHandler
   [junit4]   2> 361 T306 oass.SolrIndexSearcher.<init> Opening Searcher@353e5206 main
   [junit4]   2> 361 T306 oass.SolrIndexSearcher.<init> WARNING WARNING: Directory impl does not support setting indexDir: org.apache.lucene.store.MockDirectoryWrapper
   [junit4]   2> 362 T306 oasu.CommitTracker.<init> Hard AutoCommit: disabled
   [junit4]   2> 362 T306 oasu.CommitTracker.<init> Soft AutoCommit: disabled
   [junit4]   2> 362 T306 oashc.SpellCheckComponent.inform Initializing spell checkers
   [junit4]   2> 368 T306 oashc.SpellCheckComponent.inform Registering newSearcher listener for spellchecker: default
   [junit4]   2> 395 T306 oashc.SpellCheckComponent.inform Registering newSearcher listener for spellchecker: default_teststop
   [junit4]   2> 399 T306 oass.DirectSolrSpellChecker.init init: {name=direct,classname=solr.DirectSolrSpellChecker,minQueryLength=3,maxQueryFrequency=100.0,field=teststop}
   [junit4]   2> 399 T306 oass.DirectSolrSpellChecker.init init: {name=direct_lowerfilt,classname=solr.DirectSolrSpellChecker,minQueryLength=3,maxQueryFrequency=100.0,field=lowerfilt}
   [junit4]   2> 407 T306 oashc.SpellCheckComponent.inform Registering newSearcher listener for spellchecker: threshold
   [junit4]   2> 407 T306 oass.DirectSolrSpellChecker.init init: {name=threshold_direct,classname=solr.DirectSolrSpellChecker,field=lowerfilt,spellcheckIndexDir=spellcheckerThreshold,buildOnCommit=true,thresholdTokenFrequency=0.29}
   [junit4]   2> 407 T306 oashc.SpellCheckComponent.inform Registering newSearcher listener for spellchecker: threshold_direct
   [junit4]   2> 413 T306 oashc.SpellCheckComponent.inform Registering newSearcher listener for spellchecker: multipleFields
   [junit4]   2> 429 T306 oashc.SpellCheckComponent.inform Registering newSearcher listener for spellchecker: freq
   [junit4]   2> 435 T306 oashc.SpellCheckComponent.inform Registering newSearcher listener for spellchecker: fqcn
   [junit4]   2> 436 T306 oashc.HttpShardHandlerFactory.getParameter Setting socketTimeout to: 0
   [junit4]   2> 436 T306 oashc.HttpShardHandlerFactory.getParameter Setting urlScheme to: http://
   [junit4]   2> 436 T306 oashc.HttpShardHandlerFactory.getParameter Setting connTimeout to: 0
   [junit4]   2> 436 T306 oashc.HttpShardHandlerFactory.getParameter Setting maxConnectionsPerHost to: 20
   [junit4]   2> 436 T306 oashc.HttpShardHandlerFactory.getParameter Setting corePoolSize to: 0
   [junit4]   2> 437 T306 oashc.HttpShardHandlerFactory.getParameter Setting maximumPoolSize to: 2147483647
   [junit4]   2> 437 T306 oashc.HttpShardHandlerFactory.getParameter Setting maxThreadIdleTime to: 5
   [junit4]   2> 437 T306 oashc.HttpShardHandlerFactory.getParameter Setting sizeOfQueue to: -1
   [junit4]   2> 437 T306 oashc.HttpShardHandlerFactory.getParameter Setting fairnessPolicy to: false
   [junit4]   2> 437 T306 oascsi.HttpClientUtil.createClient Creating new http client, config:maxConnectionsPerHost=20&maxConnections=10000&socketTimeout=0&connTimeout=0&retry=false
   [junit4]   2> 441 T307 oasc.SolrCore.registerSearcher [collection1] Registered new searcher Searcher@353e5206 main{StandardDirectoryReader(segments_1:1)}
   [junit4]   2> 441 T306 oasc.CoreContainer.register registering core: collection1
   [junit4]   2> 441 T306 oas.SolrTestCaseJ4.initCore ####initCore end
   [junit4]   2> 
   [junit4] ERROR   0.30s J1 | SpellCheckComponentTest.testPerDictionary
   [junit4]    > Throwable #1: java.lang.RuntimeException: mismatch: '0'!='2' @ spellcheck/suggestions/bar/startOffset
   [junit4]    > 	at __randomizedtesting.SeedInfo.seed([D0EF2B85675FDCE:CA0006105E19E886]:0)
   [junit4]    > 	at org.apache.solr.SolrTestCaseJ4.assertJQ(SolrTestCaseJ4.java:547)
   [junit4]    > 	at org.apache.solr.SolrTestCaseJ4.assertJQ(SolrTestCaseJ4.java:495)
   [junit4]    > 	at org.apache.solr.handler.component.SpellCheckComponentTest.testPerDictionary(SpellCheckComponentTest.java:102)
   [junit4]    > 	at sun.reflect.NativeMethodAccessorImpl.invoke0(Native Method)
   [junit4]    > 	at sun.reflect.NativeMethodAccessorImpl.invoke(NativeMethodAccessorImpl.java:57)
   [junit4]    > 	at sun.reflect.DelegatingMethodAccessorImpl.invoke(DelegatingMethodAccessorImpl.java:43)
   [junit4]    > 	at java.lang.reflect.Method.invoke(Method.java:474)
   [junit4]    > 	at com.carrotsearch.randomizedtesting.RandomizedRunner.invoke(RandomizedRunner.java:1969)
   [junit4]    > 	at com.carrotsearch.randomizedtesting.RandomizedRunner.access$1100(RandomizedRunner.java:132)
   [junit4]    > 	at com.carrotsearch.randomizedtesting.RandomizedRunner$6.evaluate(RandomizedRunner.java:814)
   [junit4]    > 	at com.carrotsearch.randomizedtesting.RandomizedRunner$7.evaluate(RandomizedRunner.java:875)
   [junit4]    > 	at com.carrotsearch.randomizedtesting.RandomizedRunner$8.evaluate(RandomizedRunner.java:889)
   [junit4]    > 	at com.carrotsearch.randomizedtesting.rules.SystemPropertiesRestoreRule$1.evaluate(SystemPropertiesRestoreRule.java:53)
   [junit4]    > 	at org.apache.lucene.util.TestRuleSetupTeardownChained$1.evaluate(TestRuleSetupTeardownChained.java:50)
   [junit4]    > 	at org.apache.lucene.util.TestRuleFieldCacheSanity$1.evaluate(TestRuleFieldCacheSanity.java:32)
   [junit4]    > 	at org.apache.lucene.util.AbstractBeforeAfterRule$1.evaluate(AbstractBeforeAfterRule.java:45)
   [junit4]    > 	at com.carrotsearch.randomizedtesting.rules.SystemPropertiesInvariantRule$1.evaluate(SystemPropertiesInvariantRule.java:55)
   [junit4]    > 	at org.apache.lucene.util.TestRuleReportUncaughtExceptions$1.evaluate(TestRuleReportUncaughtExceptions.java:68)
   [junit4]    > 	at org.apache.lucene.util.TestRuleThreadAndTestName$1.evaluate(TestRuleThreadAndTestName.java:48)
   [junit4]    > 	at org.apache.lucene.util.TestRuleIgnoreAfterMaxFailures$1.evaluate(TestRuleIgnoreAfterMaxFailures.java:70)
   [junit4]    > 	at org.apache.lucene.util.TestRuleMarkFailure$1.evaluate(TestRuleMarkFailure.java:48)
   [junit4]    > 	at com.carrotsearch.randomizedtesting.RandomizedRunner.runSingleTest(RandomizedRunner.java:821)
   [junit4]    > 	at com.carrotsearch.randomizedtesting.RandomizedRunner.access$700(RandomizedRunner.java:132)
   [junit4]    > 	at com.carrotsearch.randomizedtesting.RandomizedRunner$3$1.run(RandomizedRunner.java:669)
   [junit4]    > 	at com.carrotsearch.randomizedtesting.RandomizedRunner$3.evaluate(RandomizedRunner.java:695)
   [junit4]    > 	at com.carrotsearch.randomizedtesting.RandomizedRunner$4.evaluate(RandomizedRunner.java:734)
   [junit4]    > 	at com.carrotsearch.randomizedtesting.RandomizedRunner$5.evaluate(RandomizedRunner.java:745)
   [junit4]    > 	at com.carrotsearch.randomizedtesting.rules.SystemPropertiesRestoreRule$1.evaluate(SystemPropertiesRestoreRule.java:53)
   [junit4]    > 	at org.apache.lucene.util.AbstractBeforeAfterRule$1.evaluate(AbstractBeforeAfterRule.java:45)
   [junit4]    > 	at org.apache.lucene.util.TestRuleReportUncaughtExceptions$1.evaluate(TestRuleReportUncaughtExceptions.java:68)
   [junit4]    > 	at org.apache.lucene.util.TestRuleStoreClassName$1.evaluate(TestRuleStoreClassName.java:38)
   [junit4]    > 	at org.apache.lucene.util.TestRuleIcuHack$1.evaluate(TestRuleIcuHack.java:51)
   [junit4]    > 	at com.carrotsearch.randomizedtesting.rules.SystemPropertiesInvariantRule$1.evaluate(SystemPropertiesInvariantRule.java:55)
   [junit4]    > 	at org.apache.lucene.util.TestRuleNoInstanceHooksOverrides$1.evaluate(TestRuleNoInstanceHooksOverrides.java:53)
   [junit4]    > 	at org.apache.lucene.util.TestRuleNoStaticHooksShadowing$1.evaluate(TestRuleNoStaticHooksShadowing.java:52)
   [junit4]    > 	at org.apache.lucene.util.TestRuleAssertionsRequired$1.evaluate(TestRuleAssertionsRequired.java:36)
   [junit4]    > 	at org.apache.lucene.util.TestRuleMarkFailure$1.evaluate(TestRuleMarkFailure.java:48)
   [junit4]    > 	at org.apache.lucene.util.TestRuleIgnoreAfterMaxFailures$1.evaluate(TestRuleIgnoreAfterMaxFailures.java:70)
   [junit4]    > 	at org.apache.lucene.util.TestRuleIgnoreTestSuites$1.evaluate(TestRuleIgnoreTestSuites.java:55)
   [junit4]    > 	at com.carrotsearch.randomizedtesting.RandomizedRunner.runSuite(RandomizedRunner.java:605)
   [junit4]    > 	at com.carrotsearch.randomizedtesting.RandomizedRunner.access$400(RandomizedRunner.java:132)
   [junit4]    > 	at com.carrotsearch.randomizedtesting.RandomizedRunner$2.run(RandomizedRunner.java:551)
   [junit4]    > 
   [junit4]   2> 817 T306 oas.SolrTestCaseJ4.setUp ###Starting testPerDictionary
   [junit4]   2> 821 T306 C5 UPDATE [collection1] webapp=null path=null params={} {add=[0]} 0 1
   [junit4]   2> 825 T306 C5 UPDATE [collection1] webapp=null path=null params={} {add=[1]} 0 0
   [junit4]   2> 830 T306 C5 UPDATE [collection1] webapp=null path=null params={} {add=[2]} 0 0
   [junit4]   2> 835 T306 C5 UPDATE [collection1] webapp=null path=null params={} {add=[3]} 0 1
   [junit4]   2> 840 T306 C5 UPDATE [collection1] webapp=null path=null params={} {add=[4]} 0 1
   [junit4]   2> 845 T306 C5 UPDATE [collection1] webapp=null path=null params={} {add=[5]} 0 1
   [junit4]   2> 849 T306 C5 UPDATE [collection1] webapp=null path=null params={} {add=[6]} 0 0
   [junit4]   2> 854 T306 C5 UPDATE [collection1] webapp=null path=null params={} {add=[7]} 0 0
   [junit4]   2> 859 T306 C5 UPDATE [collection1] webapp=null path=null params={} {add=[8]} 0 1
   [junit4]   2> 864 T306 C5 UPDATE [collection1] webapp=null path=null params={} {add=[9]} 0 1
   [junit4]   2> 868 T306 C5 oasu.DirectUpdateHandler2.commit start commit{flags=0,version=0,optimize=false,openSearcher=true,waitSearcher=true,expungeDeletes=false,softCommit=false}
   [junit4]   2> 870 T306 C5 oasc.SolrDeletionPolicy.onCommit SolrDeletionPolicy.onCommit: commits:num=2
   [junit4]   2> 		commit{dir=MockDirWrapper(org.apache.lucene.store.RAMDirectory@2ea5a9f9 lockFactory=org.apache.lucene.store.NativeFSLockFactory@1ec0351b),segFN=segments_3,generation=3,filenames=[segments_3]
   [junit4]   2> 		commit{dir=MockDirWrapper(org.apache.lucene.store.RAMDirectory@2ea5a9f9 lockFactory=org.apache.lucene.store.NativeFSLockFactory@1ec0351b),segFN=segments_4,generation=4,filenames=[_1.fnm, segments_4, _1.fdx, _1_Lucene40_0.tip, _1.si, _1_Lucene40_0.prx, _1.fdt, _1_Lucene40_0.frq, _1_Lucene40_0.tim, _1_nrm.cfe, _1_nrm.cfs]
   [junit4]   2> 870 T306 C5 oasc.SolrDeletionPolicy.updateCommits newest commit = 4
   [junit4]   2> 872 T306 C5 oass.SolrIndexSearcher.<init> Opening Searcher@757e916c main
   [junit4]   2> 872 T306 C5 oass.SolrIndexSearcher.<init> WARNING WARNING: Directory impl does not support setting indexDir: org.apache.lucene.store.MockDirectoryWrapper
   [junit4]   2> 872 T307 oashc.SpellCheckComponent$SpellCheckerListener.buildSpellIndex Building spell index for spell checker: default
   [junit4]   2> 872 T306 C5 oasu.DirectUpdateHandler2.commit end_commit_flush
   [junit4]   2> 907 T307 oashc.SpellCheckComponent$SpellCheckerListener.buildSpellIndex Building spell index for spell checker: default_teststop
   [junit4]   2> 913 T307 oashc.SpellCheckComponent$SpellCheckerListener.buildSpellIndex Building spell index for spell checker: threshold
   [junit4]   2> 944 T307 oashc.SpellCheckComponent$SpellCheckerListener.buildSpellIndex Building spell index for spell checker: threshold_direct
   [junit4]   2> 944 T307 oashc.SpellCheckComponent$SpellCheckerListener.buildSpellIndex Building spell index for spell checker: multipleFields
   [junit4]   2> 972 T307 oashc.SpellCheckComponent$SpellCheckerListener.buildSpellIndex Building spell index for spell checker: freq
   [junit4]   2> 1000 T307 oashc.SpellCheckComponent$SpellCheckerListener.buildSpellIndex Building spell index for spell checker: fqcn
   [junit4]   2> 1029 T307 oasc.SolrCore.registerSearcher [collection1] Registered new searcher Searcher@757e916c main{StandardDirectoryReader(segments_4:6 _1(5.0):C10)}
   [junit4]   2> 1030 T306 C5 UPDATE [collection1] webapp=null path=null params={} {commit=} 0 162
   [junit4]   2> 1032 T306 C5 REQ [collection1] webapp=null path=null params={qt=spellCheckCompRH&spellcheck..perDict.foo=bar&q=documemt&spellcheck..perDict.bar=foo&spellcheck.dictionary=perDict&json.nl=map&spellcheck.build=true&spellcheck=true} hits=0 status=0 QTime=1 
   [junit4]   2> 1033 T306 oas.SolrTestCaseJ4.assertJQ SEVERE query failed JSON validation. error=mismatch: '0'!='2' @ spellcheck/suggestions/bar/startOffset
   [junit4]   2> 	 expected =/spellcheck/suggestions/bar=={"numFound":1, "startOffset":0, "endOffset":1, "suggestion":["foo"]}
   [junit4]   2> 	 response = {
   [junit4]   2> 	  "responseHeader":{
   [junit4]   2> 	    "status":0,
   [junit4]   2> 	    "QTime":1},
   [junit4]   2> 	  "command":"build",
   [junit4]   2> 	  "response":{"numFound":0,"start":0,"docs":[]
   [junit4]   2> 	  },
   [junit4]   2> 	  "spellcheck":{
   [junit4]   2> 	    "suggestions":{
   [junit4]   2> 	      "foo":{
   [junit4]   2> 	        "numFound":1,
   [junit4]   2> 	        "startOffset":0,
   [junit4]   2> 	        "endOffset":1,
   [junit4]   2> 	        "suggestion":["bar"]},
   [junit4]   2> 	      "bar":{
   [junit4]   2> 	        "numFound":1,
   [junit4]   2> 	        "startOffset":2,
   [junit4]   2> 	        "endOffset":3,
   [junit4]   2> 	        "suggestion":["foo"]}}}}
   [junit4]   2> 	
   [junit4]   2> 	 request = qt=spellCheckCompRH&spellcheck..perDict.foo=bar&q=documemt&spellcheck..perDict.bar=foo&spellcheck.dictionary=perDict&json.nl=map&spellcheck.build=true&spellcheck=true
   [junit4]   2> 1033 T306 oas.SolrTestCaseJ4.tearDown ###Ending testPerDictionary
   [junit4]   2> 1036 T306 C5 oasu.DirectUpdateHandler2.deleteAll [collection1] REMOVING ALL DOCUMENTS FROM INDEX
   [junit4]   2> 1037 T306 C5 UPDATE [collection1] webapp=null path=null params={} {deleteByQuery=*:*} 0 1
   [junit4]   2> 1041 T306 C5 oasu.DirectUpdateHandler2.commit start commit{flags=0,version=0,optimize=false,openSearcher=true,waitSearcher=true,expungeDeletes=false,softCommit=false}
   [junit4]   2> 1041 T306 C5 oasc.SolrDeletionPolicy.onCommit SolrDeletionPolicy.onCommit: commits:num=2
   [junit4]   2> 		commit{dir=MockDirWrapper(org.apache.lucene.store.RAMDirectory@2ea5a9f9 lockFactory=org.apache.lucene.store.NativeFSLockFactory@1ec0351b),segFN=segments_4,generation=4,filenames=[_1.fnm, segments_4, _1.fdx, _1_Lucene40_0.tip, _1.si, _1_Lucene40_0.prx, _1.fdt, _1_Lucene40_0.frq, _1_Lucene40_0.tim, _1_nrm.cfe, _1_nrm.cfs]
   [junit4]   2> 		commit{dir=MockDirWrapper(org.apache.lucene.store.RAMDirectory@2ea5a9f9 lockFactory=org.apache.lucene.store.NativeFSLockFactory@1ec0351b),segFN=segments_5,generation=5,filenames=[segments_5]
   [junit4]   2> 1042 T306 C5 oasc.SolrDeletionPolicy.updateCommits newest commit = 5
   [junit4]   2> 1042 T306 C5 oass.SolrIndexSearcher.<init> Opening Searcher@21c96b27 main
   [junit4]   2> 1042 T306 C5 oass.SolrIndexSearcher.<init> WARNING WARNING: Directory impl does not support setting indexDir: org.apache.lucene.store.MockDirectoryWrapper
   [junit4]   2> 1043 T307 oashc.SpellCheckComponent$SpellCheckerListener.buildSpellIndex Building spell index for spell checker: default
   [junit4]   2> 1043 T306 C5 oasu.DirectUpdateHandler2.commit end_commit_flush
   [junit4]   2> 1051 T307 oashc.SpellCheckComponent$SpellCheckerListener.buildSpellIndex Building spell index for spell checker: default_teststop
   [junit4]   2> 1058 T307 oashc.SpellCheckComponent$SpellCheckerListener.buildSpellIndex Building spell index for spell checker: threshold
   [junit4]   2> 1066 T307 oashc.SpellCheckComponent$SpellCheckerListener.buildSpellIndex Building spell index for spell checker: threshold_direct
   [junit4]   2> 1066 T307 oashc.SpellCheckComponent$SpellCheckerListener.buildSpellIndex Building spell index for spell checker: multipleFields
   [junit4]   2> 1074 T307 oashc.SpellCheckComponent$SpellCheckerListener.buildSpellIndex Building spell index for spell checker: freq
   [junit4]   2> 1080 T307 oashc.SpellCheckComponent$SpellCheckerListener.buildSpellIndex Building spell index for spell checker: fqcn
   [junit4]   2> 1086 T307 oasc.SolrCore.registerSearcher [collection1] Registered new searcher Searcher@21c96b27 main{StandardDirectoryReader(segments_5:7)}
   [junit4]   2> 1086 T306 C5 UPDATE [collection1] webapp=null path=null params={} {commit=} 0 46
   [junit4]   2> NOTE: reproduce with: ant test  -Dtestcase=SpellCheckComponentTest -Dtests.method=testPerDictionary -Dtests.seed=D0EF2B85675FDCE -Dtests.multiplier=3 -Dtests.slow=true -Dtests.locale=ar_YE -Dtests.timezone=Africa/Lagos -Dargs="-Dfile.encoding=UTF-8"
   [junit4]   2>
   [junit4]    > (@AfterClass output)
   [junit4]   2> 3550 T306 oas.SolrTestCaseJ4.deleteCore ###deleteCore
   [junit4]   2> 3550 T306 oasc.CoreContainer.shutdown Shutting down CoreContainer instance=495678686
   [junit4]   2> 3550 T306 oasc.SolrCore.close [collection1]  CLOSING SolrCore org.apache.solr.core.SolrCore@26375c6
   [junit4]   2> 3550 T306 oasc.SolrCore.closeSearcher [collection1] Closing main searcher on request.
   [junit4]   2> 3551 T306 oasu.DirectUpdateHandler2.close closing DirectUpdateHandler2{commits=20,autocommits=0,soft autocommits=0,optimizes=0,rollbacks=0,expungeDeletes=0,docsPending=0,adds=0,deletesById=0,deletesByQuery=0,errors=0,cumulative_adds=92,cumulative_deletesById=0,cumulative_deletesByQuery=9,cumulative_errors=0}
   [junit4]   2> NOTE: test params are: codec=Lucene40: {start3=PostingsFormat(name=Lucene40WithOrds), gram1=MockFixedIntBlock(blockSize=1578), start2=PostingsFormat(name=NestedPulsing), gram2=PostingsFormat(name=Lucene40WithOrds), end4=Pulsing40(freqCutoff=7 minBlockSize=10 maxBlockSize=59), end3=PostingsFormat(name=NestedPulsing), start1=Pulsing40(freqCutoff=7 minBlockSize=10 maxBlockSize=59), gram3=PostingsFormat(name=NestedPulsing), start4=MockFixedIntBlock(blockSize=1578), word=MockFixedIntBlock(blockSize=1578), gram4=Pulsing40(freqCutoff=7 minBlockSize=10 maxBlockSize=59), end2=PostingsFormat(name=Lucene40WithOrds), end1=MockFixedIntBlock(blockSize=1578)}, sim=DefaultSimilarity, locale=ar_YE, timezone=Africa/Lagos
   [junit4]   2> NOTE: Linux 2.6.32-41-server amd64/Oracle Corporation 1.8.0-ea (64-bit)/cpus=8,threads=1,free=75333224,total=190971904
   [junit4]   2> NOTE: All tests run in this JVM: [BadIndexSchemaTest, DistanceFunctionTest, PolyFieldTest, SpellingQueryConverterTest, TestGroupingSearch, NotRequiredUniqueKeyTest, TestSystemIdResolver, RAMDirectoryFactoryTest, TestReverseStringFilterFactory, ZkControllerTest, PrimUtilsTest, TermVectorComponentTest, TestDefaultSimilarityFactory, TestRangeQuery, SpellCheckComponentTest]
   [junit4]   2> 
   [junit4] Completed on J1 in 3.57s, 9 tests, 1 error <<< FAILURES!

[...truncated 331 lines...]
   [junit4] Suite: org.apache.solr.handler.component.DistributedQueryElevationComponentTest
   [junit4] ERROR   1.16s J0 | DistributedQueryElevationComponentTest.testDistribSearch
   [junit4]    > Throwable #1: java.lang.IndexOutOfBoundsException: Index: 18, Size: 18
   [junit4]    > 	at __randomizedtesting.SeedInfo.seed([D0EF2B85675FDCE:8CE87CA0212A9DF2]:0)
   [junit4]    > 	at java.util.ArrayList.rangeCheck(ArrayList.java:603)
   [junit4]    > 	at java.util.ArrayList.get(ArrayList.java:381)
   [junit4]    > 	at org.apache.solr.common.util.NamedList.getName(NamedList.java:127)
   [junit4]    > 	at org.apache.solr.BaseDistributedSearchTestCase.compare(BaseDistributedSearchTestCase.java:467)
   [junit4]    > 	at org.apache.solr.BaseDistributedSearchTestCase.compare(BaseDistributedSearchTestCase.java:613)
   [junit4]    > 	at org.apache.solr.BaseDistributedSearchTestCase.compare(BaseDistributedSearchTestCase.java:501)
   [junit4]    > 	at org.apache.solr.BaseDistributedSearchTestCase.compare(BaseDistributedSearchTestCase.java:613)
   [junit4]    > 	at org.apache.solr.BaseDistributedSearchTestCase.compare(BaseDistributedSearchTestCase.java:501)
   [junit4]    > 	at org.apache.solr.BaseDistributedSearchTestCase.compareResponses(BaseDistributedSearchTestCase.java:668)
   [junit4]    > 	at org.apache.solr.BaseDistributedSearchTestCase.query(BaseDistributedSearchTestCase.java:393)
   [junit4]    > 	at org.apache.solr.handler.component.DistributedQueryElevationComponentTest.doTest(DistributedQueryElevationComponentTest.java:81)
   [junit4]    > 	at org.apache.solr.BaseDistributedSearchTestCase.testDistribSearch(BaseDistributedSearchTestCase.java:680)
   [junit4]    > 	at sun.reflect.NativeMethodAccessorImpl.invoke0(Native Method)
   [junit4]    > 	at sun.reflect.NativeMethodAccessorImpl.invoke(NativeMethodAccessorImpl.java:57)
   [junit4]    > 	at sun.reflect.DelegatingMethodAccessorImpl.invoke(DelegatingMethodAccessorImpl.java:43)
   [junit4]    > 	at java.lang.reflect.Method.invoke(Method.java:474)
   [junit4]    > 	at com.carrotsearch.randomizedtesting.RandomizedRunner.invoke(RandomizedRunner.java:1969)
   [junit4]    > 	at com.carrotsearch.randomizedtesting.RandomizedRunner.access$1100(RandomizedRunner.java:132)
   [junit4]    > 	at com.carrotsearch.randomizedtesting.RandomizedRunner$6.evaluate(RandomizedRunner.java:814)
   [junit4]    > 	at com.carrotsearch.randomizedtesting.RandomizedRunner$7.evaluate(RandomizedRunner.java:875)
   [junit4]    > 	at com.carrotsearch.randomizedtesting.RandomizedRunner$8.evaluate(RandomizedRunner.java:889)
   [junit4]    > 	at com.carrotsearch.randomizedtesting.rules.SystemPropertiesRestoreRule$1.evaluate(SystemPropertiesRestoreRule.java:53)
   [junit4]    > 	at org.apache.lucene.util.TestRuleSetupTeardownChained$1.evaluate(TestRuleSetupTeardownChained.java:50)
   [junit4]    > 	at org.apache.lucene.util.TestRuleFieldCacheSanity$1.evaluate(TestRuleFieldCacheSanity.java:32)
   [junit4]    > 	at org.apache.lucene.util.AbstractBeforeAfterRule$1.evaluate(AbstractBeforeAfterRule.java:45)
   [junit4]    > 	at com.carrotsearch.randomizedtesting.rules.SystemPropertiesInvariantRule$1.evaluate(SystemPropertiesInvariantRule.java:55)
   [junit4]    > 	at org.apache.lucene.util.TestRuleReportUncaughtExceptions$1.evaluate(TestRuleReportUncaughtExceptions.java:68)
   [junit4]    > 	at org.apache.lucene.util.TestRuleThreadAndTestName$1.evaluate(TestRuleThreadAndTestName.java:48)
   [junit4]    > 	at org.apache.lucene.util.TestRuleIgnoreAfterMaxFailures$1.evaluate(TestRuleIgnoreAfterMaxFailures.java:70)
   [junit4]    > 	at org.apache.lucene.util.TestRuleMarkFailure$1.evaluate(TestRuleMarkFailure.java:48)
   [junit4]    > 	at com.carrotsearch.randomizedtesting.RandomizedRunner.runSingleTest(RandomizedRunner.java:821)
   [junit4]    > 	at com.carrotsearch.randomizedtesting.RandomizedRunner.access$700(RandomizedRunner.java:132)
   [junit4]    > 	at com.carrotsearch.randomizedtesting.RandomizedRunner$3$1.run(RandomizedRunner.java:669)
   [junit4]    > 	at com.carrotsearch.randomizedtesting.RandomizedRunner$3.evaluate(RandomizedRunner.java:695)
   [junit4]    > 	at com.carrotsearch.randomizedtesting.RandomizedRunner$4.evaluate(RandomizedRunner.java:734)
   [junit4]    > 	at com.carrotsearch.randomizedtesting.RandomizedRunner$5.evaluate(RandomizedRunner.java:745)
   [junit4]    > 	at com.carrotsearch.randomizedtesting.rules.SystemPropertiesRestoreRule$1.evaluate(SystemPropertiesRestoreRule.java:53)
   [junit4]    > 	at org.apache.lucene.util.AbstractBeforeAfterRule$1.evaluate(AbstractBeforeAfterRule.java:45)
   [junit4]    > 	at org.apache.lucene.util.TestRuleReportUncaughtExceptions$1.evaluate(TestRuleReportUncaughtExceptions.java:68)
   [junit4]    > 	at org.apache.lucene.util.TestRuleStoreClassName$1.evaluate(TestRuleStoreClassName.java:38)
   [junit4]    > 	at org.apache.lucene.util.TestRuleIcuHack$1.evaluate(TestRuleIcuHack.java:51)
   [junit4]    > 	at com.carrotsearch.randomizedtesting.rules.SystemPropertiesInvariantRule$1.evaluate(SystemPropertiesInvariantRule.java:55)
   [junit4]    > 	at org.apache.lucene.util.TestRuleNoInstanceHooksOverrides$1.evaluate(TestRuleNoInstanceHooksOverrides.java:53)
   [junit4]    > 	at org.apache.lucene.util.TestRuleNoStaticHooksShadowing$1.evaluate(TestRuleNoStaticHooksShadowing.java:52)
   [junit4]    > 	at org.apache.lucene.util.TestRuleAssertionsRequired$1.evaluate(TestRuleAssertionsRequired.java:36)
   [junit4]    > 	at org.apache.lucene.util.TestRuleMarkFailure$1.evaluate(TestRuleMarkFailure.java:48)
   [junit4]    > 	at org.apache.lucene.util.TestRuleIgnoreAfterMaxFailures$1.evaluate(TestRuleIgnoreAfterMaxFailures.java:70)
   [junit4]    > 	at org.apache.lucene.util.TestRuleIgnoreTestSuites$1.evaluate(TestRuleIgnoreTestSuites.java:55)
   [junit4]    > 	at com.carrotsearch.randomizedtesting.RandomizedRunner.runSuite(RandomizedRunner.java:605)
   [junit4]    > 	at com.carrotsearch.randomizedtesting.RandomizedRunner.access$400(RandomizedRunner.java:132)
   [junit4]    > 	at com.carrotsearch.randomizedtesting.RandomizedRunner$2.run(RandomizedRunner.java:551)
   [junit4]    > 
   [junit4]   2> 1 T591 oas.SolrTestCaseJ4.setUp ###Starting testDistribSearch
   [junit4]   2> 2 T591 oejs.Server.doStart jetty-8.1.2.v20120308
   [junit4]   2> 3 T591 oejs.AbstractConnector.doStart Started SocketConnector@0.0.0.0:58720
   [junit4]   2> 3 T591 oasc.SolrResourceLoader.locateSolrHome JNDI not configured for solr (NoInitialContextEx)
   [junit4]   2> 4 T591 oasc.SolrResourceLoader.locateSolrHome using system property solr.solr.home: /mnt/ssd/jenkins/workspace/Lucene-Solr-trunk-Linux-Java8-64/checkout/solr/build/solr-core/test-files/solr
   [junit4]   2> 4 T591 oasc.SolrResourceLoader.<init> new SolrResourceLoader for deduced Solr Home: '/mnt/ssd/jenkins/workspace/Lucene-Solr-trunk-Linux-Java8-64/checkout/solr/build/solr-core/test-files/solr/'
   [junit4]   2> 7 T591 oass.SolrDispatchFilter.init SolrDispatchFilter.init()
   [junit4]   2> 8 T591 oasc.SolrResourceLoader.locateSolrHome JNDI not configured for solr (NoInitialContextEx)
   [junit4]   2> 8 T591 oasc.SolrResourceLoader.locateSolrHome using system property solr.solr.home: /mnt/ssd/jenkins/workspace/Lucene-Solr-trunk-Linux-Java8-64/checkout/solr/build/solr-core/test-files/solr
   [junit4]   2> 8 T591 oasc.CoreContainer$Initializer.initialize looking for solr.xml: /mnt/ssd/jenkins/workspace/Lucene-Solr-trunk-Linux-Java8-64/checkout/solr/build/solr-core/test-files/solr/solr.xml
   [junit4]   2> 8 T591 oasc.CoreContainer.<init> New CoreContainer 1031794468
   [junit4]   2> 8 T591 oasc.CoreContainer.load Loading CoreContainer using Solr Home: '/mnt/ssd/jenkins/workspace/Lucene-Solr-trunk-Linux-Java8-64/checkout/solr/build/solr-core/test-files/solr/'
   [junit4]   2> 9 T591 oasc.SolrResourceLoader.<init> new SolrResourceLoader for directory: '/mnt/ssd/jenkins/workspace/Lucene-Solr-trunk-Linux-Java8-64/checkout/solr/build/solr-core/test-files/solr/'
   [junit4]   2> 15 T591 oasc.CoreContainer.load Registering Log Listener
   [junit4]   2> 23 T591 oashc.HttpShardHandlerFactory.getParameter Setting socketTimeout to: 0
   [junit4]   2> 23 T591 oashc.HttpShardHandlerFactory.getParameter Setting urlScheme to: http://
   [junit4]   2> 23 T591 oashc.HttpShardHandlerFactory.getParameter Setting connTimeout to: 0
   [junit4]   2> 23 T591 oashc.HttpShardHandlerFactory.getParameter Setting maxConnectionsPerHost to: 20
   [junit4]   2> 23 T591 oashc.HttpShardHandlerFactory.getParameter Setting corePoolSize to: 0
   [junit4]   2> 24 T591 oashc.HttpShardHandlerFactory.getParameter Setting maximumPoolSize to: 2147483647
   [junit4]   2> 24 T591 oashc.HttpShardHandlerFactory.getParameter Setting maxThreadIdleTime to: 5
   [junit4]   2> 24 T591 oashc.HttpShardHandlerFactory.getParameter Setting sizeOfQueue to: -1
   [junit4]   2> 24 T591 oashc.HttpShardHandlerFactory.getParameter Setting fairnessPolicy to: false
   [junit4]   2> 24 T591 oascsi.HttpClientUtil.createClient Creating new http client, config:maxConnectionsPerHost=20&maxConnections=10000&socketTimeout=0&connTimeout=0&retry=false
   [junit4]   2> 29 T591 oasc.CoreContainer.create Creating SolrCore 'collection1' using instanceDir: /mnt/ssd/jenkins/workspace/Lucene-Solr-trunk-Linux-Java8-64/checkout/solr/build/solr-core/test-files/solr/collection1
   [junit4]   2> 29 T591 oasc.SolrResourceLoader.<init> new SolrResourceLoader for directory: '/mnt/ssd/jenkins/workspace/Lucene-Solr-trunk-Linux-Java8-64/checkout/solr/build/solr-core/test-files/solr/collection1/'
   [junit4]   2> 30 T591 oasc.SolrResourceLoader.replaceClassLoader Adding 'file:/mnt/ssd/jenkins/workspace/Lucene-Solr-trunk-Linux-Java8-64/checkout/solr/build/solr-core/test-files/solr/collection1/lib/classes/' to classloader
   [junit4]   2> 30 T591 oasc.SolrResourceLoader.replaceClassLoader Adding 'file:/mnt/ssd/jenkins/workspace/Lucene-Solr-trunk-Linux-Java8-64/checkout/solr/build/solr-core/test-files/solr/collection1/lib/README' to classloader
   [junit4]   2> 43 T591 oasc.SolrConfig.<init> Using Lucene MatchVersion: LUCENE_50
   [junit4]   2> 70 T591 oasc.SolrConfig.<init> Loaded SolrConfig: solrconfig-elevate.xml
   [junit4]   2> 70 T591 oass.IndexSchema.readSchema Reading Solr Schema
   [junit4]   2> 72 T591 oass.IndexSchema.readSchema Schema name=example
   [junit4]   2> 200 T591 oass.IndexSchema.readSchema default search field in schema is text
   [junit4]   2> 201 T591 oass.IndexSchema.readSchema unique key field: id
   [junit4]   2> 203 T591 oasc.SolrCore.<init> [collection1] Opening new SolrCore at /mnt/ssd/jenkins/workspace/Lucene-Solr-trunk-Linux-Java8-64/checkout/solr/build/solr-core/test-files/solr/collection1/, dataDir=./org.apache.solr.handler.component.DistributedQueryElevationComponentTest-1341185019306/control/data/
   [junit4]   2> 203 T591 oasc.JmxMonitoredMap.<init> JMX monitoring is enabled. Adding Solr mbeans to JMX Server: com.sun.jmx.mbeanserver.JmxMBeanServer@6a1dbc8b
   [junit4]   2> 203 T591 oasc.SolrCore.getNewIndexDir WARNING New index directory detected: old=null new=./org.apache.solr.handler.component.DistributedQueryElevationComponentTest-1341185019306/control/data/index/
   [junit4]   2> 204 T591 oasc.SolrCore.initIndex WARNING [collection1] Solr index directory './org.apache.solr.handler.component.DistributedQueryElevationComponentTest-1341185019306/control/data/index' doesn't exist. Creating new index...
   [junit4]   2> 205 T591 oasc.SolrDeletionPolicy.onCommit SolrDeletionPolicy.onCommit: commits:num=1
   [junit4]   2> 		commit{dir=MockDirWrapper(org.apache.lucene.store.RAMDirectory@2a1323a lockFactory=org.apache.lucene.store.SingleInstanceLockFactory@1bf5f997),segFN=segments_1,generation=1,filenames=[segments_1]
   [junit4]   2> 205 T591 oasc.SolrDeletionPolicy.updateCommits newest commit = 1
   [junit4]   2> 206 T591 oasc.RequestHandlers.initHandlersFromConfig created /update: solr.UpdateRequestHandler
   [junit4]   2> 206 T591 oasc.RequestHandlers.initHandlersFromConfig created /elevate: org.apache.solr.handler.component.SearchHandler
   [junit4]   2> 206 T591 oasc.RequestHandlers.initHandlersFromConfig created /dataElevate: org.apache.solr.handler.component.SearchHandler
   [junit4]   2> 207 T591 oashl.XMLLoader.init xsltCacheLifetimeSeconds=60
   [junit4]   2> 207 T591 oasc.RequestHandlers.initHandlersFromConfig WARNING no default request handler is registered (either '/select' or 'standard')
   [junit4]   2> 208 T591 oasc.SolrCore.initDeprecatedSupport WARNING solrconfig.xml uses deprecated <admin/gettableFiles>, Please update your config to use the ShowFileRequestHandler.
   [junit4]   2> 208 T591 oasc.SolrCore.initDeprecatedSupport WARNING adding ShowFileRequestHandler with hidden files: [SCHEMA-SPELLCHECKER.XML, SOLRCONFIG-NOCACHE.XML, SOLRCONFIG-MASTER1-KEEPONEBACKUP.XML, SOLRCONFIG-TERMINDEX.XML, BAD-SCHEMA-EXTERNAL-FILEFIELD.XML, STOPWITHBOM.TXT, SOLRCONFIG-SOLR-749.XML, DA_UTF8.XML, SOLRCONFIG-SOLCOREPROPERTIES.XML, SCHEMA11.XML, SCHEMA-LMJELINEKMERCER.XML, SCHEMASURROUND.XML, SOLRCONFIG-CACHING.XML, SCHEMA-NUMERIC.XML, STOP-SNOWBALL.TXT, SOLRCONFIG-TLOG.XML, STOP-2.TXT, SOLRCONFIG-SIMPLELOCK.XML, SCHEMA-BINARYFIELD.XML, SOLRCONFIG-SPELLCHECKER.XML, SOLRCONFIG_CODEC.XML, BAD-SCHEMA-DUP-DYNAMICFIELD.XML, OPEN-EXCHANGE-RATES.JSON, SOLRCONFIG-QUERYSENDER-NOQUERY.XML, SOLRCONFIG-MERGEPOLICY.XML, SCHEMA-STOP-KEEP.XML, STEMDICT.TXT, SCHEMA-REPLICATION1.XML, SCHEMA-DFR.XML, SCHEMA-REQUIRED-FIELDS.XML, SOLRCONFIG-SLAVE1.XML, SOLRCONFIG-REPEATER.XML, HUNSPELL-TEST.DIC, STOPTYPES-1.TXT, SCHEMA15.XML, SOLRCONFIG-SPELLCHECKCOMPONENT.XML, SOLRCONFIG-MASTER3.XML, SOLRCONFIG-QUERYSENDER.XML, SOLRCONFIG-PROPINJECT-INDEXDEFAULT.XML, BAD-SCHEMA-DUP-FIELDTYPE.XML, SCHEMA-COPYFIELD-TEST.XML, BAD-SCHEMA-DUP-FIELD.XML, SOLRCONFIG-BASIC.XML, KEEP-2.TXT, SOLRCONFIG-NATIVELOCK.XML, HUNSPELL-TEST.AFF, BAD-SCHEMA-NOT-INDEXED-BUT-NORMS.XML, SCHEMA_CODEC.XML, SOLRCONFIG-LAZYWRITER.XML, DA_COMPOUNDDICTIONARY.TXT, SOLRCONFIG-REQHANDLER.INCL, SOLRCONFIG-DELPOLICY1.XML, SCHEMA-LMDIRICHLET.XML, HYPHENATION.DTD, OLD_SYNONYMS.TXT, STOP-1.TXT, SOLRCONFIG_PERF.XML, BAD-SCHEMA-UNIQUEKEY-IS-COPYFIELD-DEST.XML, SCHEMA-TFIDF.XML, BAD-SCHEMA-UNIQUEKEY-USES-DEFAULT.XML, WDFTYPES.TXT, SCHEMA-FOLDING.XML, FRENCHARTICLES.TXT, SOLRCONFIG-ELEVATE.XML, SCHEMA-NOT-REQUIRED-UNIQUE-KEY.XML, STOPWORDSWRONGENCODING.TXT, KEEP-1.TXT, ELEVATE.XML, SOLRCONFIG-DELPOLICY2.XML, BAD-SCHEMA-SIM-GLOBAL-VS-FT-MISMATCH.XML, SOLRCONFIG-MASTER.XML, BAD-MP-SOLRCONFIG.XML, SOLRCONFIG-ENABLEPLUGIN.XML, SCHEMA-MINIMAL.XML, SOLRCONFIG-MASTER2.XML, XSLT, SCHEMA-REPLICATION2.XML, SCHEMA-TRIE.XML, BAD-SCHEMA-NONTEXT-ANALYZER.XML, STOPTYPES-2.TXT, STOPWORDS.TXT, MAPPING-ISOLATIN1ACCENT.TXT, SOLRCONFIG-ALTDIRECTORY.XML, SOLRCONFIG-HIGHLIGHT.XML, SCHEMA-IB.XML, SOLRCONFIG-MASTER1.XML, SOLRCONFIG-PHRASESUGGEST.XML, SCHEMA.XML, SOLRCONFIG-FUNCTIONQUERY.XML, CURRENCY.XML, COMPOUNDDICTIONARY.TXT, SCHEMA12.XML, SOLRCONFIG-SLAVE.XML, SOLRCONFIG-TRANSFORMERS.XML, PHRASESUGGEST.TXT, SOLRCONFIG-UPDATE-PROCESSOR-CHAINS.XML, SOLRCONFIG-PROPINJECT.XML, BAD-SCHEMA-NOT-INDEXED-BUT-POS.XML, PROTWORDS.TXT, SCHEMA-REVERSED.XML, SCHEMA-LUCENEMATCHVERSION.XML, SYNONYMS.TXT, BAD_SOLRCONFIG.XML, BAD-SCHEMA-NOT-INDEXED-BUT-TF.XML, SOLRCONFIG-XINCLUDE.XML, SCHEMA-COLLATE.XML, BAD-SCHEMA-OMIT-TF-BUT-NOT-POS.XML, SCHEMA-PHRASESUGGEST.XML, SCHEMA-BM25.XML, SCHEMA-SIM.XML]
   [junit4]   2> 209 T591 oass.SolrIndexSearcher.<init> Opening Searcher@2e481d9c main
   [junit4]   2> 210 T591 oass.SolrIndexSearcher.<init> WARNING WARNING: Directory impl does not support setting indexDir: org.apache.lucene.store.MockDirectoryWrapper
   [junit4]   2> 210 T591 oasu.CommitTracker.<init> Hard AutoCommit: disabled
   [junit4]   2> 210 T591 oasu.CommitTracker.<init> Soft AutoCommit: disabled
   [junit4]   2> 210 T591 oashc.QueryElevationComponent.inform Loading QueryElevation from: /mnt/ssd/jenkins/workspace/Lucene-Solr-trunk-Linux-Java8-64/checkout/solr/build/solr-core/test-files/solr/collection1/conf/elevate.xml
   [junit4]   2> 215 T591 oashc.QueryElevationComponent.inform Loading QueryElevation from: /mnt/ssd/jenkins/workspace/Lucene-Solr-trunk-Linux-Java8-64/checkout/solr/build/solr-core/test-files/solr/collection1/conf/elevate.xml
   [junit4]   2> 221 T601 oasc.SolrCore.registerSearcher [collection1] Registered new searcher Searcher@2e481d9c main{StandardDirectoryReader(segments_1:1)}
   [junit4]   2> 221 T591 oasc.CoreContainer.register registering core: collection1
   [junit4]   2> 221 T591 oass.SolrDispatchFilter.init user.dir=/mnt/ssd/jenkins/workspace/Lucene-Solr-trunk-Linux-Java8-64/checkout/solr/build/solr-core/test/J0
   [junit4]   2> 221 T591 oass.SolrDispatchFilter.init SolrDispatchFilter.init() done
   [junit4]   2> 221 T591 oascsi.HttpClientUtil.createClient Creating new http client, config:maxConnections=128&maxConnectionsPerHost=32&followRedirects=false
   [junit4]   2> 223 T591 oejs.Server.doStart jetty-8.1.2.v20120308
   [junit4]   2> 225 T591 oejs.AbstractConnector.doStart Started SocketConnector@0.0.0.0:48099
   [junit4]   2> 225 T591 oasc.SolrResourceLoader.locateSolrHome JNDI not configured for solr (NoInitialContextEx)
   [junit4]   2> 225 T591 oasc.SolrResourceLoader.locateSolrHome using system property solr.solr.home: /mnt/ssd/jenkins/workspace/Lucene-Solr-trunk-Linux-Java8-64/checkout/solr/build/solr-core/test-files/solr
   [junit4]   2> 225 T591 oasc.SolrResourceLoader.<init> new SolrResourceLoader for deduced Solr Home: '/mnt/ssd/jenkins/workspace/Lucene-Solr-trunk-Linux-Java8-64/checkout/solr/build/solr-core/test-files/solr/'
   [junit4]   2> 228 T591 oass.SolrDispatchFilter.init SolrDispatchFilter.init()
   [junit4]   2> 228 T591 oasc.SolrResourceLoader.locateSolrHome JNDI not configured for solr (NoInitialContextEx)
   [junit4]   2> 228 T591 oasc.SolrResourceLoader.locateSolrHome using system property solr.solr.home: /mnt/ssd/jenkins/workspace/Lucene-Solr-trunk-Linux-Java8-64/checkout/solr/build/solr-core/test-files/solr
   [junit4]   2> 228 T591 oasc.CoreContainer$Initializer.initialize looking for solr.xml: /mnt/ssd/jenkins/workspace/Lucene-Solr-trunk-Linux-Java8-64/checkout/solr/build/solr-core/test-files/solr/solr.xml
   [junit4]   2> 229 T591 oasc.CoreContainer.<init> New CoreContainer 581671744
   [junit4]   2> 229 T591 oasc.CoreContainer.load Loading CoreContainer using Solr Home: '/mnt/ssd/jenkins/workspace/Lucene-Solr-trunk-Linux-Java8-64/checkout/solr/build/solr-core/test-files/solr/'
   [junit4]   2> 229 T591 oasc.SolrResourceLoader.<init> new SolrResourceLoader for directory: '/mnt/ssd/jenkins/workspace/Lucene-Solr-trunk-Linux-Java8-64/checkout/solr/build/solr-core/test-files/solr/'
   [junit4]   2> 233 T591 oasc.CoreContainer.load Registering Log Listener
   [junit4]   2> 240 T591 oashc.HttpShardHandlerFactory.getParameter Setting socketTimeout to: 0
   [junit4]   2> 240 T591 oashc.HttpShardHandlerFactory.getParameter Setting urlScheme to: http://
   [junit4]   2> 240 T591 oashc.HttpShardHandlerFactory.getParameter Setting connTimeout to: 0
   [junit4]   2> 240 T591 oashc.HttpShardHandlerFactory.getParameter Setting maxConnectionsPerHost to: 20
   [junit4]   2> 241 T591 oashc.HttpShardHandlerFactory.getParameter Setting corePoolSize to: 0
   [junit4]   2> 241 T591 oashc.HttpShardHandlerFactory.getParameter Setting maximumPoolSize to: 2147483647
   [junit4]   2> 241 T591 oashc.HttpShardHandlerFactory.getParameter Setting maxThreadIdleTime to: 5
   [junit4]   2> 241 T591 oashc.HttpShardHandlerFactory.getParameter Setting sizeOfQueue to: -1
   [junit4]   2> 241 T591 oashc.HttpShardHandlerFactory.getParameter Setting fairnessPolicy to: false
   [junit4]   2> 241 T591 oascsi.HttpClientUtil.createClient Creating new http client, config:maxConnectionsPerHost=20&maxConnections=10000&socketTimeout=0&connTimeout=0&retry=false
   [junit4]   2> 245 T591 oasc.CoreContainer.create Creating SolrCore 'collection1' using instanceDir: /mnt/ssd/jenkins/workspace/Lucene-Solr-trunk-Linux-Java8-64/checkout/solr/build/solr-core/test-files/solr/collection1
   [junit4]   2> 245 T591 oasc.SolrResourceLoader.<init> new SolrResourceLoader for directory: '/mnt/ssd/jenkins/workspace/Lucene-Solr-trunk-Linux-Java8-64/checkout/solr/build/solr-core/test-files/solr/collection1/'
   [junit4]   2> 246 T591 oasc.SolrResourceLoader.replaceClassLoader Adding 'file:/mnt/ssd/jenkins/workspace/Lucene-Solr-trunk-Linux-Java8-64/checkout/solr/build/solr-core/test-files/solr/collection1/lib/classes/' to classloader
   [junit4]   2> 246 T591 oasc.SolrResourceLoader.replaceClassLoader Adding 'file:/mnt/ssd/jenkins/workspace/Lucene-Solr-trunk-Linux-Java8-64/checkout/solr/build/solr-core/test-files/solr/collection1/lib/README' to classloader
   [junit4]   2> 259 T591 oasc.SolrConfig.<init> Using Lucene MatchVersion: LUCENE_50
   [junit4]   2> 284 T591 oasc.SolrConfig.<init> Loaded SolrConfig: solrconfig-elevate.xml
   [junit4]   2> 284 T591 oass.IndexSchema.readSchema Reading Solr Schema
   [junit4]   2> 286 T591 oass.IndexSchema.readSchema Schema name=example
   [junit4]   2> 389 T591 oass.IndexSchema.readSchema default search field in schema is text
   [junit4]   2> 391 T591 oass.IndexSchema.readSchema unique key field: id
   [junit4]   2> 393 T591 oasc.SolrCore.<init> [collection1] Opening new SolrCore at /mnt/ssd/jenkins/workspace/Lucene-Solr-trunk-Linux-Java8-64/checkout/solr/build/solr-core/test-files/solr/collection1/, dataDir=./org.apache.solr.handler.component.DistributedQueryElevationComponentTest-1341185019306/shard0/data/
   [junit4]   2> 393 T591 oasc.JmxMonitoredMap.<init> JMX monitoring is enabled. Adding Solr mbeans to JMX Server: com.sun.jmx.mbeanserver.JmxMBeanServer@6a1dbc8b
   [junit4]   2> 393 T591 oasc.SolrCore.getNewIndexDir WARNING New index directory detected: old=null new=./org.apache.solr.handler.component.DistributedQueryElevationComponentTest-1341185019306/shard0/data/index/
   [junit4]   2> 394 T591 oasc.SolrCore.initIndex WARNING [collection1] Solr index directory './org.apache.solr.handler.component.DistributedQueryElevationComponentTest-1341185019306/shard0/data/index' doesn't exist. Creating new index...
   [junit4]   2> 395 T591 oasc.SolrDeletionPolicy.onCommit SolrDeletionPolicy.onCommit: commits:num=1
   [junit4]   2> 		commit{dir=MockDirWrapper(org.apache.lucene.store.RAMDirectory@635d2f43 lockFactory=org.apache.lucene.store.SingleInstanceLockFactory@66829f87),segFN=segments_1,generation=1,filenames=[segments_1]
   [junit4]   2> 395 T591 oasc.SolrDeletionPolicy.updateCommits newest commit = 1
   [junit4]   2> 396 T591 oasc.RequestHandlers.initHandlersFromConfig created /update: solr.UpdateRequestHandler
   [junit4]   2> 396 T591 oasc.RequestHandlers.initHandlersFromConfig created /elevate: org.apache.solr.handler.component.SearchHandler
   [junit4]   2> 396 T591 oasc.RequestHandlers.initHandlersFromConfig created /dataElevate: org.apache.solr.handler.component.SearchHandler
   [junit4]   2> 396 T591 oashl.XMLLoader.init xsltCacheLifetimeSeconds=60
   [junit4]   2> 397 T591 oasc.RequestHandlers.initHandlersFromConfig WARNING no default request handler is registered (either '/select' or 'standard')
   [junit4]   2> 397 T591 oasc.SolrCore.initDeprecatedSupport WARNING solrconfig.xml uses deprecated <admin/gettableFiles>, Please update your config to use the ShowFileRequestHandler.
   [junit4]   2> 398 T591 oasc.SolrCore.initDeprecatedSupport WARNING adding ShowFileRequestHandler with hidden files: [SCHEMA-SPELLCHECKER.XML, SOLRCONFIG-NOCACHE.XML, SOLRCONFIG-MASTER1-KEEPONEBACKUP.XML, SOLRCONFIG-TERMINDEX.XML, BAD-SCHEMA-EXTERNAL-FILEFIELD.XML, STOPWITHBOM.TXT, SOLRCONFIG-SOLR-749.XML, DA_UTF8.XML, SOLRCONFIG-SOLCOREPROPERTIES.XML, SCHEMA11.XML, SCHEMA-LMJELINEKMERCER.XML, SCHEMASURROUND.XML, SOLRCONFIG-CACHING.XML, SCHEMA-NUMERIC.XML, STOP-SNOWBALL.TXT, SOLRCONFIG-TLOG.XML, STOP-2.TXT, SOLRCONFIG-SIMPLELOCK.XML, SCHEMA-BINARYFIELD.XML, SOLRCONFIG-SPELLCHECKER.XML, SOLRCONFIG_CODEC.XML, BAD-SCHEMA-DUP-DYNAMICFIELD.XML, OPEN-EXCHANGE-RATES.JSON, SOLRCONFIG-QUERYSENDER-NOQUERY.XML, SOLRCONFIG-MERGEPOLICY.XML, SCHEMA-STOP-KEEP.XML, STEMDICT.TXT, SCHEMA-REPLICATION1.XML, SCHEMA-DFR.XML, SCHEMA-REQUIRED-FIELDS.XML, SOLRCONFIG-SLAVE1.XML, SOLRCONFIG-REPEATER.XML, HUNSPELL-TEST.DIC, STOPTYPES-1.TXT, SCHEMA15.XML, SOLRCONFIG-SPELLCHECKCOMPONENT.XML, SOLRCONFIG-MASTER3.XML, SOLRCONFIG-QUERYSENDER.XML, SOLRCONFIG-PROPINJECT-INDEXDEFAULT.XML, BAD-SCHEMA-DUP-FIELDTYPE.XML, SCHEMA-COPYFIELD-TEST.XML, BAD-SCHEMA-DUP-FIELD.XML, SOLRCONFIG-BASIC.XML, KEEP-2.TXT, SOLRCONFIG-NATIVELOCK.XML, HUNSPELL-TEST.AFF, BAD-SCHEMA-NOT-INDEXED-BUT-NORMS.XML, SCHEMA_CODEC.XML, SOLRCONFIG-LAZYWRITER.XML, DA_COMPOUNDDICTIONARY.TXT, SOLRCONFIG-REQHANDLER.INCL, SOLRCONFIG-DELPOLICY1.XML, SCHEMA-LMDIRICHLET.XML, HYPHENATION.DTD, OLD_SYNONYMS.TXT, STOP-1.TXT, SOLRCONFIG_PERF.XML, BAD-SCHEMA-UNIQUEKEY-IS-COPYFIELD-DEST.XML, SCHEMA-TFIDF.XML, BAD-SCHEMA-UNIQUEKEY-USES-DEFAULT.XML, WDFTYPES.TXT, SCHEMA-FOLDING.XML, FRENCHARTICLES.TXT, SOLRCONFIG-ELEVATE.XML, SCHEMA-NOT-REQUIRED-UNIQUE-KEY.XML, STOPWORDSWRONGENCODING.TXT, KEEP-1.TXT, ELEVATE.XML, SOLRCONFIG-DELPOLICY2.XML, BAD-SCHEMA-SIM-GLOBAL-VS-FT-MISMATCH.XML, SOLRCONFIG-MASTER.XML, BAD-MP-SOLRCONFIG.XML, SOLRCONFIG-ENABLEPLUGIN.XML, SCHEMA-MINIMAL.XML, SOLRCONFIG-MASTER2.XML, XSLT, SCHEMA-REPLICATION2.XML, SCHEMA-TRIE.XML, BAD-SCHEMA-NONTEXT-ANALYZER.XML, STOPTYPES-2.TXT, STOPWORDS.TXT, MAPPING-ISOLATIN1ACCENT.TXT, SOLRCONFIG-ALTDIRECTORY.XML, SOLRCONFIG-HIGHLIGHT.XML, SCHEMA-IB.XML, SOLRCONFIG-MASTER1.XML, SOLRCONFIG-PHRASESUGGEST.XML, SCHEMA.XML, SOLRCONFIG-FUNCTIONQUERY.XML, CURRENCY.XML, COMPOUNDDICTIONARY.TXT, SCHEMA12.XML, SOLRCONFIG-SLAVE.XML, SOLRCONFIG-TRANSFORMERS.XML, PHRASESUGGEST.TXT, SOLRCONFIG-UPDATE-PROCESSOR-CHAINS.XML, SOLRCONFIG-PROPINJECT.XML, BAD-SCHEMA-NOT-INDEXED-BUT-POS.XML, PROTWORDS.TXT, SCHEMA-REVERSED.XML, SCHEMA-LUCENEMATCHVERSION.XML, SYNONYMS.TXT, BAD_SOLRCONFIG.XML, BAD-SCHEMA-NOT-INDEXED-BUT-TF.XML, SOLRCONFIG-XINCLUDE.XML, SCHEMA-COLLATE.XML, BAD-SCHEMA-OMIT-TF-BUT-NOT-POS.XML, SCHEMA-PHRASESUGGEST.XML, SCHEMA-BM25.XML, SCHEMA-SIM.XML]
   [junit4]   2> 399 T591 oass.SolrIndexSearcher.<init> Opening Searcher@34d509f main
   [junit4]   2> 399 T591 oass.SolrIndexSearcher.<init> WARNING WARNING: Directory impl does not support setting indexDir: org.apache.lucene.store.MockDirectoryWrapper
   [junit4]   2> 399 T591 oasu.CommitTracker.<init> Hard AutoCommit: disabled
   [junit4]   2> 400 T591 oasu.CommitTracker.<init> Soft AutoCommit: disabled
   [junit4]   2> 400 T591 oashc.QueryElevationComponent.inform Loading QueryElevation from: /mnt/ssd/jenkins/workspace/Lucene-Solr-trunk-Linux-Java8-64/checkout/solr/build/solr-core/test-files/solr/collection1/conf/elevate.xml
   [junit4]   2> 405 T591 oashc.QueryElevationComponent.inform Loading QueryElevation from: /mnt/ssd/jenkins/workspace/Lucene-Solr-trunk-Linux-Java8-64/checkout/solr/build/solr-core/test-files/solr/collection1/conf/elevate.xml
   [junit4]   2> 410 T611 oasc.SolrCore.registerSearcher [collection1] Registered new searcher Searcher@34d509f main{StandardDirectoryReader(segments_1:1)}
   [junit4]   2> 410 T591 oasc.CoreContainer.register registering core: collection1
   [junit4]   2> 411 T591 oass.SolrDispatchFilter.init user.dir=/mnt/ssd/jenkins/workspace/Lucene-Solr-trunk-Linux-Java8-64/checkout/solr/build/solr-core/test/J0
   [junit4]   2> 411 T591 oass.SolrDispatchFilter.init SolrDispatchFilter.init() done
   [junit4]   2> 411 T591 oascsi.HttpClientUtil.createClient Creating new http client, config:maxConnections=128&maxConnectionsPerHost=32&followRedirects=false
   [junit4]   2> 413 T591 oejs.Server.doStart jetty-8.1.2.v20120308
   [junit4]   2> 414 T591 oejs.AbstractConnector.doStart Started SocketConnector@0.0.0.0:35698
   [junit4]   2> 415 T591 oasc.SolrResourceLoader.locateSolrHome JNDI not configured for solr (NoInitialContextEx)
   [junit4]   2> 415 T591 oasc.SolrResourceLoader.locateSolrHome using system property solr.solr.home: /mnt/ssd/jenkins/workspace/Lucene-Solr-trunk-Linux-Java8-64/checkout/solr/build/solr-core/test-files/solr
   [junit4]   2> 415 T591 oasc.SolrResourceLoader.<init> new SolrResourceLoader for deduced Solr Home: '/mnt/ssd/jenkins/workspace/Lucene-Solr-trunk-Linux-Java8-64/checkout/solr/build/solr-core/test-files/solr/'
   [junit4]   2> 417 T591 oass.SolrDispatchFilter.init SolrDispatchFilter.init()
   [junit4]   2> 418 T591 oasc.SolrResourceLoader.locateSolrHome JNDI not configured for solr (NoInitialContextEx)
   [junit4]   2> 418 T591 oasc.SolrResourceLoader.locateSolrHome using system property solr.solr.home: /mnt/ssd/jenkins/workspace/Lucene-Solr-trunk-Linux-Java8-64/checkout/solr/build/solr-core/test-files/solr
   [junit4]   2> 418 T591 oasc.CoreContainer$Initializer.initialize looking for solr.xml: /mnt/ssd/jenkins/workspace/Lucene-Solr-trunk-Linux-Java8-64/checkout/solr/build/solr-core/test-files/solr/solr.xml
   [junit4]   2> 418 T591 oasc.CoreContainer.<init> New CoreContainer 2091445729
   [junit4]   2> 418 T591 oasc.CoreContainer.load Loading CoreContainer using Solr Home: '/mnt/ssd/jenkins/workspace/Lucene-Solr-trunk-Linux-Java8-64/checkout/solr/build/solr-core/test-files/solr/'
   [junit4]   2> 418 T591 oasc.SolrResourceLoader.<init> new SolrResourceLoader for directory: '/mnt/ssd/jenkins/workspace/Lucene-Solr-trunk-Linux-Java8-64/checkout/solr/build/solr-core/test-files/solr/'
   [junit4]   2> 423 T591 oasc.CoreContainer.load Registering Log Listener
   [junit4]   2> 429 T591 oashc.HttpShardHandlerFactory.getParameter Setting socketTimeout to: 0
   [junit4]   2> 430 T591 oashc.HttpShardHandlerFactory.getParameter Setting urlScheme to: http://
   [junit4]   2> 430 T591 oashc.HttpShardHandlerFactory.getParameter Setting connTimeout to: 0
   [junit4]   2> 430 T591 oashc.HttpShardHandlerFactory.getParameter Setting maxConnectionsPerHost to: 20
   [junit4]   2> 430 T591 oashc.HttpShardHandlerFactory.getParameter Setting corePoolSize to: 0
   [junit4]   2> 430 T591 oashc.HttpShardHandlerFactory.getParameter Setting maximumPoolSize to: 2147483647
   [junit4]   2> 430 T591 oashc.HttpShardHandlerFactory.getParameter Setting maxThreadIdleTime to: 5
   [junit4]   2> 430 T591 oashc.HttpShardHandlerFactory.getParameter Setting sizeOfQueue to: -1
   [junit4]   2> 431 T591 oashc.HttpShardHandlerFactory.getParameter Setting fairnessPolicy to: false
   [junit4]   2> 431 T591 oascsi.HttpClientUtil.createClient Creating new http client, config:maxConnectionsPerHost=20&maxConnections=10000&socketTimeout=0&connTimeout=0&retry=false
   [junit4]   2> 434 T591 oasc.CoreContainer.create Creating SolrCore 'collection1' using instanceDir: /mnt/ssd/jenkins/workspace/Lucene-Solr-trunk-Linux-Java8-64/checkout/solr/build/solr-core/test-files/solr/collection1
   [junit4]   2> 435 T591 oasc.SolrResourceLoader.<init> new SolrResourceLoader for directory: '/mnt/ssd/jenkins/workspace/Lucene-Solr-trunk-Linux-Java8-64/checkout/solr/build/solr-core/test-files/solr/collection1/'
   [junit4]   2> 435 T591 oasc.SolrResourceLoader.replaceClassLoader Adding 'file:/mnt/ssd/jenkins/workspace/Lucene-Solr-trunk-Linux-Java8-64/checkout/solr/build/solr-core/test-files/solr/collection1/lib/classes/' to classloader
   [junit4]   2> 435 T591 oasc.SolrResourceLoader.replaceClassLoader Adding 'file:/mnt/ssd/jenkins/workspace/Lucene-Solr-trunk-Linux-Java8-64/checkout/solr/build/solr-core/test-files/solr/collection1/lib/README' to classloader
   [junit4]   2> 448 T591 oasc.SolrConfig.<init> Using Lucene MatchVersion: LUCENE_50
   [junit4]   2> 473 T591 oasc.SolrConfig.<init> Loaded SolrConfig: solrconfig-elevate.xml
   [junit4]   2> 474 T591 oass.IndexSchema.readSchema Reading Solr Schema
   [junit4]   2> 476 T591 oass.IndexSchema.readSchema Schema name=example
   [junit4]   2> 580 T591 oass.IndexSchema.readSchema default search field in schema is text
   [junit4]   2> 582 T591 oass.IndexSchema.readSchema unique key field: id
   [junit4]   2> 584 T591 oasc.SolrCore.<init> [collection1] Opening new SolrCore at /mnt/ssd/jenkins/workspace/Lucene-Solr-trunk-Linux-Java8-64/checkout/solr/build/solr-core/test-files/solr/collection1/, dataDir=./org.apache.solr.handler.component.DistributedQueryElevationComponentTest-1341185019306/shard1/data/
   [junit4]   2> 584 T591 oasc.JmxMonitoredMap.<init> JMX monitoring is enabled. Adding Solr mbeans to JMX Server: com.sun.jmx.mbeanserver.JmxMBeanServer@6a1dbc8b
   [junit4]   2> 584 T591 oasc.SolrCore.getNewIndexDir WARNING New index directory detected: old=null new=./org.apache.solr.handler.component.DistributedQueryElevationComponentTest-1341185019306/shard1/data/index/
   [junit4]   2> 584 T591 oasc.SolrCore.initIndex WARNING [collection1] Solr index directory './org.apache.solr.handler.component.DistributedQueryElevationComponentTest-1341185019306/shard1/data/index' doesn't exist. Creating new index...
   [junit4]   2> 586 T591 oasc.SolrDeletionPolicy.onCommit SolrDeletionPolicy.onCommit: commits:num=1
   [junit4]   2> 		commit{dir=MockDirWrapper(org.apache.lucene.store.RAMDirectory@91d12cf lockFactory=org.apache.lucene.store.SingleInstanceLockFactory@54de7e06),segFN=segments_1,generation=1,filenames=[segments_1]
   [junit4]   2> 586 T591 oasc.SolrDeletionPolicy.updateCommits newest commit = 1
   [junit4]   2> 586 T591 oasc.RequestHandlers.initHandlersFromConfig created /update: solr.UpdateRequestHandler
   [junit4]   2> 587 T591 oasc.RequestHandlers.initHandlersFromConfig created /elevate: org.apache.solr.handler.component.SearchHandler
   [junit4]   2> 587 T591 oasc.RequestHandlers.initHandlersFromConfig created /dataElevate: org.apache.solr.handler.component.SearchHandler
   [junit4]   2> 587 T591 oashl.XMLLoader.init xsltCacheLifetimeSeconds=60
   [junit4]   2> 587 T591 oasc.RequestHandlers.initHandlersFromConfig WARNING no default request handler is registered (either '/select' or 'standard')
   [junit4]   2> 588 T591 oasc.SolrCore.initDeprecatedSupport WARNING solrconfig.xml uses deprecated <admin/gettableFiles>, Please update your config to use the ShowFileRequestHandler.
   [junit4]   2> 589 T591 oasc.SolrCore.initDeprecatedSupport WARNING adding ShowFileRequestHandler with hidden files: [SCHEMA-SPELLCHECKER.XML, SOLRCONFIG-NOCACHE.XML, SOLRCONFIG-MASTER1-KEEPONEBACKUP.XML, SOLRCONFIG-TERMINDEX.XML, BAD-SCHEMA-EXTERNAL-FILEFIELD.XML, STOPWITHBOM.TXT, SOLRCONFIG-SOLR-749.XML, DA_UTF8.XML, SOLRCONFIG-SOLCOREPROPERTIES.XML, SCHEMA11.XML, SCHEMA-LMJELINEKMERCER.XML, SCHEMASURROUND.XML, SOLRCONFIG-CACHING.XML, SCHEMA-NUMERIC.XML, STOP-SNOWBALL.TXT, SOLRCONFIG-TLOG.XML, STOP-2.TXT, SOLRCONFIG-SIMPLELOCK.XML, SCHEMA-BINARYFIELD.XML, SOLRCONFIG-SPELLCHECKER.XML, SOLRCONFIG_CODEC.XML, BAD-SCHEMA-DUP-DYNAMICFIELD.XML, OPEN-EXCHANGE-RATES.JSON, SOLRCONFIG-QUERYSENDER-NOQUERY.XML, SOLRCONFIG-MERGEPOLICY.XML, SCHEMA-STOP-KEEP.XML, STEMDICT.TXT, SCHEMA-REPLICATION1.XML, SCHEMA-DFR.XML, SCHEMA-REQUIRED-FIELDS.XML, SOLRCONFIG-SLAVE1.XML, SOLRCONFIG-REPEATER.XML, HUNSPELL-TEST.DIC, STOPTYPES-1.TXT, SCHEMA15.XML, SOLRCONFIG-SPELLCHECKCOMPONENT.XML, SOLRCONFIG-MASTER3.XML, SOLRCONFIG-QUERYSENDER.XML, SOLRCONFIG-PROPINJECT-INDEXDEFAULT.XML, BAD-SCHEMA-DUP-FIELDTYPE.XML, SCHEMA-COPYFIELD-TEST.XML, BAD-SCHEMA-DUP-FIELD.XML, SOLRCONFIG-BASIC.XML, KEEP-2.TXT, SOLRCONFIG-NATIVELOCK.XML, HUNSPELL-TEST.AFF, BAD-SCHEMA-NOT-INDEXED-BUT-NORMS.XML, SCHEMA_CODEC.XML, SOLRCONFIG-LAZYWRITER.XML, DA_COMPOUNDDICTIONARY.TXT, SOLRCONFIG-REQHANDLER.INCL, SOLRCONFIG-DELPOLICY1.XML, SCHEMA-LMDIRICHLET.XML, HYPHENATION.DTD, OLD_SYNONYMS.TXT, STOP-1.TXT, SOLRCONFIG_PERF.XML, BAD-SCHEMA-UNIQUEKEY-IS-COPYFIELD-DEST.XML, SCHEMA-TFIDF.XML, BAD-SCHEMA-UNIQUEKEY-USES-DEFAULT.XML, WDFTYPES.TXT, SCHEMA-FOLDING.XML, FRENCHARTICLES.TXT, SOLRCONFIG-ELEVATE.XML, SCHEMA-NOT-REQUIRED-UNIQUE-KEY.XML, STOPWORDSWRONGENCODING.TXT, KEEP-1.TXT, ELEVATE.XML, SOLRCONFIG-DELPOLICY2.XML, BAD-SCHEMA-SIM-GLOBAL-VS-FT-MISMATCH.XML, SOLRCONFIG-MASTER.XML, BAD-MP-SOLRCONFIG.XML, SOLRCONFIG-ENABLEPLUGIN.XML, SCHEMA-MINIMAL.XML, SOLRCONFIG-MASTER2.XML, XSLT, SCHEMA-REPLICATION2.XML, SCHEMA-TRIE.XML, BAD-SCHEMA-NONTEXT-ANALYZER.XML, STOPTYPES-2.TXT, STOPWORDS.TXT, MAPPING-ISOLATIN1ACCENT.TXT, SOLRCONFIG-ALTDIRECTORY.XML, SOLRCONFIG-HIGHLIGHT.XML, SCHEMA-IB.XML, SOLRCONFIG-MASTER1.XML, SOLRCONFIG-PHRASESUGGEST.XML, SCHEMA.XML, SOLRCONFIG-FUNCTIONQUERY.XML, CURRENCY.XML, COMPOUNDDICTIONARY.TXT, SCHEMA12.XML, SOLRCONFIG-SLAVE.XML, SOLRCONFIG-TRANSFORMERS.XML, PHRASESUGGEST.TXT, SOLRCONFIG-UPDATE-PROCESSOR-CHAINS.XML, SOLRCONFIG-PROPINJECT.XML, BAD-SCHEMA-NOT-INDEXED-BUT-POS.XML, PROTWORDS.TXT, SCHEMA-REVERSED.XML, SCHEMA-LUCENEMATCHVERSION.XML, SYNONYMS.TXT, BAD_SOLRCONFIG.XML, BAD-SCHEMA-NOT-INDEXED-BUT-TF.XML, SOLRCONFIG-XINCLUDE.XML, SCHEMA-COLLATE.XML, BAD-SCHEMA-OMIT-TF-BUT-NOT-POS.XML, SCHEMA-PHRASESUGGEST.XML, SCHEMA-BM25.XML, SCHEMA-SIM.XML]
   [junit4]   2> 590 T591 oass.SolrIndexSearcher.<init> Opening Searcher@17829ed9 main
   [junit4]   2> 590 T591 oass.SolrIndexSearcher.<init> WARNING WARNING: Directory impl does not support setting indexDir: org.apache.lucene.store.MockDirectoryWrapper
   [junit4]   2> 590 T591 oasu.CommitTracker.<init> Hard AutoCommit: disabled
   [junit4]   2> 590 T591 oasu.CommitTracker.<init> Soft AutoCommit: disabled
   [junit4]   2> 591 T591 oashc.QueryElevationComponent.inform Loading QueryElevation from: /mnt/ssd/jenkins/workspace/Lucene-Solr-trunk-Linux-Java8-64/checkout/solr/build/solr-core/test-files/solr/collection1/conf/elevate.xml
   [junit4]   2> 596 T591 oashc.QueryElevationComponent.inform Loading QueryElevation from: /mnt/ssd/jenkins/workspace/Lucene-Solr-trunk-Linux-Java8-64/checkout/solr/build/solr-core/test-files/solr/collection1/conf/elevate.xml
   [junit4]   2> 601 T621 oasc.SolrCore.registerSearcher [collection1] Registered new searcher Searcher@17829ed9 main{StandardDirectoryReader(segments_1:1)}
   [junit4]   2> 601 T591 oasc.CoreContainer.register registering core: collection1
   [junit4]   2> 601 T591 oass.SolrDispatchFilter.init user.dir=/mnt/ssd/jenkins/workspace/Lucene-Solr-trunk-Linux-Java8-64/checkout/solr/build/solr-core/test/J0
   [junit4]   2> 601 T591 oass.SolrDispatchFilter.init SolrDispatchFilter.init() done
   [junit4]   2> 602 T591 oascsi.HttpClientUtil.createClient Creating new http client, config:maxConnections=128&maxConnectionsPerHost=32&followRedirects=false
   [junit4]   2> 604 T591 oejs.Server.doStart jetty-8.1.2.v20120308
   [junit4]   2> 605 T591 oejs.AbstractConnector.doStart Started SocketConnector@0.0.0.0:40010
   [junit4]   2> 606 T591 oasc.SolrResourceLoader.locateSolrHome JNDI not configured for solr (NoInitialContextEx)
   [junit4]   2> 606 T591 oasc.SolrResourceLoader.locateSolrHome using system property solr.solr.home: /mnt/ssd/jenkins/workspace/Lucene-Solr-trunk-Linux-Java8-64/checkout/solr/build/solr-core/test-files/solr
   [junit4]   2> 606 T591 oasc.SolrResourceLoader.<init> new SolrResourceLoader for deduced Solr Home: '/mnt/ssd/jenkins/workspace/Lucene-Solr-trunk-Linux-Java8-64/checkout/solr/build/solr-core/test-files/solr/'
   [junit4]   2> 609 T591 oass.SolrDispatchFilter.init SolrDispatchFilter.init()
   [junit4]   2> 609 T591 oasc.SolrResourceLoader.locateSolrHome JNDI not configured for solr (NoInitialContextEx)
   [junit4]   2> 609 T591 oasc.SolrResourceLoader.locateSolrHome using system property solr.solr.home: /mnt/ssd/jenkins/workspace/Lucene-Solr-trunk-Linux-Java8-64/checkout/solr/build/solr-core/test-files/solr
   [junit4]   2> 609 T591 oasc.CoreContainer$Initializer.initialize looking for solr.xml: /mnt/ssd/jenkins/workspace/Lucene-Solr-trunk-Linux-Java8-64/checkout/solr/build/solr-core/test-files/solr/solr.xml
   [junit4]   2> 609 T591 oasc.CoreContainer.<init> New CoreContainer 525458961
   [junit4]   2> 609 T591 oasc.CoreContainer.load Loading CoreContainer using Solr Home: '/mnt/ssd/jenkins/workspace/Lucene-Solr-trunk-Linux-Java8-64/checkout/solr/build/solr-core/test-files/solr/'
   [junit4]   2> 609 T591 oasc.SolrResourceLoader.<init> new SolrResourceLoader for directory: '/mnt/ssd/jenkins/workspace/Lucene-Solr-trunk-Linux-Java8-64/checkout/solr/build/solr-core/test-files/solr/'
   [junit4]   2> 614 T591 oasc.CoreContainer.load Registering Log Listener
   [junit4]   2> 620 T591 oashc.HttpShardHandlerFactory.getParameter Setting socketTimeout to: 0
   [junit4]   2> 620 T591 oashc.HttpShardHandlerFactory.getParameter Setting urlScheme to: http://
   [junit4]   2> 620 T591 oashc.HttpShardHandlerFactory.getParameter Setting connTimeout to: 0
   [junit4]   2> 620 T591 oashc.HttpShardHandlerFactory.getParameter Setting maxConnectionsPerHost to: 20
   [junit4]   2> 621 T591 oashc.HttpShardHandlerFactory.getParameter Setting corePoolSize to: 0
   [junit4]   2> 621 T591 oashc.HttpShardHandlerFactory.getParameter Setting maximumPoolSize to: 2147483647
   [junit4]   2> 621 T591 oashc.HttpShardHandlerFactory.getParameter Setting maxThreadIdleTime to: 5
   [junit4]   2> 621 T591 oashc.HttpShardHandlerFactory.getParameter Setting sizeOfQueue to: -1
   [junit4]   2> 621 T591 oashc.HttpShardHandlerFactory.getParameter Setting fairnessPolicy to: false
   [junit4]   2> 621 T591 oascsi.HttpClientUtil.createClient Creating new http client, config:maxConnectionsPerHost=20&maxConnections=10000&socketTimeout=0&connTimeout=0&retry=false
   [junit4]   2> 625 T591 oasc.CoreContainer.create Creating SolrCore 'collection1' using instanceDir: /mnt/ssd/jenkins/workspace/Lucene-Solr-trunk-Linux-Java8-64/checkout/solr/build/solr-core/test-files/solr/collection1
   [junit4]   2> 625 T591 oasc.SolrResourceLoader.<init> new SolrResourceLoader for directory: '/mnt/ssd/jenkins/workspace/Lucene-Solr-trunk-Linux-Java8-64/checkout/solr/build/solr-core/test-files/solr/collection1/'
   [junit4]   2> 626 T591 oasc.SolrResourceLoader.replaceClassLoader Adding 'file:/mnt/ssd/jenkins/workspace/Lucene-Solr-trunk-Linux-Java8-64/checkout/solr/build/solr-core/test-files/solr/collection1/lib/classes/' to classloader
   [junit4]   2> 626 T591 oasc.SolrResourceLoader.replaceClassLoader Adding 'file:/mnt/ssd/jenkins/workspace/Lucene-Solr-trunk-Linux-Java8-64/checkout/solr/build/solr-core/test-files/solr/collection1/lib/README' to classloader
   [junit4]   2> 639 T591 oasc.SolrConfig.<init> Using Lucene MatchVersion: LUCENE_50
   [junit4]   2> 664 T591 oasc.SolrConfig.<init> Loaded SolrConfig: solrconfig-elevate.xml
   [junit4]   2> 664 T591 oass.IndexSchema.readSchema Reading Solr Schema
   [junit4]   2> 666 T591 oass.IndexSchema.readSchema Schema name=example
   [junit4]   2> 770 T591 oass.IndexSchema.readSchema default search field in schema is text
   [junit4]   2> 771 T591 oass.IndexSchema.readSchema unique key field: id
   [junit4]   2> 773 T591 oasc.SolrCore.<init> [collection1] Opening new SolrCore at /mnt/ssd/jenkins/workspace/Lucene-Solr-trunk-Linux-Java8-64/checkout/solr/build/solr-core/test-files/solr/collection1/, dataDir=./org.apache.solr.handler.component.DistributedQueryElevationComponentTest-1341185019306/shard2/data/
   [junit4]   2> 773 T591 oasc.JmxMonitoredMap.<init> JMX monitoring is enabled. Adding Solr mbeans to JMX Server: com.sun.jmx.mbeanserver.JmxMBeanServer@6a1dbc8b
   [junit4]   2> 774 T591 oasc.SolrCore.getNewIndexDir WARNING New index directory detected: old=null new=./org.apache.solr.handler.component.DistributedQueryElevationComponentTest-1341185019306/shard2/data/index/
   [junit4]   2> 774 T591 oasc.SolrCore.initIndex WARNING [collection1] Solr index directory './org.apache.solr.handler.component.DistributedQueryElevationComponentTest-1341185019306/shard2/data/index' doesn't exist. Creating new index...
   [junit4]   2> 775 T591 oasc.SolrDeletionPolicy.onCommit SolrDeletionPolicy.onCommit: commits:num=1
   [junit4]   2> 		commit{dir=MockDirWrapper(org.apache.lucene.store.NIOFSDirectory@/mnt/ssd/jenkins/workspace/Lucene-Solr-trunk-Linux-Java8-64/checkout/solr/build/solr-core/test/J0/index7086870869tmp lockFactory=org.apache.lucene.store.SingleInstanceLockFactory@4f9bbfa2),segFN=segments_1,generation=1,filenames=[segments_1]
   [junit4]   2> 776 T591 oasc.SolrDeletionPolicy.updateCommits newest commit = 1
   [junit4]   2> 776 T591 oasc.RequestHandlers.initHandlersFromConfig created /update: solr.UpdateRequestHandler
   [junit4]   2> 777 T591 oasc.RequestHandlers.initHandlersFromConfig created /elevate: org.apache.solr.handler.component.SearchHandler
   [junit4]   2> 777 T591 oasc.RequestHandlers.initHandlersFromConfig created /dataElevate: org.apache.solr.handler.component.SearchHandler
   [junit4]   2> 777 T591 oashl.XMLLoader.init xsltCacheLifetimeSeconds=60
   [junit4]   2> 777 T591 oasc.RequestHandlers.initHandlersFromConfig WARNING no default request handler is registered (either '/select' or 'standard')
   [junit4]   2> 778 T591 oasc.SolrCore.initDeprecatedSupport WARNING solrconfig.xml uses deprecated <admin/gettableFiles>, Please update your config to use the ShowFileRequestHandler.
   [junit4]   2> 779 T591 oasc.SolrCore.initDeprecatedSupport WARNING adding ShowFileRequestHandler with hidden files: [SCHEMA-SPELLCHECKER.XML, SOLRCONFIG-NOCACHE.XML, SOLRCONFIG-MASTER1-KEEPONEBACKUP.XML, SOLRCONFIG-TERMINDEX.XML, BAD-SCHEMA-EXTERNAL-FILEFIELD.XML, STOPWITHBOM.TXT, SOLRCONFIG-SOLR-749.XML, DA_UTF8.XML, SOLRCONFIG-SOLCOREPROPERTIES.XML, SCHEMA11.XML, SCHEMA-LMJELINEKMERCER.XML, SCHEMASURROUND.XML, SOLRCONFIG-CACHING.XML, SCHEMA-NUMERIC.XML, STOP-SNOWBALL.TXT, SOLRCONFIG-TLOG.XML, STOP-2.TXT, SOLRCONFIG-SIMPLELOCK.XML, SCHEMA-BINARYFIELD.XML, SOLRCONFIG-SPELLCHECKER.XML, SOLRCONFIG_CODEC.XML, BAD-SCHEMA-DUP-DYNAMICFIELD.XML, OPEN-EXCHANGE-RATES.JSON, SOLRCONFIG-QUERYSENDER-NOQUERY.XML, SOLRCONFIG-MERGEPOLICY.XML, SCHEMA-STOP-KEEP.XML, STEMDICT.TXT, SCHEMA-REPLICATION1.XML, SCHEMA-DFR.XML, SCHEMA-REQUIRED-FIELDS.XML, SOLRCONFIG-SLAVE1.XML, SOLRCONFIG-REPEATER.XML, HUNSPELL-TEST.DIC, STOPTYPES-1.TXT, SCHEMA15.XML, SOLRCONFIG-SPELLCHECKCOMPONENT.XML, SOLRCONFIG-MASTER3.XML, SOLRCONFIG-QUERYSENDER.XML, SOLRCONFIG-PROPINJECT-INDEXDEFAULT.XML, BAD-SCHEMA-DUP-FIELDTYPE.XML, SCHEMA-COPYFIELD-TEST.XML, BAD-SCHEMA-DUP-FIELD.XML, SOLRCONFIG-BASIC.XML, KEEP-2.TXT, SOLRCONFIG-NATIVELOCK.XML, HUNSPELL-TEST.AFF, BAD-SCHEMA-NOT-INDEXED-BUT-NORMS.XML, SCHEMA_CODEC.XML, SOLRCONFIG-LAZYWRITER.XML, DA_COMPOUNDDICTIONARY.TXT, SOLRCONFIG-REQHANDLER.INCL, SOLRCONFIG-DELPOLICY1.XML, SCHEMA-LMDIRICHLET.XML, HYPHENATION.DTD, OLD_SYNONYMS.TXT, STOP-1.TXT, SOLRCONFIG_PERF.XML, BAD-SCHEMA-UNIQUEKEY-IS-COPYFIELD-DEST.XML, SCHEMA-TFIDF.XML, BAD-SCHEMA-UNIQUEKEY-USES-DEFAULT.XML, WDFTYPES.TXT, SCHEMA-FOLDING.XML, FRENCHARTICLES.TXT, SOLRCONFIG-ELEVATE.XML, SCHEMA-NOT-REQUIRED-UNIQUE-KEY.XML, STOPWORDSWRONGENCODING.TXT, KEEP-1.TXT, ELEVATE.XML, SOLRCONFIG-DELPOLICY2.XML, BAD-SCHEMA-SIM-GLOBAL-VS-FT-MISMATCH.XML, SOLRCONFIG-MASTER.XML, BAD-MP-SOLRCONFIG.XML, SOLRCONFIG-ENABLEPLUGIN.XML, SCHEMA-MINIMAL.XML, SOLRCONFIG-MASTER2.XML, XSLT, SCHEMA-REPLICATION2.XML, SCHEMA-TRIE.XML, BAD-SCHEMA-NONTEXT-ANALYZER.XML, STOPTYPES-2.TXT, STOPWORDS.TXT, MAPPING-ISOLATIN1ACCENT.TXT, SOLRCONFIG-ALTDIRECTORY.XML, SOLRCONFIG-HIGHLIGHT.XML, SCHEMA-IB.XML, SOLRCONFIG-MASTER1.XML, SOLRCONFIG-PHRASESUGGEST.XML, SCHEMA.XML, SOLRCONFIG-FUNCTIONQUERY.XML, CURRENCY.XML, COMPOUNDDICTIONARY.TXT, SCHEMA12.XML, SOLRCONFIG-SLAVE.XML, SOLRCONFIG-TRANSFORMERS.XML, PHRASESUGGEST.TXT, SOLRCONFIG-UPDATE-PROCESSOR-CHAINS.XML, SOLRCONFIG-PROPINJECT.XML, BAD-SCHEMA-NOT-INDEXED-BUT-POS.XML, PROTWORDS.TXT, SCHEMA-REVERSED.XML, SCHEMA-LUCENEMATCHVERSION.XML, SYNONYMS.TXT, BAD_SOLRCONFIG.XML, BAD-SCHEMA-NOT-INDEXED-BUT-TF.XML, SOLRCONFIG-XINCLUDE.XML, SCHEMA-COLLATE.XML, BAD-SCHEMA-OMIT-TF-BUT-NOT-POS.XML, SCHEMA-PHRASESUGGEST.XML, SCHEMA-BM25.XML, SCHEMA-SIM.XML]
   [junit4]   2> 780 T591 oass.SolrIndexSearcher.<init> Opening Searcher@6787552b main
   [junit4]   2> 780 T591 oass.SolrIndexSearcher.<init> WARNING WARNING: Directory impl does not support setting indexDir: org.apache.lucene.store.MockDirectoryWrapper
   [junit4]   2> 781 T591 oasu.CommitTracker.<init> Hard AutoCommit: disabled
   [junit4]   2> 781 T591 oasu.CommitTracker.<init> Soft AutoCommit: disabled
   [junit4]   2> 781 T591 oashc.QueryElevationComponent.inform Loading QueryElevation from: /mnt/ssd/jenkins/workspace/Lucene-Solr-trunk-Linux-Java8-64/checkout/solr/build/solr-core/test-files/solr/collection1/conf/elevate.xml
   [junit4]   2> 786 T591 oashc.QueryElevationComponent.inform Loading QueryElevation from: /mnt/ssd/jenkins/workspace/Lucene-Solr-trunk-Linux-Java8-64/checkout/solr/build/solr-core/test-files/solr/collection1/conf/elevate.xml
   [junit4]   2> 791 T631 oasc.SolrCore.registerSearcher [collection1] Registered new searcher Searcher@6787552b main{StandardDirectoryReader(segments_1:1)}
   [junit4]   2> 791 T591 oasc.CoreContainer.register registering core: collection1
   [junit4]   2> 792 T591 oass.SolrDispatchFilter.init user.dir=/mnt/ssd/jenkins/workspace/Lucene-Solr-trunk-Linux-Java8-64/checkout/solr/build/solr-core/test/J0
   [junit4]   2> 792 T591 oass.SolrDispatchFilter.init SolrDispatchFilter.init() done
   [junit4]   2> 792 T591 oascsi.HttpClientUtil.createClient Creating new http client, config:maxConnections=128&maxConnectionsPerHost=32&followRedirects=false
   [junit4]   2> ASYNC  NEW_CORE C73 name=collection1 org.apache.solr.core.SolrCore@27c33c23
   [junit4]   2> 797 T594 C73 oasu.DirectUpdateHandler2.deleteAll [collection1] REMOVING ALL DOCUMENTS FROM INDEX
   [junit4]   2> 798 T594 C73 oasc.SolrDeletionPolicy.onInit SolrDeletionPolicy.onInit: commits:num=1
   [junit4]   2> 		commit{dir=MockDirWrapper(org.apache.lucene.store.RAMDirectory@2a1323a lockFactory=org.apache.lucene.store.SingleInstanceLockFactory@1bf5f997),segFN=segments_1,generation=1,filenames=[segments_1]
   [junit4]   2> 798 T594 C73 oasc.SolrDeletionPolicy.updateCommits newest commit = 1
   [junit4]   2> 798 T594 C73 UPDATE [collection1] webapp=/solr path=/update params={version=2&wt=javabin} {deleteByQuery=*:*} 0 2
   [junit4]   2> ASYNC  NEW_CORE C74 name=collection1 org.apache.solr.core.SolrCore@10d83860
   [junit4]   2> 802 T604 C74 oasu.DirectUpdateHandler2.deleteAll [collection1] REMOVING ALL DOCUMENTS FROM INDEX
   [junit4]   2> 803 T604 C74 oasc.SolrDeletionPolicy.onInit SolrDeletionPolicy.onInit: commits:num=1
   [junit4]   2> 		commit{dir=MockDirWrapper(org.apache.lucene.store.RAMDirectory@635d2f43 lockFactory=org.apache.lucene.store.SingleInstanceLockFactory@66829f87),segFN=segments_1,generation=1,filenames=[segments_1]
   [junit4]   2> 803 T604 C74 oasc.SolrDeletionPolicy.updateCommits newest commit = 1
   [junit4]   2> 803 T604 C74 UPDATE [collection1] webapp=/solr path=/update params={version=2&wt=javabin} {deleteByQuery=*:*} 0 2
   [junit4]   2> ASYNC  NEW_CORE C75 name=collection1 org.apache.solr.core.SolrCore@1e4fcd05
   [junit4]   2> 806 T614 C75 oasu.DirectUpdateHandler2.deleteAll [collection1] REMOVING ALL DOCUMENTS FROM INDEX
   [junit4]   2> 808 T614 C75 oasc.SolrDeletionPolicy.onInit SolrDeletionPolicy.onInit: commits:num=1
   [junit4]   2> 		commit{dir=MockDirWrapper(org.apache.lucene.store.RAMDirectory@91d12cf lockFactory=org.apache.lucene.store.SingleInstanceLockFactory@54de7e06),segFN=segments_1,generation=1,filenames=[segments_1]
   [junit4]   2> 808 T614 C75 oasc.SolrDeletionPolicy.updateCommits newest commit = 1
   [junit4]   2> 808 T614 C75 UPDATE [collection1] webapp=/solr path=/update params={version=2&wt=javabin} {deleteByQuery=*:*} 0 2
   [junit4]   2> ASYNC  NEW_CORE C76 name=collection1 org.apache.solr.core.SolrCore@140efee7
   [junit4]   2> 811 T623 C76 oasu.DirectUpdateHandler2.deleteAll [collection1] REMOVING ALL DOCUMENTS FROM INDEX
   [junit4]   2> 812 T623 C76 oasc.SolrDeletionPolicy.onInit SolrDeletionPolicy.onInit: commits:num=1
   [junit4]   2> 		commit{dir=MockDirWrapper(org.apache.lucene.store.NIOFSDirectory@/mnt/ssd/jenkins/workspace/Lucene-Solr-trunk-Linux-Java8-64/checkout/solr/build/solr-core/test/J0/index7086870869tmp lockFactory=org.apache.lucene.store.SingleInstanceLockFactory@4f9bbfa2),segFN=segments_1,generation=1,filenames=[segments_1]
   [junit4]   2> 813 T623 C76 oasc.SolrDeletionPolicy.updateCommits newest commit = 1
   [junit4]   2> 813 T623 C76 UPDATE [collection1] webapp=/solr path=/update params={version=2&wt=javabin} {deleteByQuery=*:*} 0 2
   [junit4]   2> 815 T594 C73 UPDATE [collection1] webapp=/solr path=/update params={version=2&wt=javabin} {add=[1]} 0 0
   [junit4]   2> 817 T604 C74 UPDATE [collection1] webapp=/solr path=/update params={version=2&wt=javabin} {add=[1]} 0 0
   [junit4]   2> 819 T594 C73 UPDATE [collection1] webapp=/solr path=/update params={version=2&wt=javabin} {add=[2]} 0 0
   [junit4]   2> 821 T614 C75 UPDATE [collection1] webapp=/solr path=/update params={version=2&wt=javabin} {add=[2]} 0 0
   [junit4]   2> 823 T594 C73 UPDATE [collection1] webapp=/solr path=/update params={version=2&wt=javabin} {add=[3]} 0 0
   [junit4]   2> 825 T623 C76 UPDATE [collection1] webapp=/solr path=/update params={version=2&wt=javabin} {add=[3]} 0 1
   [junit4]   2> 826 T594 C73 UPDATE [collection1] webapp=/solr path=/update params={version=2&wt=javabin} {add=[4]} 0 0
   [junit4]   2> 828 T604 C74 UPDATE [collection1] webapp=/solr path=/update params={version=2&wt=javabin} {add=[4]} 0 0
   [junit4]   2> 830 T594 C73 UPDATE [collection1] webapp=/solr path=/update params={version=2&wt=javabin} {add=[5]} 0 0
   [junit4]   2> 831 T614 C75 UPDATE [collection1] webapp=/solr path=/update params={version=2&wt=javabin} {add=[5]} 0 0
   [junit4]   2> 833 T594 C73 UPDATE [collection1] webapp=/solr path=/update params={version=2&wt=javabin} {add=[6]} 0 0
   [junit4]   2> 834 T623 C76 UPDATE [collection1] webapp=/solr path=/update params={version=2&wt=javabin} {add=[6]} 0 0
   [junit4]   2> 836 T594 C73 UPDATE [collection1] webapp=/solr path=/update params={version=2&wt=javabin} {add=[7]} 0 0
   [junit4]   2> 837 T623 C76 UPDATE [collection1] webapp=/solr path=/update params={version=2&wt=javabin} {add=[7]} 0 0
   [junit4]   2> 839 T594 C73 oasu.DirectUpdateHandler2.commit start commit{flags=0,version=0,optimize=false,openSearcher=true,waitSearcher=true,expungeDeletes=false,softCommit=false}
   [junit4]   2> 840 T594 C73 oasc.SolrDeletionPolicy.onCommit SolrDeletionPolicy.onCommit: commits:num=2
   [junit4]   2> 		commit{dir=MockDirWrapper(org.apache.lucene.store.RAMDirectory@2a1323a lockFactory=org.apache.lucene.store.SingleInstanceLockFactory@1bf5f997),segFN=segments_1,generation=1,filenames=[segments_1]
   [junit4]   2> 		commit{dir=MockDirWrapper(org.apache.lucene.store.RAMDirectory@2a1323a lockFactory=org.apache.lucene.store.SingleInstanceLockFactory@1bf5f997),segFN=segments_2,generation=2,filenames=[_0.fdx, segments_2, _0.si, _0_Lucene40_0.frq, _0_nrm.cfs, _0_Lucene40_0.tip, _0_Lucene40_0.tim, _0_nrm.cfe, _0.fdt, _0_Lucene40_0.prx, _0.fnm]
   [junit4]   2> 840 T594 C73 oasc.SolrDeletionPolicy.updateCommits newest commit = 2
   [junit4]   2> 841 T594 C73 oass.SolrIndexSearcher.<init> Opening Searcher@7951a73c main
   [junit4]   2> 841 T594 C73 oass.SolrIndexSearcher.<init> WARNING WARNING: Directory impl does not support setting indexDir: org.apache.lucene.store.MockDirectoryWrapper
   [junit4]   2> 841 T594 C73 oasu.DirectUpdateHandler2.commit end_commit_flush
   [junit4]   2> 841 T601 oasc.SolrCore.registerSearcher [collection1] Registered new searcher Searcher@7951a73c main{StandardDirectoryReader(segments_2:4 _0(5.0):C7)}
   [junit4]   2> 841 T594 C73 UPDATE [collection1] webapp=/solr path=/update params={waitSearcher=true&commit=true&wt=javabin&version=2&softCommit=false} {commit=} 0 2
   [junit4]   2> 843 T604 C74 oasu.DirectUpdateHandler2.commit start commit{flags=0,version=0,optimize=false,openSearcher=true,waitSearcher=true,expungeDeletes=false,softCommit=false}
   [junit4]   2> 844 T604 C74 oasc.SolrDeletionPolicy.onCommit SolrDeletionPolicy.onCommit: commits:num=2
   [junit4]   2> 		commit{dir=MockDirWrapper(org.apache.lucene.store.RAMDirectory@635d2f43 lockFactory=org.apache.lucene.store.SingleInstanceLockFactory@66829f87),segFN=segments_1,generation=1,filenames=[segments_1]
   [junit4]   2> 		commit{dir=MockDirWrapper(org.apache.lucene.store.RAMDirectory@635d2f43 lockFactory=org.apache.lucene.store.SingleInstanceLockFactory@66829f87),segFN=segments_2,generation=2,filenames=[_0.fdx, segments_2, _0.si, _0_Lucene40_0.frq, _0_nrm.cfs, _0_Lucene40_0.tip, _0_Lucene40_0.tim, _0_nrm.cfe, _0.fdt, _0_Lucene40_0.prx, _0.fnm]
   [junit4]   2> 844 T604 C74 oasc.SolrDeletionPolicy.updateCommits newest commit = 2
   [junit4]   2> 845 T604 C74 oass.SolrIndexSearcher.<init> Opening Searcher@437fd2e3 main
   [junit4]   2> 845 T604 C74 oass.SolrIndexSearcher.<init> WARNING WARNING: Directory impl does not support setting indexDir: org.apache.lucene.store.MockDirectoryWrapper
   [junit4]   2> 845 T604 C74 oasu.DirectUpdateHandler2.commit end_commit_flush
   [junit4]   2> 845 T611 oasc.SolrCore.registerSearcher [collection1] Registered new searcher Searcher@437fd2e3 main{StandardDirectoryReader(segments_2:4 _0(5.0):C2)}
   [junit4]   2> 845 T604 C74 UPDATE [collection1] webapp=/solr path=/update params={waitSearcher=true&commit=true&wt=javabin&version=2&softCommit=false} {commit=} 0 2
   [junit4]   2> 847 T614 C75 oasu.DirectUpdateHandler2.commit start commit{flags=0,version=0,optimize=false,openSearcher=true,waitSearcher=true,expungeDeletes=false,softCommit=false}
   [junit4]   2> 848 T614 C75 oasc.SolrDeletionPolicy.onCommit SolrDeletionPolicy.onCommit: commits:num=2
   [junit4]   2> 		commit{dir=MockDirWrapper(org.apache.lucene.store.RAMDirectory@91d12cf lockFactory=org.apache.lucene.store.SingleInstanceLockFactory@54de7e06),segFN=segments_1,generation=1,filenames=[segments_1]
   [junit4]   2> 		commit{dir=MockDirWrapper(org.apache.lucene.store.RAMDirectory@91d12cf lockFactory=org.apache.lucene.store.SingleInstanceLockFactory@54de7e06),segFN=segments_2,generation=2,filenames=[_0.fdx, segments_2, _0.si, _0_Lucene40_0.frq, _0_nrm.cfs, _0_Lucene40_0.tip, _0_Lucene40_0.tim, _0_nrm.cfe, _0.fdt, _0_Lucene40_0.prx, _0.fnm]
   [junit4]   2> 848 T614 C75 oasc.SolrDeletionPolicy.updateCommits newest commit = 2
   [junit4]   2> 848 T614 C75 oass.SolrIndexSearcher.<init> Opening Searcher@11527383 main
   [junit4]   2> 848 T614 C75 oass.SolrIndexSearcher.<init> WARNING WARNING: Directory impl does not support setting indexDir: org.apache.lucene.store.MockDirectoryWrapper
   [junit4]   2> 849 T614 C75 oasu.DirectUpdateHandler2.commit end_commit_flush
   [junit4]   2> 849 T621 oasc.SolrCore.registerSearcher [collection1] Registered new searcher Searcher@11527383 main{StandardDirectoryReader(segments_2:4 _0(5.0):C2)}
   [junit4]   2> 849 T614 C75 UPDATE [collection1] webapp=/solr path=/update params={waitSearcher=true&commit=true&wt=javabin&version=2&softCommit=false} {commit=} 0 2
   [junit4]   2> 851 T623 C76 oasu.DirectUpdateHandler2.commit start commit{flags=0,version=0,optimize=false,openSearcher=true,waitSearcher=true,expungeDeletes=false,softCommit=false}
   [junit4]   2> 855 T623 C76 oasc.SolrDeletionPolicy.onCommit SolrDeletionPolicy.onCommit: commits:num=2
   [junit4]   2> 		commit{dir=MockDirWrapper(org.apache.lucene.store.NIOFSDirectory@/mnt/ssd/jenkins/workspace/Lucene-Solr-trunk-Linux-Java8-64/checkout/solr/build/solr-core/test/J0/index7086870869tmp lockFactory=org.apache.lucene.store.SingleInstanceLockFactory@4f9bbfa2),segFN=segments_1,generation=1,filenames=[segments_1]
   [junit4]   2> 		commit{dir=MockDirWrapper(org.apache.lucene.store.NIOFSDirectory@/mnt/ssd/jenkins/workspace/Lucene-Solr-trunk-Linux-Java8-64/checkout/solr/build/solr-core/test/J0/index7086870869tmp lockFactory=org.apache.lucene.store.SingleInstanceLockFactory@4f9bbfa2),segFN=segments_2,generation=2,filenames=[_0.fdx, segments_2, _0.si, _0_Lucene40_0.frq, _0_nrm.cfs, _0_Lucene40_0.tip, _0_Lucene40_0.tim, _0_nrm.cfe, _0.fdt, _0_Lucene40_0.prx, _0.fnm]
   [junit4]   2> 856 T623 C76 oasc.SolrDeletionPolicy.updateCommits newest commit = 2
   [junit4]   2> 858 T623 C76 oass.SolrIndexSearcher.<init> Opening Searcher@40d920aa main
   [junit4]   2> 858 T623 C76 oass.SolrIndexSearcher.<init> WARNING WARNING: Directory impl does not support setting indexDir: org.apache.lucene.store.MockDirectoryWrapper
   [junit4]   2> 859 T631 oasc.SolrCore.registerSearcher [collection1] Registered new searcher Searcher@40d920aa main{StandardDirectoryReader(segments_2:4 _0(5.0):C3)}
   [junit4]   2> 859 T623 C76 oasu.DirectUpdateHandler2.commit end_commit_flush
   [junit4]   2> 859 T623 C76 UPDATE [collection1] webapp=/solr path=/update params={waitSearcher=true&commit=true&wt=javabin&version=2&softCommit=false} {commit=} 0 8
   [junit4]   2> 862 T594 C73 REQ [collection1] webapp=/solr path=/elevate params={shards.qt=/elevate&sort=id+desc&wt=javabin&version=2&rows=500&fl=id,+score,+[elevated]&distrib=false&qt=/elevate&q=*:*} hits=7 status=0 QTime=1 
   [junit4]   2> 866 T605 C74 REQ [collection1] webapp=/solr path=/elevate params={fsv=true&rows=500&shard.url=localhost:48099/solr&fl=id,score&distrib=false&NOW=1341185020169&shards.qt=/elevate&sort=id+desc&wt=javabin&version=2&isShard=true&start=0&qt=/elevate&q=*:*} hits=2 status=0 QTime=0 
   [junit4]   2> 874 T615 C75 REQ [collection1] webapp=/solr path=/elevate params={fsv=true&rows=500&shard.url=localhost:35698/solr|[::1]:33332/solr&fl=id,score&distrib=false&NOW=1341185020169&shards.qt=/elevate&sort=id+desc&wt=javabin&version=2&isShard=true&start=0&qt=/elevate&q=*:*} hits=2 status=0 QTime=0 
   [junit4]   2> 874 T627 C76 REQ [collection1] webapp=/solr path=/elevate params={fsv=true&rows=500&shard.url=[::1]:33332/solr|localhost:40010/solr&fl=id,score&distrib=false&NOW=1341185020169&shards.qt=/elevate&sort=id+desc&wt=javabin&version=2&isShard=true&start=0&qt=/elevate&q=*:*} hits=3 status=0 QTime=0 
   [junit4]   2> 878 T627 C76 REQ [collection1] webapp=/solr path=/elevate params={ids=6.0,3.0,7.0&rows=500&fl=id,+score,+[elevated]&shard.url=[::1]:33332/solr|localhost:40010/solr&distrib=false&NOW=1341185020169&shards.qt=/elevate&wt=javabin&version=2&isShard=true&qt=/elevate&q=*:*} status=0 QTime=1 
   [junit4]   2> 878 T605 C74 REQ [collection1] webapp=/solr path=/elevate params={ids=1.0,4.0&rows=500&fl=id,+score,+[elevated]&shard.url=localhost:48099/solr&distrib=false&NOW=1341185020169&shards.qt=/elevate&wt=javabin&version=2&isShard=true&qt=/elevate&q=*:*} status=0 QTime=1 
   [junit4]   2> 878 T615 C75 REQ [collection1] webapp=/solr path=/elevate params={ids=2.0,5.0&rows=500&fl=id,+score,+[elevated]&shard.url=localhost:35698/solr|[::1]:33332/solr&distrib=false&NOW=1341185020169&shards.qt=/elevate&wt=javabin&version=2&isShard=true&qt=/elevate&q=*:*} status=0 QTime=1 
   [junit4]   2> 879 T604 C74 REQ [collection1] webapp=/solr path=/elevate params={shards.qt=/elevate&sort=id+desc&wt=javabin&version=2&rows=500&fl=id,+score,+[elevated]&shards=localhost:48099/solr,localhost:35698/solr|[::1]:33332/solr,[::1]:33332/solr|localhost:40010/solr&qt=/elevate&q=*:*} status=0 QTime=15 
   [junit4]   2> 880 T591 oasc.CoreContainer.shutdown Shutting down CoreContainer instance=1031794468
   [junit4]   2> 880 T591 oasc.SolrCore.close [collection1]  CLOSING SolrCore org.apache.solr.core.SolrCore@27c33c23
   [junit4]   2> 881 T591 oasc.SolrCore.closeSearcher [collection1] Closing main searcher on request.
   [junit4]   2> 882 T591 oasu.DirectUpdateHandler2.close closing DirectUpdateHandler2{commits=1,autocommits=0,soft autocommits=0,optimizes=0,rollbacks=0,expungeDeletes=0,docsPending=0,adds=0,deletesById=0,deletesByQuery=0,errors=0,cumulative_adds=7,cumulative_deletesById=0,cumulative_deletesByQuery=1,cumulative_errors=0}
   [junit4]   2> 884 T591 oejsh.ContextHandler.doStop stopped o.e.j.s.ServletContextHandler{/solr,null}
   [junit4]   2> 951 T591 oasc.CoreContainer.shutdown Shutting down CoreContainer instance=581671744
   [junit4]   2> 952 T591 oasc.SolrCore.close [collection1]  CLOSING SolrCore org.apache.solr.core.SolrCore@10d83860
   [junit4]   2> 952 T591 oasc.SolrCore.closeSearcher [collection1] Closing main searcher on request.
   [junit4]   2> 952 T591 oasu.DirectUpdateHandler2.close closing DirectUpdateHandler2{commits=1,autocommits=0,soft autocommits=0,optimizes=0,rollbacks=0,expungeDeletes=0,docsPending=0,adds=0,deletesById=0,deletesByQuery=0,errors=0,cumulative_adds=2,cumulative_deletesById=0,cumulative_deletesByQuery=1,cumulative_errors=0}
   [junit4]   2> 955 T591 oejsh.ContextHandler.doStop stopped o.e.j.s.ServletContextHandler{/solr,null}
   [junit4]   2> 1007 T591 oasc.CoreContainer.shutdown Shutting down CoreContainer instance=2091445729
   [junit4]   2> 1007 T591 oasc.SolrCore.close [collection1]  CLOSING SolrCore org.apache.solr.core.SolrCore@1e4fcd05
   [junit4]   2> 1008 T591 oasc.SolrCore.closeSearcher [collection1] Closing main searcher on request.
   [junit4]   2> 1008 T591 oasu.DirectUpdateHandler2.close closing DirectUpdateHandler2{commits=1,autocommits=0,soft autocommits=0,optimizes=0,rollbacks=0,expungeDeletes=0,docsPending=0,adds=0,deletesById=0,deletesByQuery=0,errors=0,cumulative_adds=2,cumulative_deletesById=0,cumulative_deletesByQuery=1,cumulative_errors=0}
   [junit4]   2> 1010 T591 oejsh.ContextHandler.doStop stopped o.e.j.s.ServletContextHandler{/solr,null}
   [junit4]   2> 1062 T591 oasc.CoreContainer.shutdown Shutting down CoreContainer instance=525458961
   [junit4]   2> 1063 T591 oasc.SolrCore.close [collection1]  CLOSING SolrCore org.apache.solr.core.SolrCore@140efee7
   [junit4]   2> 1063 T591 oasc.SolrCore.closeSearcher [collection1] Closing main searcher on request.
   [junit4]   2> 1064 T591 oasu.DirectUpdateHandler2.close closing DirectUpdateHandler2{commits=1,autocommits=0,soft autocommits=0,optimizes=0,rollbacks=0,expungeDeletes=0,docsPending=0,adds=0,deletesById=0,deletesByQuery=0,errors=0,cumulative_adds=3,cumulative_deletesById=0,cumulative_deletesByQuery=1,cumulative_errors=0}
   [junit4]   2> 1067 T591 oejsh.ContextHandler.doStop stopped o.e.j.s.ServletContextHandler{/solr,null}
   [junit4]   2> 1120 T591 oas.SolrTestCaseJ4.tearDown ###Ending testDistribSearch
   [junit4]   2> NOTE: reproduce with: ant test  -Dtestcase=DistributedQueryElevationComponentTest -Dtests.method=testDistribSearch -Dtests.seed=D0EF2B85675FDCE -Dtests.multiplier=3 -Dtests.slow=true -Dtests.locale=ar_TN -Dtests.timezone=CAT -Dargs="-Dfile.encoding=UTF-8"
   [junit4]   2>
   [junit4]    > (@AfterClass output)
   [junit4]   2> 1156 T591 oas.SolrTestCaseJ4.deleteCore ###deleteCore
   [junit4]   2> NOTE: test params are: codec=Lucene40: {}, sim=RandomSimilarityProvider(queryNorm=true,coord=false): {}, locale=ar_TN, timezone=CAT
   [junit4]   2> NOTE: Linux 2.6.32-41-server amd64/Oracle Corporation 1.8.0-ea (64-bit)/cpus=8,threads=1,free=109666800,total=258080768
   [junit4]   2> NOTE: All tests run in this JVM: [TestCJKWidthFilterFactory, DateMathParserTest, CurrencyFieldTest, TestArabicFilters, TestPHPSerializedResponseWriter, TestPhraseSuggestions, BasicDistributedZkTest, TestReversedWildcardFilterFactory, SuggesterTest, TestMappingCharFilterFactory, AutoCommitTest, QueryElevationComponentTest, TestPropInject, TestPortugueseStemFilterFactory, TestPerFieldSimilarity, TestDelimitedPayloadTokenFilterFactory, IndexBasedSpellCheckerTest, DoubleMetaphoneFilterFactoryTest, TestUpdate, CoreAdminHandlerTest, FastVectorHighlighterTest, LegacyHTMLStripCharFilterTest, TestJmxIntegration, TestExtendedDismaxParser, TestPortugueseMinimalStemFilterFactory, TestQueryUtils, DateFieldTest, TestLatvianStemFilterFactory, TestCSVLoader, RequiredFieldsTest, DirectSolrSpellCheckerTest, LukeRequestHandlerTest, TestSearchPerf, TestStemmerOverrideFilterFactory, TestTypeTokenFilterFactory, CacheHeaderTest, TestGalicianStemFilterFactory, TestFaceting, HighlighterTest, OutputWriterTest, TestMergePolicyConfig, TermsComponentTest, TestSurroundQueryParser, TestGermanStemFilterFactory, TestJoin, SuggesterWFSTTest, TestDistributedSearch, TestHTMLStripCharFilterFactory, TestBM25SimilarityFactory, DirectUpdateHandlerOptimizeTest, TestJapanesePartOfSpeechStopFilterFactory, MinimalSchemaTest, TestPatternReplaceCharFilterFactory, DistributedQueryElevationComponentTest]
   [junit4]   2> 
   [junit4] Completed on J0 in 1.16s, 1 test, 1 error <<< FAILURES!

[...truncated 460 lines...]
BUILD FAILED
/mnt/ssd/jenkins/workspace/Lucene-Solr-trunk-Linux-Java8-64/checkout/build.xml:29: The following error occurred while executing this line:
/mnt/ssd/jenkins/workspace/Lucene-Solr-trunk-Linux-Java8-64/checkout/solr/build.xml:144: The following error occurred while executing this line:
/mnt/ssd/jenkins/workspace/Lucene-Solr-trunk-Linux-Java8-64/checkout/lucene/module-build.xml:62: The following error occurred while executing this line:
/mnt/ssd/jenkins/workspace/Lucene-Solr-trunk-Linux-Java8-64/checkout/lucene/common-build.xml:1047: The following error occurred while executing this line:
/mnt/ssd/jenkins/workspace/Lucene-Solr-trunk-Linux-Java8-64/checkout/lucene/common-build.xml:760: There were test failures: 282 suites, 1022 tests, 2 errors, 5 ignored

Total time: 26 minutes 19 seconds
Build step 'Execute shell' marked build as failure
Archiving artifacts
Recording test results
Email was triggered for: Failure
Sending email for trigger: Failure




Mime
View raw message