lucene-dev mailing list archives

Site index · List index
Message view « Date » · « Thread »
Top « Date » · « Thread »
From Apache Jenkins Server <jenk...@builds.apache.org>
Subject [JENKINS] Lucene-Solr-tests-only-trunk-java7 - Build # 2899 - Failure
Date Sat, 14 Jul 2012 16:31:26 GMT
Build: https://builds.apache.org/job/Lucene-Solr-tests-only-trunk-java7/2899/

1 tests failed.
FAILED:  junit.framework.TestSuite.org.apache.solr.handler.TestReplicationHandler

Error Message:
ERROR: SolrIndexSearcher opens=74 closes=73

Stack Trace:
java.lang.AssertionError: ERROR: SolrIndexSearcher opens=74 closes=73
	at __randomizedtesting.SeedInfo.seed([98875FFEC75C3C33]:0)
	at org.junit.Assert.fail(Assert.java:93)
	at org.apache.solr.SolrTestCaseJ4.endTrackingSearchers(SolrTestCaseJ4.java:217)
	at org.apache.solr.SolrTestCaseJ4.afterClass(SolrTestCaseJ4.java:82)
	at sun.reflect.GeneratedMethodAccessor15.invoke(Unknown Source)
	at sun.reflect.DelegatingMethodAccessorImpl.invoke(DelegatingMethodAccessorImpl.java:43)
	at java.lang.reflect.Method.invoke(Method.java:601)
	at com.carrotsearch.randomizedtesting.RandomizedRunner.invoke(RandomizedRunner.java:1995)
	at com.carrotsearch.randomizedtesting.RandomizedRunner.access$1100(RandomizedRunner.java:132)
	at com.carrotsearch.randomizedtesting.RandomizedRunner$5.evaluate(RandomizedRunner.java:754)
	at com.carrotsearch.randomizedtesting.rules.SystemPropertiesRestoreRule$1.evaluate(SystemPropertiesRestoreRule.java:53)
	at org.apache.lucene.util.AbstractBeforeAfterRule$1.evaluate(AbstractBeforeAfterRule.java:45)
	at org.apache.lucene.util.TestRuleReportUncaughtExceptions$1.evaluate(TestRuleReportUncaughtExceptions.java:68)
	at org.apache.lucene.util.TestRuleStoreClassName$1.evaluate(TestRuleStoreClassName.java:38)
	at org.apache.lucene.util.TestRuleIcuHack$1.evaluate(TestRuleIcuHack.java:51)
	at com.carrotsearch.randomizedtesting.rules.SystemPropertiesInvariantRule$1.evaluate(SystemPropertiesInvariantRule.java:55)
	at org.apache.lucene.util.TestRuleNoInstanceHooksOverrides$1.evaluate(TestRuleNoInstanceHooksOverrides.java:53)
	at org.apache.lucene.util.TestRuleNoStaticHooksShadowing$1.evaluate(TestRuleNoStaticHooksShadowing.java:52)
	at org.apache.lucene.util.TestRuleAssertionsRequired$1.evaluate(TestRuleAssertionsRequired.java:36)
	at org.apache.lucene.util.TestRuleMarkFailure$1.evaluate(TestRuleMarkFailure.java:48)
	at org.apache.lucene.util.TestRuleIgnoreAfterMaxFailures$1.evaluate(TestRuleIgnoreAfterMaxFailures.java:70)
	at org.apache.lucene.util.TestRuleIgnoreTestSuites$1.evaluate(TestRuleIgnoreTestSuites.java:55)
	at com.carrotsearch.randomizedtesting.RandomizedRunner.runSuite(RandomizedRunner.java:605)
	at com.carrotsearch.randomizedtesting.RandomizedRunner.access$400(RandomizedRunner.java:132)
	at com.carrotsearch.randomizedtesting.RandomizedRunner$2.run(RandomizedRunner.java:551)




Build Log:
[...truncated 21659 lines...]
[junit4:junit4]   2> 53 T180 oasc.SolrResourceLoader.<init> new SolrResourceLoader for directory: './org.apache.solr.handler.TestReplicationHandler$SolrInstance-1342282495256/master/collection1/'
[junit4:junit4]   2> 77 T180 oasc.SolrConfig.<init> Using Lucene MatchVersion: LUCENE_50
[junit4:junit4]   2> 123 T180 oasc.SolrConfig.<init> Loaded SolrConfig: solrconfig.xml
[junit4:junit4]   2> 123 T180 oass.IndexSchema.readSchema Reading Solr Schema
[junit4:junit4]   2> 126 T180 oass.IndexSchema.readSchema Schema name=test
[junit4:junit4]   2> 142 T180 oass.IndexSchema.readSchema unique key field: id
[junit4:junit4]   2> 144 T180 oasc.SolrCore.<init> [collection1] Opening new SolrCore at ./org.apache.solr.handler.TestReplicationHandler$SolrInstance-1342282495256/master/collection1/, dataDir=./org.apache.solr.handler.TestReplicationHandler$SolrInstance-1342282495256/master/collection1/data/
[junit4:junit4]   2> 144 T180 oasc.SolrCore.<init> JMX monitoring not detected for core: collection1
[junit4:junit4]   2> 147 T180 oasc.SolrCore.getNewIndexDir WARNING New index directory detected: old=null new=./org.apache.solr.handler.TestReplicationHandler$SolrInstance-1342282495256/master/collection1/data/index/
[junit4:junit4]   2> 147 T180 oasc.SolrCore.initIndex WARNING [collection1] Solr index directory './org.apache.solr.handler.TestReplicationHandler$SolrInstance-1342282495256/master/collection1/data/index' doesn't exist. Creating new index...
[junit4:junit4]   2> 163 T180 oasc.SolrDeletionPolicy.onCommit SolrDeletionPolicy.onCommit: commits:num=1
[junit4:junit4]   2> 		commit{dir=NRTCachingDirectory(org.apache.lucene.store.NIOFSDirectory@/usr/home/hudson/hudson-slave/workspace/Lucene-Solr-tests-only-trunk-java7/checkout/solr/build/solr-core/test/J1/org.apache.solr.handler.TestReplicationHandler$SolrInstance-1342282495256/master/collection1/data/index lockFactory=org.apache.lucene.store.SingleInstanceLockFactory@20e53ccb; maxCacheMB=48.0 maxMergeSizeMB=4.0),segFN=segments_1,generation=1,filenames=[segments_1]
[junit4:junit4]   2> 163 T180 oasc.SolrDeletionPolicy.updateCommits newest commit = 1
[junit4:junit4]   2> 164 T180 oasc.RequestHandlers.initHandlersFromConfig created standard: solr.StandardRequestHandler
[junit4:junit4]   2> 172 T180 oasc.RequestHandlers.initHandlersFromConfig created /replication: solr.ReplicationHandler
[junit4:junit4]   2> 172 T180 oasc.RequestHandlers.initHandlersFromConfig created defaults: solr.StandardRequestHandler
[junit4:junit4]   2> 172 T180 oasc.RequestHandlers.initHandlersFromConfig adding lazy requestHandler: solr.StandardRequestHandler
[junit4:junit4]   2> 172 T180 oasc.RequestHandlers.initHandlersFromConfig created lazy: solr.StandardRequestHandler
[junit4:junit4]   2> 173 T180 oasc.RequestHandlers.initHandlersFromConfig created /update: solr.UpdateRequestHandler
[junit4:junit4]   2> 173 T180 oashl.XMLLoader.init xsltCacheLifetimeSeconds=60
[junit4:junit4]   2> 177 T180 oass.SolrIndexSearcher.<init> Opening Searcher@ba7ab00 main
[junit4:junit4]   2> 177 T180 oasu.CommitTracker.<init> Hard AutoCommit: disabled
[junit4:junit4]   2> 177 T180 oasu.CommitTracker.<init> Soft AutoCommit: disabled
[junit4:junit4]   2> 178 T180 oash.ReplicationHandler.inform Replication enabled for following config files: schema.xml
[junit4:junit4]   2> 179 T180 oash.ReplicationHandler.inform Commits will be reserved for  10000
[junit4:junit4]   2> 179 T180 oasc.CoreContainer.register registering core: collection1
[junit4:junit4]   2> 179 T190 oasc.SolrCore.registerSearcher [collection1] Registered new searcher Searcher@ba7ab00 main{StandardDirectoryReader(segments_1:1)}
[junit4:junit4]   2> 179 T180 oass.SolrDispatchFilter.init user.dir=/usr/home/hudson/hudson-slave/workspace/Lucene-Solr-tests-only-trunk-java7/checkout/solr/build/solr-core/test/J1
[junit4:junit4]   2> 180 T180 oass.SolrDispatchFilter.init SolrDispatchFilter.init() done
[junit4:junit4]   2> 180 T180 oascsi.HttpClientUtil.createClient Creating new http client, config:maxConnections=128&maxConnectionsPerHost=32&followRedirects=false
[junit4:junit4]   2> 190 T180 oejs.Server.doStart jetty-8.1.2.v20120308
[junit4:junit4]   2> 192 T180 oejs.AbstractConnector.doStart Started SocketConnector@0.0.0.0:57765
[junit4:junit4]   2> 192 T180 oasc.SolrResourceLoader.locateSolrHome JNDI not configured for solr (NoInitialContextEx)
[junit4:junit4]   2> 192 T180 oasc.SolrResourceLoader.locateSolrHome using system property solr.solr.home: ./org.apache.solr.handler.TestReplicationHandler$SolrInstance-1342282495443/slave
[junit4:junit4]   2> 192 T180 oasc.SolrResourceLoader.<init> new SolrResourceLoader for deduced Solr Home: './org.apache.solr.handler.TestReplicationHandler$SolrInstance-1342282495443/slave/'
[junit4:junit4]   2> 197 T180 oass.SolrDispatchFilter.init SolrDispatchFilter.init()
[junit4:junit4]   2> 197 T180 oasc.SolrResourceLoader.locateSolrHome JNDI not configured for solr (NoInitialContextEx)
[junit4:junit4]   2> 197 T180 oasc.SolrResourceLoader.locateSolrHome using system property solr.solr.home: ./org.apache.solr.handler.TestReplicationHandler$SolrInstance-1342282495443/slave
[junit4:junit4]   2> 197 T180 oasc.CoreContainer$Initializer.initialize looking for solr.xml: /usr/home/hudson/hudson-slave/workspace/Lucene-Solr-tests-only-trunk-java7/checkout/solr/build/solr-core/test/J1/./org.apache.solr.handler.TestReplicationHandler$SolrInstance-1342282495443/slave/solr.xml
[junit4:junit4]   2> 197 T180 oasc.CoreContainer.<init> New CoreContainer 624700053
[junit4:junit4]   2> 197 T180 oasc.CoreContainer$Initializer.initialize no solr.xml file found - using default
[junit4:junit4]   2> 198 T180 oasc.CoreContainer.load Loading CoreContainer using Solr Home: './org.apache.solr.handler.TestReplicationHandler$SolrInstance-1342282495443/slave/'
[junit4:junit4]   2> 198 T180 oasc.SolrResourceLoader.<init> new SolrResourceLoader for directory: './org.apache.solr.handler.TestReplicationHandler$SolrInstance-1342282495443/slave/'
[junit4:junit4]   2> 205 T180 oasc.CoreContainer.load Registering Log Listener
[junit4:junit4]   2> 217 T180 oashc.HttpShardHandlerFactory.getParameter Setting socketTimeout to: 0
[junit4:junit4]   2> 217 T180 oashc.HttpShardHandlerFactory.getParameter Setting urlScheme to: http://
[junit4:junit4]   2> 217 T180 oashc.HttpShardHandlerFactory.getParameter Setting connTimeout to: 0
[junit4:junit4]   2> 217 T180 oashc.HttpShardHandlerFactory.getParameter Setting maxConnectionsPerHost to: 20
[junit4:junit4]   2> 217 T180 oashc.HttpShardHandlerFactory.getParameter Setting corePoolSize to: 0
[junit4:junit4]   2> 218 T180 oashc.HttpShardHandlerFactory.getParameter Setting maximumPoolSize to: 2147483647
[junit4:junit4]   2> 218 T180 oashc.HttpShardHandlerFactory.getParameter Setting maxThreadIdleTime to: 5
[junit4:junit4]   2> 218 T180 oashc.HttpShardHandlerFactory.getParameter Setting sizeOfQueue to: -1
[junit4:junit4]   2> 218 T180 oashc.HttpShardHandlerFactory.getParameter Setting fairnessPolicy to: false
[junit4:junit4]   2> 218 T180 oascsi.HttpClientUtil.createClient Creating new http client, config:maxConnectionsPerHost=20&maxConnections=10000&socketTimeout=0&connTimeout=0&retry=false
[junit4:junit4]   2> 230 T180 oasc.CoreContainer.create Creating SolrCore 'collection1' using instanceDir: ./org.apache.solr.handler.TestReplicationHandler$SolrInstance-1342282495443/slave/collection1
[junit4:junit4]   2> 230 T180 oasc.SolrResourceLoader.<init> new SolrResourceLoader for directory: './org.apache.solr.handler.TestReplicationHandler$SolrInstance-1342282495443/slave/collection1/'
[junit4:junit4]   2> 259 T180 oasc.SolrConfig.<init> Using Lucene MatchVersion: LUCENE_50
[junit4:junit4]   2> 303 T180 oasc.SolrConfig.<init> Loaded SolrConfig: solrconfig.xml
[junit4:junit4]   2> 303 T180 oass.IndexSchema.readSchema Reading Solr Schema
[junit4:junit4]   2> 306 T180 oass.IndexSchema.readSchema Schema name=test
[junit4:junit4]   2> 321 T180 oass.IndexSchema.readSchema unique key field: id
[junit4:junit4]   2> 323 T180 oasc.SolrCore.<init> [collection1] Opening new SolrCore at ./org.apache.solr.handler.TestReplicationHandler$SolrInstance-1342282495443/slave/collection1/, dataDir=./org.apache.solr.handler.TestReplicationHandler$SolrInstance-1342282495443/slave/collection1/data/
[junit4:junit4]   2> 323 T180 oasc.SolrCore.<init> JMX monitoring not detected for core: collection1
[junit4:junit4]   2> 323 T180 oasc.SolrCore.getNewIndexDir WARNING New index directory detected: old=null new=./org.apache.solr.handler.TestReplicationHandler$SolrInstance-1342282495443/slave/collection1/data/index/
[junit4:junit4]   2> 324 T180 oasc.SolrCore.initIndex WARNING [collection1] Solr index directory './org.apache.solr.handler.TestReplicationHandler$SolrInstance-1342282495443/slave/collection1/data/index' doesn't exist. Creating new index...
[junit4:junit4]   2> 330 T180 oasc.SolrDeletionPolicy.onCommit SolrDeletionPolicy.onCommit: commits:num=1
[junit4:junit4]   2> 		commit{dir=NRTCachingDirectory(org.apache.lucene.store.NIOFSDirectory@/usr/home/hudson/hudson-slave/workspace/Lucene-Solr-tests-only-trunk-java7/checkout/solr/build/solr-core/test/J1/org.apache.solr.handler.TestReplicationHandler$SolrInstance-1342282495443/slave/collection1/data/index lockFactory=org.apache.lucene.store.SingleInstanceLockFactory@6e5fb6c; maxCacheMB=48.0 maxMergeSizeMB=4.0),segFN=segments_1,generation=1,filenames=[segments_1]
[junit4:junit4]   2> 330 T180 oasc.SolrDeletionPolicy.updateCommits newest commit = 1
[junit4:junit4]   2> 331 T180 oasc.RequestHandlers.initHandlersFromConfig created standard: solr.StandardRequestHandler
[junit4:junit4]   2> 331 T180 oasc.RequestHandlers.initHandlersFromConfig created defaults: solr.StandardRequestHandler
[junit4:junit4]   2> 331 T180 oasc.RequestHandlers.initHandlersFromConfig adding lazy requestHandler: solr.StandardRequestHandler
[junit4:junit4]   2> 331 T180 oasc.RequestHandlers.initHandlersFromConfig created lazy: solr.StandardRequestHandler
[junit4:junit4]   2> 332 T180 oasc.RequestHandlers.initHandlersFromConfig created /update: solr.UpdateRequestHandler
[junit4:junit4]   2> 332 T180 oasc.RequestHandlers.initHandlersFromConfig created /replication: solr.ReplicationHandler
[junit4:junit4]   2> 333 T180 oashl.XMLLoader.init xsltCacheLifetimeSeconds=60
[junit4:junit4]   2> 336 T180 oass.SolrIndexSearcher.<init> Opening Searcher@552f128b main
[junit4:junit4]   2> 336 T180 oasu.CommitTracker.<init> Hard AutoCommit: disabled
[junit4:junit4]   2> 336 T180 oasu.CommitTracker.<init> Soft AutoCommit: disabled
[junit4:junit4]   2> 337 T180 oascsi.HttpClientUtil.createClient Creating new http client, config:connTimeout=5000&socketTimeout=20000&allowCompression=false&maxConnections=10000&maxConnectionsPerHost=10000
[junit4:junit4]   2> 347 T180 oash.SnapPuller.startExecutorService Poll Scheduled at an interval of 1000ms
[junit4:junit4]   2> 347 T180 oasc.CoreContainer.register registering core: collection1
[junit4:junit4]   2> 347 T200 oasc.SolrCore.registerSearcher [collection1] Registered new searcher Searcher@552f128b main{StandardDirectoryReader(segments_1:1)}
[junit4:junit4]   2> 347 T180 oass.SolrDispatchFilter.init user.dir=/usr/home/hudson/hudson-slave/workspace/Lucene-Solr-tests-only-trunk-java7/checkout/solr/build/solr-core/test/J1
[junit4:junit4]   2> 348 T180 oass.SolrDispatchFilter.init SolrDispatchFilter.init() done
[junit4:junit4]   2> 348 T180 oascsi.HttpClientUtil.createClient Creating new http client, config:maxConnections=128&maxConnectionsPerHost=32&followRedirects=false
[junit4:junit4]   2> 
[junit4:junit4]    > (@AfterClass output)
[junit4:junit4]   2> 31603 T180 oasc.CoreContainer.shutdown Shutting down CoreContainer instance=1413471959
[junit4:junit4]   2> 31603 T180 oasc.SolrCore.close [collection1]  CLOSING SolrCore org.apache.solr.core.SolrCore@262ef77f
[junit4:junit4]   2> 31603 T180 oasc.SolrCore.closeSearcher [collection1] Closing main searcher on request.
[junit4:junit4]   2> 31604 T180 oasu.DirectUpdateHandler2.close closing DirectUpdateHandler2{commits=1,autocommits=0,soft autocommits=0,optimizes=0,rollbacks=0,expungeDeletes=0,docsPending=0,adds=0,deletesById=0,deletesByQuery=0,errors=0,cumulative_adds=493,cumulative_deletesById=0,cumulative_deletesByQuery=1,cumulative_errors=0}
[junit4:junit4]   2> 31605 T180 oejsh.ContextHandler.doStop stopped o.e.j.s.ServletContextHandler{/solr,null}
[junit4:junit4]   2> 31657 T180 oasc.CoreContainer.shutdown Shutting down CoreContainer instance=524443011
[junit4:junit4]   2> 31657 T180 oasc.SolrCore.close [collection1]  CLOSING SolrCore org.apache.solr.core.SolrCore@47d0617e
[junit4:junit4]   2> 31657 T180 oasc.SolrCore.closeSearcher [collection1] Closing main searcher on request.
[junit4:junit4]   2> 31658 T180 oasu.DirectUpdateHandler2.close closing DirectUpdateHandler2{commits=2,autocommits=0,soft autocommits=0,optimizes=0,rollbacks=0,expungeDeletes=0,docsPending=0,adds=0,deletesById=0,deletesByQuery=0,errors=0,cumulative_adds=1,cumulative_deletesById=0,cumulative_deletesByQuery=0,cumulative_errors=0}
[junit4:junit4]   2> 31659 T180 oejsh.ContextHandler.doStop stopped o.e.j.s.ServletContextHandler{/solr,null}
[junit4:junit4]   2> 31716 T180 oas.SolrTestCaseJ4.deleteCore ###deleteCore
[junit4:junit4]   2> 33746 T381 oash.SnapPuller.fetchLatestIndex SEVERE Master at: http://localhost:39725/solr is not available. Index fetch failed. Exception: org.apache.solr.client.solrj.SolrServerException: IOException occured when talking to server at: http://localhost:39725/solr
[junit4:junit4]   2> 33747 T381 oash.SnapPuller.logReplicationTimeAndConfFiles WARNING Exception while updating statistics java.io.FileNotFoundException: ./org.apache.solr.handler.TestReplicationHandler$SolrInstance-1342282495443/slave/collection1/data/replication.properties (No such file or directory)
[junit4:junit4]   2> 	at java.io.FileOutputStream.open(Native Method)
[junit4:junit4]   2> 	at java.io.FileOutputStream.<init>(FileOutputStream.java:212)
[junit4:junit4]   2> 	at java.io.FileOutputStream.<init>(FileOutputStream.java:165)
[junit4:junit4]   2> 	at org.apache.solr.handler.SnapPuller.logReplicationTimeAndConfFiles(SnapPuller.java:446)
[junit4:junit4]   2> 	at org.apache.solr.handler.SnapPuller.fetchLatestIndex(SnapPuller.java:372)
[junit4:junit4]   2> 	at org.apache.solr.handler.ReplicationHandler.doFetch(ReplicationHandler.java:297)
[junit4:junit4]   2> 	at org.apache.solr.handler.SnapPuller$1.run(SnapPuller.java:172)
[junit4:junit4]   2> 	at java.util.concurrent.Executors$RunnableAdapter.call(Executors.java:471)
[junit4:junit4]   2> 	at java.util.concurrent.FutureTask$Sync.innerRunAndReset(FutureTask.java:351)
[junit4:junit4]   2> 	at java.util.concurrent.FutureTask.runAndReset(FutureTask.java:178)
[junit4:junit4]   2> 	at java.util.concurrent.ScheduledThreadPoolExecutor$ScheduledFutureTask.access$301(ScheduledThreadPoolExecutor.java:178)
[junit4:junit4]   2> 	at java.util.concurrent.ScheduledThreadPoolExecutor$ScheduledFutureTask.run(ScheduledThreadPoolExecutor.java:293)
[junit4:junit4]   2> 	at java.util.concurrent.ThreadPoolExecutor.runWorker(ThreadPoolExecutor.java:1110)
[junit4:junit4]   2> 	at java.util.concurrent.ThreadPoolExecutor$Worker.run(ThreadPoolExecutor.java:603)
[junit4:junit4]   2> 	at java.lang.Thread.run(Thread.java:722)
[junit4:junit4]   2> 
[junit4:junit4]   2> 152837 T180 oas.SolrTestCaseJ4.endTrackingSearchers SEVERE ERROR: SolrIndexSearcher opens=74 closes=73
[junit4:junit4]   2> NOTE: test params are: codec=Appending, sim=DefaultSimilarity, locale=et, timezone=Etc/GMT+11
[junit4:junit4]   2> NOTE: FreeBSD 9.0-RELEASE amd64/Oracle Corporation 1.7.0_04 (64-bit)/cpus=16,threads=1,free=90551544,total=158334976
[junit4:junit4]   2> NOTE: All tests run in this JVM: [TestPatternReplaceFilterFactory, CircularListTest, FieldMutatingUpdateProcessorTest, TestDefaultSimilarityFactory, TestHungarianLightStemFilterFactory, TestIndexSearcher, ZkControllerTest, ReturnFieldsTest, SignatureUpdateProcessorFactoryTest, TestPorterStemFilterFactory, DirectSolrConnectionTest, DocumentBuilderTest, SearchHandlerTest, TestLuceneMatchVersion, PolyFieldTest, ResourceLoaderTest, TestSort, SuggesterFSTTest, TestRangeQuery, TestGreekStemFilterFactory, BasicZkTest, TestUtils, SpellPossibilityIteratorTest, TestElisionFilterFactory, TestLMJelinekMercerSimilarityFactory, TestGalicianMinimalStemFilterFactory, TestFastLRUCache, TestSolrDeletionPolicy1, TestPortugueseLightStemFilterFactory, CloudStateTest, TestOmitPositions, QueryEqualityTest, TestRemoteStreaming, SolrPluginUtilsTest, TestCJKBigramFilterFactory, TestNorwegianMinimalStemFilterFactory, FileBasedSpellCheckerTest, TestKeywordMarkerFilterFactory, TestValueSourceCache, TestReplicationHandler]
[junit4:junit4]   2> NOTE: reproduce with: ant test  -Dtestcase=TestReplicationHandler -Dtests.seed=98875FFEC75C3C33 -Dtests.multiplier=3 -Dtests.slow=true -Dtests.locale=et -Dtests.timezone=Etc/GMT+11 -Dtests.file.encoding=US-ASCII
[junit4:junit4]   2> 
[junit4:junit4] ERROR   0.00s J1 | TestReplicationHandler (suite)
[junit4:junit4]    > Throwable #1: java.lang.AssertionError: ERROR: SolrIndexSearcher opens=74 closes=73
[junit4:junit4]    > 	at __randomizedtesting.SeedInfo.seed([98875FFEC75C3C33]:0)
[junit4:junit4]    > 	at org.junit.Assert.fail(Assert.java:93)
[junit4:junit4]    > 	at org.apache.solr.SolrTestCaseJ4.endTrackingSearchers(SolrTestCaseJ4.java:217)
[junit4:junit4]    > 	at org.apache.solr.SolrTestCaseJ4.afterClass(SolrTestCaseJ4.java:82)
[junit4:junit4]    > 	at sun.reflect.GeneratedMethodAccessor15.invoke(Unknown Source)
[junit4:junit4]    > 	at sun.reflect.DelegatingMethodAccessorImpl.invoke(DelegatingMethodAccessorImpl.java:43)
[junit4:junit4]    > 	at java.lang.reflect.Method.invoke(Method.java:601)
[junit4:junit4]    > 	at com.carrotsearch.randomizedtesting.RandomizedRunner.invoke(RandomizedRunner.java:1995)
[junit4:junit4]    > 	at com.carrotsearch.randomizedtesting.RandomizedRunner.access$1100(RandomizedRunner.java:132)
[junit4:junit4]    > 	at com.carrotsearch.randomizedtesting.RandomizedRunner$5.evaluate(RandomizedRunner.java:754)
[junit4:junit4]    > 	at com.carrotsearch.randomizedtesting.rules.SystemPropertiesRestoreRule$1.evaluate(SystemPropertiesRestoreRule.java:53)
[junit4:junit4]    > 	at org.apache.lucene.util.AbstractBeforeAfterRule$1.evaluate(AbstractBeforeAfterRule.java:45)
[junit4:junit4]    > 	at org.apache.lucene.util.TestRuleReportUncaughtExceptions$1.evaluate(TestRuleReportUncaughtExceptions.java:68)
[junit4:junit4]    > 	at org.apache.lucene.util.TestRuleStoreClassName$1.evaluate(TestRuleStoreClassName.java:38)
[junit4:junit4]    > 	at org.apache.lucene.util.TestRuleIcuHack$1.evaluate(TestRuleIcuHack.java:51)
[junit4:junit4]    > 	at com.carrotsearch.randomizedtesting.rules.SystemPropertiesInvariantRule$1.evaluate(SystemPropertiesInvariantRule.java:55)
[junit4:junit4]    > 	at org.apache.lucene.util.TestRuleNoInstanceHooksOverrides$1.evaluate(TestRuleNoInstanceHooksOverrides.java:53)
[junit4:junit4]    > 	at org.apache.lucene.util.TestRuleNoStaticHooksShadowing$1.evaluate(TestRuleNoStaticHooksShadowing.java:52)
[junit4:junit4]    > 	at org.apache.lucene.util.TestRuleAssertionsRequired$1.evaluate(TestRuleAssertionsRequired.java:36)
[junit4:junit4]    > 	at org.apache.lucene.util.TestRuleMarkFailure$1.evaluate(TestRuleMarkFailure.java:48)
[junit4:junit4]    > 	at org.apache.lucene.util.TestRuleIgnoreAfterMaxFailures$1.evaluate(TestRuleIgnoreAfterMaxFailures.java:70)
[junit4:junit4]    > 	at org.apache.lucene.util.TestRuleIgnoreTestSuites$1.evaluate(TestRuleIgnoreTestSuites.java:55)
[junit4:junit4]    > 	at com.carrotsearch.randomizedtesting.RandomizedRunner.runSuite(RandomizedRunner.java:605)
[junit4:junit4]    > 	at com.carrotsearch.randomizedtesting.RandomizedRunner.access$400(RandomizedRunner.java:132)
[junit4:junit4]    > 	at com.carrotsearch.randomizedtesting.RandomizedRunner$2.run(RandomizedRunner.java:551)
[junit4:junit4]    >
[junit4:junit4] Completed on J1 in 152.91s, 1 test, 1 failure <<< FAILURES!
[...truncated 652 lines...]

[...truncated 22462 lines...]

[...truncated 22462 lines...]

[...truncated 8391 lines...]
check-forbidden-apis:

validate:
     [echo] Building solr...

compile-tools:

ivy-availability-check:

ivy-fail:

ivy-configure:
[ivy:configure] :: loading settings :: file = /usr/home/hudson/hudson-slave/workspace/Lucene-Solr-tests-only-trunk-java7/checkout/lucene/ivy-settings.xml

resolve:

init:

compile-core:

resolve-example:
     [echo] Building solr-example...

ivy-availability-check:

ivy-fail:

ivy-configure:
[ivy:configure] :: loading settings :: file = /usr/home/hudson/hudson-slave/workspace/Lucene-Solr-tests-only-trunk-java7/checkout/lucene/ivy-settings.xml

resolve:
     [echo] Building solr-example-DIH...

ivy-availability-check:

ivy-fail:

ivy-configure:
[ivy:configure] :: loading settings :: file = /usr/home/hudson/hudson-slave/workspace/Lucene-Solr-tests-only-trunk-java7/checkout/lucene/ivy-settings.xml

resolve:

resolve:
     [echo] Building solr-core...

ivy-availability-check:

ivy-fail:

ivy-configure:
[ivy:configure] :: loading settings :: file = /usr/home/hudson/hudson-slave/workspace/Lucene-Solr-tests-only-trunk-java7/checkout/lucene/ivy-settings.xml

resolve:
     [echo] Building solr-solrj...

ivy-availability-check:

ivy-fail:

ivy-configure:
[ivy:configure] :: loading settings :: file = /usr/home/hudson/hudson-slave/workspace/Lucene-Solr-tests-only-trunk-java7/checkout/lucene/ivy-settings.xml

resolve:
     [echo] Building solr-test-framework...

ivy-availability-check:

ivy-fail:

ivy-configure:
[ivy:configure] :: loading settings :: file = /usr/home/hudson/hudson-slave/workspace/Lucene-Solr-tests-only-trunk-java7/checkout/lucene/ivy-settings.xml

resolve:
     [echo] Building solr-analysis-extras...

ivy-availability-check:
[...truncated 4857 lines...]
check-forbidden-apis:

validate:

test:

test-core:

jflex-uptodate-check:

jflex-notice:

javacc-uptodate-check:

javacc-notice:

ivy-availability-check:

ivy-fail:

ivy-configure:
[ivy:configure] :: loading settings :: file = /usr/home/hudson/hudson-slave/workspace/Lucene-Solr-tests-only-trunk-java7/checkout/lucene/ivy-settings.xml

resolve:

init:

-clover.disable:

-clover.setup:

clover:

common.compile-core:
    [javac] Compiling 1 source file to /usr/home/hudson/hudson-slave/workspace/Lucene-Solr-tests-only-trunk-java7/checkout/lucene/build/core/classes/java
    [javac] warning: [options] bootstrap class path not set in conjunction with -source 1.6
    [javac] 1 warning

compile-core:

compile-test-framework:

ivy-availability-check:

ivy-fail:

ivy-configure:
[ivy:configure] :: loading settings :: file = /usr/home/hudson/hudson-slave/workspace/Lucene-Solr-tests-only-trunk-java7/checkout/lucene/ivy-settings.xml

resolve:

init:

compile-lucene-core:

jflex-uptodate-check:

jflex-notice:

javacc-uptodate-check:

javacc-notice:

ivy-availability-check:

ivy-fail:

ivy-configure:
[ivy:configure] :: loading settings :: file = /usr/home/hudson/hudson-slave/workspace/Lucene-Solr-tests-only-trunk-java7/checkout/lucene/ivy-settings.xml

resolve:

init:

-clover.disable:

[...truncated 9062 lines...]

[...truncated 22462 lines...]

[...truncated 21775 lines...]
[junit4:junit4]   2> 152837 T180 oas.SolrTestCaseJ4.endTrackingSearchers SEVERE ERROR: SolrIndexSearcher opens=74 closes=73
[junit4:junit4]   2> NOTE: test params are: codec=Appending, sim=DefaultSimilarity, locale=et, timezone=Etc/GMT+11
[junit4:junit4]   2> NOTE: FreeBSD 9.0-RELEASE amd64/Oracle Corporation 1.7.0_04 (64-bit)/cpus=16,threads=1,free=90551544,total=158334976
[junit4:junit4]   2> NOTE: All tests run in this JVM: [TestPatternReplaceFilterFactory, CircularListTest, FieldMutatingUpdateProcessorTest, TestDefaultSimilarityFactory, TestHungarianLightStemFilterFactory, TestIndexSearcher, ZkControllerTest, ReturnFieldsTest, SignatureUpdateProcessorFactoryTest, TestPorterStemFilterFactory, DirectSolrConnectionTest, DocumentBuilderTest, SearchHandlerTest, TestLuceneMatchVersion, PolyFieldTest, ResourceLoaderTest, TestSort, SuggesterFSTTest, TestRangeQuery, TestGreekStemFilterFactory, BasicZkTest, TestUtils, SpellPossibilityIteratorTest, TestElisionFilterFactory, TestLMJelinekMercerSimilarityFactory, TestGalicianMinimalStemFilterFactory, TestFastLRUCache, TestSolrDeletionPolicy1, TestPortugueseLightStemFilterFactory, CloudStateTest, TestOmitPositions, QueryEqualityTest, TestRemoteStreaming, SolrPluginUtilsTest, TestCJKBigramFilterFactory, TestNorwegianMinimalStemFilterFactory, FileBasedSpellCheckerTest, TestKeywordMarkerFilterFactory, TestValueSourceCache, TestReplicationHandler]
[junit4:junit4]   2> NOTE: reproduce with: ant test  -Dtestcase=TestReplicationHandler -Dtests.seed=98875FFEC75C3C33 -Dtests.multiplier=3 -Dtests.slow=true -Dtests.locale=et -Dtests.timezone=Etc/GMT+11 -Dtests.file.encoding=US-ASCII
[junit4:junit4]   2> 
[junit4:junit4] ERROR   0.00s J1 | TestReplicationHandler (suite)
[junit4:junit4]    > Throwable #1: java.lang.AssertionError: ERROR: SolrIndexSearcher opens=74 closes=73
[junit4:junit4]    > 	at __randomizedtesting.SeedInfo.seed([98875FFEC75C3C33]:0)
[junit4:junit4]    > 	at org.junit.Assert.fail(Assert.java:93)
[junit4:junit4]    > 	at org.apache.solr.SolrTestCaseJ4.endTrackingSearchers(SolrTestCaseJ4.java:217)
[junit4:junit4]    > 	at org.apache.solr.SolrTestCaseJ4.afterClass(SolrTestCaseJ4.java:82)
[junit4:junit4]    > 	at sun.reflect.GeneratedMethodAccessor15.invoke(Unknown Source)
[junit4:junit4]    > 	at sun.reflect.DelegatingMethodAccessorImpl.invoke(DelegatingMethodAccessorImpl.java:43)
[junit4:junit4]    > 	at java.lang.reflect.Method.invoke(Method.java:601)
[junit4:junit4]    > 	at com.carrotsearch.randomizedtesting.RandomizedRunner.invoke(RandomizedRunner.java:1995)
[junit4:junit4]    > 	at com.carrotsearch.randomizedtesting.RandomizedRunner.access$1100(RandomizedRunner.java:132)
[junit4:junit4]    > 	at com.carrotsearch.randomizedtesting.RandomizedRunner$5.evaluate(RandomizedRunner.java:754)
[junit4:junit4]    > 	at com.carrotsearch.randomizedtesting.rules.SystemPropertiesRestoreRule$1.evaluate(SystemPropertiesRestoreRule.java:53)
[junit4:junit4]    > 	at org.apache.lucene.util.AbstractBeforeAfterRule$1.evaluate(AbstractBeforeAfterRule.java:45)
[junit4:junit4]    > 	at org.apache.lucene.util.TestRuleReportUncaughtExceptions$1.evaluate(TestRuleReportUncaughtExceptions.java:68)
[junit4:junit4]    > 	at org.apache.lucene.util.TestRuleStoreClassName$1.evaluate(TestRuleStoreClassName.java:38)
[junit4:junit4]    > 	at org.apache.lucene.util.TestRuleIcuHack$1.evaluate(TestRuleIcuHack.java:51)
[junit4:junit4]    > 	at com.carrotsearch.randomizedtesting.rules.SystemPropertiesInvariantRule$1.evaluate(SystemPropertiesInvariantRule.java:55)
[junit4:junit4]    > 	at org.apache.lucene.util.TestRuleNoInstanceHooksOverrides$1.evaluate(TestRuleNoInstanceHooksOverrides.java:53)
[junit4:junit4]    > 	at org.apache.lucene.util.TestRuleNoStaticHooksShadowing$1.evaluate(TestRuleNoStaticHooksShadowing.java:52)
[junit4:junit4]    > 	at org.apache.lucene.util.TestRuleAssertionsRequired$1.evaluate(TestRuleAssertionsRequired.java:36)
[junit4:junit4]    > 	at org.apache.lucene.util.TestRuleMarkFailure$1.evaluate(TestRuleMarkFailure.java:48)
[junit4:junit4]    > 	at org.apache.lucene.util.TestRuleIgnoreAfterMaxFailures$1.evaluate(TestRuleIgnoreAfterMaxFailures.java:70)
[junit4:junit4]    > 	at org.apache.lucene.util.TestRuleIgnoreTestSuites$1.evaluate(TestRuleIgnoreTestSuites.java:55)
[junit4:junit4]    > 	at com.carrotsearch.randomizedtesting.RandomizedRunner.runSuite(RandomizedRunner.java:605)
[junit4:junit4]    > 	at com.carrotsearch.randomizedtesting.RandomizedRunner.access$400(RandomizedRunner.java:132)
[junit4:junit4]    > 	at com.carrotsearch.randomizedtesting.RandomizedRunner$2.run(RandomizedRunner.java:551)
[junit4:junit4]    >
[junit4:junit4] Completed on J1 in 152.91s, 1 test, 1 failure <<< FAILURES!
[junit4:junit4]  
[junit4:junit4] Suite: org.apache.solr.analysis.TestRussianLightStemFilterFactory
[junit4:junit4] Completed on J1 in 0.01s, 1 test
[junit4:junit4]  
[junit4:junit4] Suite: org.apache.solr.analysis.TestUAX29URLEmailTokenizerFactory
[junit4:junit4] Completed on J1 in 0.06s, 8 tests
[junit4:junit4]  
[junit4:junit4] Suite: org.apache.solr.handler.admin.MBeansHandlerTest
[junit4:junit4] Completed on J1 in 1.05s, 1 test
[junit4:junit4]  
[junit4:junit4] Suite: org.apache.solr.search.SpatialFilterTest
[junit4:junit4] Completed on J0 in 1.97s, 3 tests
[junit4:junit4]  
[junit4:junit4] Suite: org.apache.solr.servlet.NoCacheHeaderTest
[junit4:junit4] Completed on J1 in 0.98s, 3 tests
[junit4:junit4]  
[junit4:junit4] Suite: org.apache.solr.TestPluginEnable
[junit4:junit4] Completed on J1 in 0.21s, 1 test
[junit4:junit4]  
[junit4:junit4] Suite: org.apache.solr.spelling.suggest.SuggesterTSTTest
[junit4:junit4] Completed on J0 in 1.39s, 4 tests
[junit4:junit4]  
[junit4:junit4] Suite: org.apache.solr.core.PluginInfoTest
[junit4:junit4] Completed on J0 in 0.05s, 9 tests
[junit4:junit4]  
[junit4:junit4] Suite: org.apache.solr.cloud.TestMultiCoreConfBootstrap
[junit4:junit4] Completed on J1 in 2.46s, 1 test
[junit4:junit4]  
[junit4:junit4] Suite: org.apache.solr.analysis.TestMultiWordSynonyms
[junit4:junit4] Completed on J1 in 0.01s, 1 test
[junit4:junit4]  
[junit4:junit4] Suite: org.apache.solr.handler.JsonLoaderTest
[junit4:junit4] Completed on J1 in 0.92s, 6 tests
[junit4:junit4]  
[junit4:junit4] Suite: org.apache.solr.AnalysisAfterCoreReloadTest
[junit4:junit4] Completed on J0 in 2.57s, 1 test
[junit4:junit4]  
[junit4:junit4] Suite: org.apache.solr.analysis.TestBrazilianStemFilterFactory
[junit4:junit4] Completed on J0 in 0.01s, 1 test
[junit4:junit4]  
[junit4:junit4] Suite: org.apache.solr.MinimalSchemaTest
[junit4:junit4] Completed on J0 in 0.59s, 3 tests
[junit4:junit4]  
[junit4:junit4] Suite: org.apache.solr.search.TestStressLucene
[junit4:junit4] Completed on J0 in 1.07s, 1 test
[junit4:junit4]  
[junit4:junit4] Suite: org.apache.solr.analysis.TestBulgarianStemFilterFactory
[junit4:junit4] Completed on J0 in 0.02s, 1 test
[junit4:junit4]  
[junit4:junit4] Suite: org.apache.solr.search.TestQueryUtils
[junit4:junit4] Completed on J0 in 1.18s, 1 test
[junit4:junit4]  
[junit4:junit4] Suite: org.apache.solr.internal.csv.ExtendedBufferedReaderTest
[junit4:junit4] Completed on J0 in 0.10s, 8 tests
[junit4:junit4]  
[junit4:junit4] Suite: org.apache.solr.schema.TestBinaryField
[junit4:junit4] Completed on J0 in 0.35s, 1 test
[junit4:junit4]  
[junit4:junit4] Suite: org.apache.solr.analysis.TestGreekLowerCaseFilterFactory
[junit4:junit4] Completed on J0 in 0.03s, 1 test
[junit4:junit4]  
[junit4:junit4] Suite: org.apache.solr.analysis.TestPortugueseMinimalStemFilterFactory
[junit4:junit4] Completed on J0 in 0.03s, 1 test
[junit4:junit4]  
[junit4:junit4] Suite: org.apache.solr.core.TestPropInject
[junit4:junit4] Completed on J0 in 1.50s, 2 tests
[junit4:junit4]  
[junit4:junit4] Suite: org.apache.solr.handler.component.SpellCheckComponentTest
[junit4:junit4] Completed on J1 in 6.13s, 9 tests
[junit4:junit4]  
[junit4:junit4] Suite: org.apache.solr.handler.TestCSVLoader
[junit4:junit4] Completed on J0 in 1.51s, 5 tests
[junit4:junit4]  
[junit4:junit4] Suite: org.apache.solr.analysis.TestDelimitedPayloadTokenFilterFactory
[junit4:junit4] Completed on J0 in 0.03s, 2 tests
[junit4:junit4]  
[junit4:junit4] Suite: org.apache.solr.internal.csv.CSVPrinterTest
[junit4:junit4] Completed on J1 in 0.64s, 6 tests
[junit4:junit4]  
[junit4:junit4] Suite: org.apache.solr.handler.XmlUpdateRequestHandlerTest
[junit4:junit4] Completed on J0 in 0.95s, 3 tests
[junit4:junit4]  
[junit4:junit4] Suite: org.apache.solr.analysis.DoubleMetaphoneFilterFactoryTest
[junit4:junit4] Completed on J0 in 0.02s, 3 tests
[junit4:junit4]  
[junit4:junit4] Suite: org.apache.solr.core.RequestHandlersTest
[junit4:junit4] Completed on J0 in 0.80s, 3 tests
[junit4:junit4]  
[junit4:junit4] Suite: org.apache.solr.update.processor.StatelessScriptUpdateProcessorFactoryTest
[junit4:junit4] Completed on J1 in 1.81s, 7 tests
[junit4:junit4]  
[junit4:junit4] Suite: org.apache.solr.core.TestJmxMonitoredMap
[junit4:junit4] Completed on J1 in 0.14s, 2 tests
[junit4:junit4]  
[junit4:junit4] Suite: org.apache.solr.spelling.SpellingQueryConverterTest
[junit4:junit4] Completed on J1 in 0.04s, 5 tests
[junit4:junit4]  
[junit4:junit4] Suite: org.apache.solr.core.TestXIncludeConfig
[junit4:junit4] Completed on J1 in 0.98s, 1 test
[junit4:junit4]  
[junit4:junit4] Suite: org.apache.solr.analysis.LengthFilterTest
[junit4:junit4] Completed on J1 in 0.01s, 1 test
[junit4:junit4]  
[junit4:junit4] Suite: org.apache.solr.core.SolrCoreTest
[junit4:junit4] Completed on J1 in 6.52s, 6 tests
[junit4:junit4]  
[junit4:junit4] Suite: org.apache.solr.handler.FieldAnalysisRequestHandlerTest
[junit4:junit4] Completed on J1 in 1.11s, 4 tests
[junit4:junit4]  
[junit4:junit4] Suite: org.apache.solr.analysis.TestTurkishLowerCaseFilterFactory
[junit4:junit4] Completed on J1 in 0.01s, 1 test
[junit4:junit4]  
[junit4:junit4] Suite: org.apache.solr.search.TestRecovery
[junit4:junit4] Completed on J1 in 11.00s, 9 tests
[junit4:junit4]  
[junit4:junit4] Suite: org.apache.solr.search.similarities.TestIBSimilarityFactory
[junit4:junit4] Completed on J1 in 0.18s, 2 tests
[junit4:junit4]  
[junit4:junit4] Suite: org.apache.solr.internal.csv.writer.CSVConfigGuesserTest
[junit4:junit4] Completed on J1 in 0.05s, 3 tests
[junit4:junit4]  
[junit4:junit4] Suite: org.apache.solr.handler.admin.LoggingHandlerTest
[junit4:junit4] Completed on J1 in 1.27s, 1 test
[junit4:junit4]  
[junit4:junit4] Suite: org.apache.solr.analysis.TestEnglishMinimalStemFilterFactory
[junit4:junit4] Completed on J1 in 0.01s, 1 test
[junit4:junit4]  
[junit4:junit4] Suite: org.apache.solr.update.PeerSyncTest
[junit4:junit4] Completed on J1 in 4.40s, 1 test
[junit4:junit4]  
[junit4:junit4] Suite: org.apache.solr.util.PrimUtilsTest
[junit4:junit4] Completed on J1 in 0.04s, 2 tests
[junit4:junit4]  
[junit4:junit4] Suite: org.apache.solr.search.TestLRUCache
[junit4:junit4] Completed on J1 in 0.02s, 3 tests
[junit4:junit4]  
[junit4:junit4] Suite: org.apache.solr.handler.component.TermVectorComponentTest
[junit4:junit4] Completed on J1 in 1.22s, 4 tests
[junit4:junit4]  
[junit4:junit4] Suite: org.apache.solr.core.TestPropInjectDefaults
[junit4:junit4] Completed on J1 in 0.77s, 2 tests
[junit4:junit4]  
[junit4:junit4] Suite: org.apache.solr.cloud.BasicDistributedZkTest
[junit4:junit4] Completed on J0 in 285.01s, 1 test
[junit4:junit4]  
[junit4:junit4] Suite: org.apache.solr.TestDistributedGrouping
[junit4:junit4] Completed on J0 in 15.73s, 1 test
[junit4:junit4]  
[junit4:junit4] Suite: org.apache.solr.analysis.TestSpanishLightStemFilterFactory
[junit4:junit4] Completed on J0 in 0.01s, 1 test
[junit4:junit4]  
[junit4:junit4] Suite: org.apache.solr.update.processor.UpdateRequestProcessorFactoryTest
[junit4:junit4] Completed on J0 in 1.41s, 2 tests
[junit4:junit4]  
[junit4:junit4] Suite: org.apache.solr.analysis.TestIrishLowerCaseFilterFactory
[junit4:junit4] Completed on J0 in 0.01s, 1 test
[junit4:junit4]  
[junit4:junit4] Suite: org.apache.solr.analysis.TestFrenchMinimalStemFilterFactory
[junit4:junit4] Completed on J0 in 0.01s, 1 test
[junit4:junit4]  
[junit4:junit4] Suite: org.apache.solr.analysis.TestReversedWildcardFilterFactory
[junit4:junit4] Completed on J0 in 0.59s, 4 tests
[junit4:junit4]  
[junit4:junit4] Suite: org.apache.solr.analysis.TestFrenchLightStemFilterFactory
[junit4:junit4] Completed on J0 in 0.01s, 1 test
[junit4:junit4]  
[junit4:junit4] Suite: org.apache.solr.handler.component.DistributedSpellCheckComponentTest
[junit4:junit4] Completed on J0 in 11.17s, 1 test
[junit4:junit4]  
[junit4:junit4] Suite: org.apache.solr.analysis.TestPhoneticFilterFactory
[junit4:junit4] Completed on J0 in 10.02s, 5 tests
[junit4:junit4]  
[junit4:junit4] Suite: org.apache.solr.cloud.OverseerTest
[junit4:junit4] Completed on J0 in 31.79s, 8 tests
[junit4:junit4]  
[junit4:junit4] Suite: org.apache.solr.search.TestStressRecovery
[junit4:junit4] Completed on J1 in 56.12s, 1 test
[junit4:junit4]  
[junit4:junit4] Suite: org.apache.solr.cloud.FullSolrCloudTest
[junit4:junit4] Completed on J0 in 103.08s, 1 test
[junit4:junit4]  
[junit4:junit4] Suite: org.apache.solr.internal.csv.writer.CSVWriterTest
[junit4:junit4] Completed on J1 in 0.01s, 2 tests
[junit4:junit4]  
[junit4:junit4] Suite: org.apache.solr.analysis.TestIndonesianStemFilterFactory
[junit4:junit4] Completed on J1 in 0.01s, 2 tests
[junit4:junit4]  
[junit4:junit4] Suite: org.apache.solr.analysis.TestCharFilters
[junit4:junit4] Completed on J1 in 0.22s, 2 tests
[junit4:junit4]  
[junit4:junit4] Suite: org.apache.solr.core.TestSolrDeletionPolicy2
[junit4:junit4] Completed on J1 in 0.64s, 1 test
[junit4:junit4]  
[junit4:junit4] Suite: org.apache.solr.cloud.LeaderElectionTest
[junit4:junit4] Completed on J1 in 20.44s, 4 tests
[junit4:junit4]  
[junit4:junit4] Suite: org.apache.solr.cloud.RecoveryZkTest
[junit4:junit4] Completed on J0 in 36.39s, 1 test
[junit4:junit4]  
[junit4:junit4] Suite: org.apache.solr.cloud.CloudStateUpdateTest
[junit4:junit4] Completed on J0 in 9.61s, 1 test
[junit4:junit4]  
[junit4:junit4] Suite: org.apache.solr.search.TestRealTimeGet
[junit4:junit4] Completed on J1 in 15.57s, 4 tests
[junit4:junit4]  
[junit4:junit4] Suite: org.apache.solr.spelling.SpellCheckCollatorTest
[junit4:junit4] Completed on J1 in 2.20s, 7 tests
[junit4:junit4]  
[junit4:junit4] Suite: org.apache.solr.search.TestExtendedDismaxParser
[junit4:junit4] Completed on J1 in 9.17s, 10 tests
[junit4:junit4]  
[junit4:junit4] Suite: org.apache.solr.update.SoftAutoCommitTest
[junit4:junit4] Completed on J1 in 10.13s, 3 tests
[junit4:junit4]  
[junit4:junit4] Suite: org.apache.solr.update.AutoCommitTest
[junit4:junit4] Completed on J1 in 9.51s, 3 tests
[junit4:junit4]  
[junit4:junit4] Suite: org.apache.solr.cloud.ZkSolrClientTest
[junit4:junit4] Completed on J1 in 9.44s, 4 tests
[junit4:junit4]  
[junit4:junit4] Suite: org.apache.solr.spelling.WordBreakSolrSpellCheckerTest
[junit4:junit4] Completed on J1 in 1.82s, 3 tests
[junit4:junit4]  
[junit4:junit4] Suite: org.apache.solr.handler.component.DistributedTermsComponentTest
[junit4:junit4] Completed on J1 in 8.16s, 1 test
[junit4:junit4]  
[junit4:junit4] Suite: org.apache.solr.TestDistributedSearch
[junit4:junit4] Completed on J0 in 94.05s, 1 test
[junit4:junit4]  
[junit4:junit4] Suite: org.apache.solr.handler.component.StatsComponentTest
[junit4:junit4] Completed on J1 in 6.93s, 6 tests
[junit4:junit4]  
[junit4:junit4] Suite: org.apache.solr.core.TestCoreContainer
[junit4:junit4] Completed on J1 in 2.93s, 2 tests
[junit4:junit4]  
[junit4:junit4] Suite: org.apache.solr.handler.admin.LukeRequestHandlerTest
[junit4:junit4] Completed on J1 in 2.92s, 3 tests
[junit4:junit4]  
[junit4:junit4] Suite: org.apache.solr.TestGroupingSearch
[junit4:junit4] Completed on J1 in 24.62s, 12 tests
[junit4:junit4]  
[junit4:junit4] Suite: org.apache.solr.ConvertedLegacyTest
[junit4:junit4] Completed on J1 in 3.07s, 1 test
[junit4:junit4]  
[junit4:junit4] Suite: org.apache.solr.handler.component.QueryElevationComponentTest
[junit4:junit4] Completed on J1 in 4.86s, 7 tests
[junit4:junit4]  
[junit4:junit4] Suite: org.apache.solr.search.function.SortByFunctionTest
[junit4:junit4] Completed on J1 in 1.74s, 2 tests
[junit4:junit4]  
[junit4:junit4] Suite: org.apache.solr.request.TestBinaryResponseWriter
[junit4:junit4] Completed on J1 in 1.36s, 2 tests
[junit4:junit4]  
[junit4:junit4] Suite: org.apache.solr.TestJoin
[junit4:junit4] Completed on J0 in 63.17s, 2 tests
[junit4:junit4]  
[junit4:junit4] Suite: org.apache.solr.core.TestJmxIntegration
[junit4:junit4] IGNORED 0.00s J1 | TestJmxIntegration.testJmxOnCoreReload
[junit4:junit4]    > Cause: Annotated @Ignore(timing problem? https://issues.apache.org/jira/browse/SOLR-2715)
[junit4:junit4] Completed on J1 in 1.88s, 3 tests, 1 skipped
[junit4:junit4]  
[junit4:junit4] Suite: org.apache.solr.SampleTest
[junit4:junit4] Completed on J0 in 0.42s, 2 tests
[junit4:junit4]  
[junit4:junit4] Suite: org.apache.solr.highlight.HighlighterTest
[junit4:junit4] Completed on J1 in 2.89s, 27 tests
[junit4:junit4]  
[junit4:junit4] Suite: org.apache.solr.handler.admin.CoreAdminHandlerTest
[junit4:junit4] Completed on J0 in 2.07s, 1 test
[junit4:junit4]  
[junit4:junit4] Suite: org.apache.solr.TestTrie
[junit4:junit4] Completed on J0 in 1.53s, 8 tests
[junit4:junit4]  
[junit4:junit4] Suite: org.apache.solr.servlet.SolrRequestParserTest
[junit4:junit4] Completed on J0 in 1.46s, 4 tests
[junit4:junit4]  
[junit4:junit4] Suite: org.apache.solr.servlet.CacheHeaderTest
[junit4:junit4] Completed on J0 in 1.18s, 5 tests
[junit4:junit4]  
[junit4:junit4] Suite: org.apache.solr.search.function.TestFunctionQuery
[junit4:junit4] Completed on J1 in 4.81s, 14 tests
[junit4:junit4]  
[junit4:junit4] Suite: org.apache.solr.response.TestCSVResponseWriter
[junit4:junit4] Completed on J0 in 0.94s, 1 test
[junit4:junit4]  
[junit4:junit4] Suite: org.apache.solr.search.TestPseudoReturnFields
[junit4:junit4] Completed on J1 in 1.92s, 13 tests
[junit4:junit4]  
[junit4:junit4] Suite: org.apache.solr.DisMaxRequestHandlerTest
[junit4:junit4] Completed on J0 in 0.92s, 2 tests
[junit4:junit4]  
[junit4:junit4] Suite: org.apache.solr.handler.BinaryUpdateRequestHandlerTest
[junit4:junit4] Completed on J0 in 0.99s, 1 test
[junit4:junit4]  
[junit4:junit4] Suite: org.apache.solr.schema.IndexSchemaTest
[junit4:junit4] Completed on J1 in 1.21s, 3 tests
[junit4:junit4]  
[junit4:junit4] Suite: org.apache.solr.search.QueryParsingTest
[junit4:junit4] Completed on J0 in 0.81s, 4 tests
[junit4:junit4]  
[junit4:junit4] Suite: org.apache.solr.handler.component.TermsComponentTest
[junit4:junit4] Completed on J1 in 1.04s, 13 tests
[junit4:junit4]  
[junit4:junit4] Suite: org.apache.solr.search.function.distance.DistanceFunctionTest
[junit4:junit4] Completed on J0 in 1.14s, 3 tests
[junit4:junit4]  
[junit4:junit4] Suite: org.apache.solr.handler.XsltUpdateRequestHandlerTest
[junit4:junit4] Completed on J1 in 0.92s, 1 test
[junit4:junit4]  
[junit4:junit4] Suite: org.apache.solr.handler.StandardRequestHandlerTest
[junit4:junit4] Completed on J0 in 0.75s, 1 test
[junit4:junit4]  
[junit4:junit4] Suite: org.apache.solr.search.TestQueryTypes
[junit4:junit4] Completed on J1 in 0.83s, 1 test
[junit4:junit4]  
[junit4:junit4] Suite: org.apache.solr.response.TestPHPSerializedResponseWriter
[junit4:junit4] Completed on J0 in 0.71s, 2 tests
[junit4:junit4]  
[junit4:junit4] Suite: org.apache.solr.handler.PingRequestHandlerTest
[junit4:junit4] Completed on J1 in 1.11s, 5 tests
[junit4:junit4]  
[junit4:junit4] Suite: org.apache.solr.spelling.suggest.SuggesterWFSTTest
[junit4:junit4] Completed on J0 in 1.73s, 4 tests
[junit4:junit4]  
[junit4:junit4] Suite: org.apache.solr.search.TestSurroundQueryParser
[junit4:junit4] Completed on J1 in 1.02s, 1 test
[junit4:junit4]  
[junit4:junit4] Suite: org.apache.solr.handler.DocumentAnalysisRequestHandlerTest
[junit4:junit4] Completed on J0 in 1.10s, 4 tests
[junit4:junit4]  
[junit4:junit4] Suite: org.apache.solr.update.DirectUpdateHandlerOptimizeTest
[junit4:junit4] Completed on J1 in 0.96s, 1 test
[junit4:junit4]  
[junit4:junit4] Suite: org.apache.solr.schema.IndexSchemaRuntimeFieldTest
[junit4:junit4] Completed on J0 in 0.96s, 1 test
[junit4:junit4]  
[junit4:junit4] Suite: org.apache.solr.search.TestSolrQueryParser
[junit4:junit4] Completed on J1 in 0.82s, 1 test
[junit4:junit4]  
[junit4:junit4] Suite: org.apache.solr.highlight.FastVectorHighlighterTest
[junit4:junit4] Completed on J0 in 0.86s, 2 tests
[junit4:junit4]  
[junit4:junit4] Suite: org.apache.solr.handler.component.DebugComponentTest
[junit4:junit4] Completed on J1 in 0.90s, 2 tests
[junit4:junit4]  
[junit4:junit4] Suite: org.apache.solr.schema.RequiredFieldsTest
[junit4:junit4] Completed on J1 in 0.76s, 3 tests
[junit4:junit4]  
[junit4:junit4] Suite: org.apache.solr.request.JSONWriterTest
[junit4:junit4] Completed on J0 in 1.26s, 3 tests
[junit4:junit4]  
[junit4:junit4] Suite: org.apache.solr.core.TestArbitraryIndexDir
[junit4:junit4] Completed on J1 in 0.81s, 1 test
[junit4:junit4]  
[junit4:junit4] Suite: org.apache.solr.update.processor.UniqFieldsUpdateProcessorFactoryTest
[junit4:junit4] Completed on J0 in 0.88s, 1 test
[junit4:junit4]  
[junit4:junit4] Suite: org.apache.solr.update.UpdateParamsTest
[junit4:junit4] Completed on J1 in 0.70s, 1 test
[junit4:junit4]  
[junit4:junit4] Suite: org.apache.solr.handler.CSVRequestHandlerTest
[junit4:junit4] Completed on J1 in 0.78s, 1 test
[junit4:junit4]  
[junit4:junit4] Suite: org.apache.solr.spelling.suggest.SuggesterTest
[junit4:junit4] Completed on J0 in 1.32s, 4 tests
[junit4:junit4]  
[junit4:junit4] Suite: org.apache.solr.schema.NotRequiredUniqueKeyTest
[junit4:junit4] Completed on J0 in 0.24s, 1 test
[junit4:junit4]  
[junit4:junit4] Suite: org.apache.solr.search.TestSearchPerf
[junit4:junit4] Completed on J1 in 0.42s, 1 test
[junit4:junit4]  
[junit4:junit4] Suite: org.apache.solr.schema.BadIndexSchemaTest
[junit4:junit4] Completed on J0 in 1.59s, 9 tests
[junit4:junit4]  
[junit4:junit4] Suite: org.apache.solr.core.SolrCoreCheckLockOnStartupTest
[junit4:junit4] Completed on J1 in 1.59s, 2 tests
[junit4:junit4]  
[junit4:junit4] Suite: org.apache.solr.core.AlternateDirectoryTest
[junit4:junit4] Completed on J1 in 0.65s, 1 test
[junit4:junit4]  
[junit4:junit4] Suite: org.apache.solr.request.TestWriterPerf
[junit4:junit4] Completed on J0 in 1.25s, 1 test
[junit4:junit4]  
[junit4:junit4] Suite: org.apache.solr.handler.component.BadComponentTest
[junit4:junit4] Completed on J1 in 0.81s, 1 test
[junit4:junit4]  
[junit4:junit4] Suite: org.apache.solr.update.TestUpdate
[junit4:junit4] Completed on J0 in 1.13s, 1 test
[junit4:junit4]  
[junit4:junit4] Suite: org.apache.solr.highlight.HighlighterConfigTest
[junit4:junit4] Completed on J1 in 0.94s, 1 test
[junit4:junit4]  
[junit4:junit4] Suite: org.apache.solr.core.SOLR749Test
[junit4:junit4] Completed on J0 in 0.88s, 1 test
[junit4:junit4]  
[junit4:junit4] Suite: org.apache.solr.search.TestDocSet
[junit4:junit4] Completed on J0 in 0.68s, 2 tests
[junit4:junit4]  
[junit4:junit4] Suite: org.apache.solr.update.processor.DefaultValueUpdateProcessorTest
[junit4:junit4] Completed on J1 in 0.84s, 1 test
[junit4:junit4]  
[junit4:junit4] Suite: org.apache.solr.schema.TestCollationField
[junit4:junit4] Completed on J1 in 0.83s, 8 tests
[junit4:junit4]  
[junit4:junit4] Suite: org.apache.solr.core.TestQuerySenderListener
[junit4:junit4] Completed on J0 in 0.90s, 3 tests
[junit4:junit4]  
[junit4:junit4] Suite: org.apache.solr.update.SolrIndexConfigTest
[junit4:junit4] Completed on J1 in 0.90s, 2 tests
[junit4:junit4]  
[junit4:junit4] Suite: org.apache.solr.core.TestQuerySenderNoQuery
[junit4:junit4] Completed on J0 in 0.93s, 3 tests
[junit4:junit4]  
[junit4:junit4] Suite: org.apache.solr.core.IndexReaderFactoryTest
[junit4:junit4] Completed on J1 in 0.84s, 1 test
[junit4:junit4]  
[junit4:junit4] Suite: org.apache.solr.schema.NumericFieldsTest
[junit4:junit4] Completed on J0 in 0.65s, 1 test
[junit4:junit4]  
[junit4:junit4] Suite: org.apache.solr.util.TestNumberUtils
[junit4:junit4] Completed on J0 in 0.19s, 1 test
[junit4:junit4]  
[junit4:junit4] Suite: org.apache.solr.analysis.TestBeiderMorseFilterFactory
[junit4:junit4] Completed on J1 in 0.35s, 3 tests
[junit4:junit4]  
[junit4:junit4] Suite: org.apache.solr.analysis.TestJapaneseKatakanaStemFilterFactory
[junit4:junit4] Completed on J0 in 0.02s, 1 test
[junit4:junit4]  
[junit4:junit4] Suite: org.apache.solr.TestSolrCoreProperties
[junit4:junit4] Completed on J0 in 0.27s, 1 test
[junit4:junit4]  
[junit4:junit4] Suite: org.apache.solr.schema.MultiTermTest
[junit4:junit4] Completed on J1 in 0.56s, 3 tests
[junit4:junit4]  
[junit4:junit4] Suite: org.apache.solr.EchoParamsTest
[junit4:junit4] Completed on J1 in 0.23s, 1 test
[junit4:junit4]  
[junit4:junit4] Suite: org.apache.solr.core.TestConfig
[junit4:junit4] Completed on J0 in 0.41s, 7 tests
[junit4:junit4]  
[junit4:junit4] Suite: org.apache.solr.analysis.TestKStemFilterFactory
[junit4:junit4] Completed on J0 in 0.16s, 1 test
[junit4:junit4]  
[junit4:junit4] Suite: org.apache.solr.analysis.TestJapaneseTokenizerFactory
[junit4:junit4] Completed on J1 in 0.41s, 5 tests
[junit4:junit4]  
[junit4:junit4] Suite: org.apache.solr.search.similarities.TestLMDirichletSimilarityFactory
[junit4:junit4] Completed on J0 in 0.20s, 2 tests
[junit4:junit4]  
[junit4:junit4] Suite: org.apache.solr.search.similarities.TestPerFieldSimilarity
[junit4:junit4] Completed on J1 in 0.26s, 7 tests
[junit4:junit4]  
[junit4:junit4] Suite: org.apache.solr.analysis.LegacyHTMLStripCharFilterTest
[junit4:junit4] IGNORED 0.00s J0 | LegacyHTMLStripCharFilterTest.testRandom
[junit4:junit4]    > Cause: Annotated @Ignore(broken offsets: see LUCENE-2208)
[junit4:junit4] Completed on J0 in 0.24s, 13 tests, 1 skipped
[junit4:junit4]  
[junit4:junit4] Suite: org.apache.solr.analysis.TestHyphenationCompoundWordTokenFilterFactory
[junit4:junit4] Completed on J1 in 0.20s, 2 tests
[junit4:junit4]  
[junit4:junit4] Suite: org.apache.solr.analysis.TestJapaneseReadingFormFilterFactory
[junit4:junit4] Completed on J0 in 0.09s, 1 test
[junit4:junit4]  
[junit4:junit4] Suite: org.apache.solr.core.TestCodecSupport
[junit4:junit4] Completed on J1 in 0.23s, 3 tests
[junit4:junit4]  
[junit4:junit4] Suite: org.apache.solr.analysis.TestHTMLStripCharFilterFactory
[junit4:junit4] Completed on J0 in 0.05s, 6 tests
[junit4:junit4]  
[junit4:junit4] Suite: org.apache.solr.util.TimeZoneUtilsTest
[junit4:junit4] Completed on J1 in 0.17s, 5 tests
[junit4:junit4]  
[...truncated 166 lines...]
BUILD FAILED
/usr/home/hudson/hudson-slave/workspace/Lucene-Solr-tests-only-trunk-java7/checkout/build.xml:29: The following error occurred while executing this line:
/usr/home/hudson/hudson-slave/workspace/Lucene-Solr-tests-only-trunk-java7/checkout/solr/build.xml:144: The following error occurred while executing this line:
/usr/home/hudson/hudson-slave/workspace/Lucene-Solr-tests-only-trunk-java7/checkout/lucene/module-build.xml:62: The following error occurred while executing this line:
/usr/home/hudson/hudson-slave/workspace/Lucene-Solr-tests-only-trunk-java7/checkout/lucene/common-build.xml:1093: The following error occurred while executing this line:
/usr/home/hudson/hudson-slave/workspace/Lucene-Solr-tests-only-trunk-java7/checkout/lucene/common-build.xml:788: There were test failures: 294 suites, 1050 tests, 1 suite-level error, 5 ignored

Total time: 33 minutes 9 seconds
Build step 'Execute shell' marked build as failure
Archiving artifacts
Recording test results
Email was triggered for: Failure
Sending email for trigger: Failure



Mime
View raw message