lucene-dev mailing list archives

Site index · List index
Message view « Date » · « Thread »
Top « Date » · « Thread »
From Policeman Jenkins Server <jenk...@sd-datasolutions.de>
Subject [JENKINS] Lucene-Solr-trunk-Linux-Java6-64 - Build # 1365 - Failure!
Date Sun, 22 Jul 2012 11:52:58 GMT
Build: http://jenkins.sd-datasolutions.de/job/Lucene-Solr-trunk-Linux-Java6-64/1365/

1 tests failed.
FAILED:  junit.framework.TestSuite.org.apache.solr.handler.TestReplicationHandler

Error Message:
ERROR: SolrIndexSearcher opens=76 closes=75

Stack Trace:
java.lang.AssertionError: ERROR: SolrIndexSearcher opens=76 closes=75
	at __randomizedtesting.SeedInfo.seed([97751CC63F248CA5]:0)
	at org.junit.Assert.fail(Assert.java:93)
	at org.apache.solr.SolrTestCaseJ4.endTrackingSearchers(SolrTestCaseJ4.java:216)
	at org.apache.solr.SolrTestCaseJ4.afterClass(SolrTestCaseJ4.java:82)
	at sun.reflect.GeneratedMethodAccessor15.invoke(Unknown Source)
	at sun.reflect.DelegatingMethodAccessorImpl.invoke(DelegatingMethodAccessorImpl.java:25)
	at java.lang.reflect.Method.invoke(Method.java:597)
	at com.carrotsearch.randomizedtesting.RandomizedRunner.invoke(RandomizedRunner.java:1995)
	at com.carrotsearch.randomizedtesting.RandomizedRunner.access$1100(RandomizedRunner.java:132)
	at com.carrotsearch.randomizedtesting.RandomizedRunner$5.evaluate(RandomizedRunner.java:754)
	at com.carrotsearch.randomizedtesting.rules.SystemPropertiesRestoreRule$1.evaluate(SystemPropertiesRestoreRule.java:53)
	at org.apache.lucene.util.AbstractBeforeAfterRule$1.evaluate(AbstractBeforeAfterRule.java:45)
	at org.apache.lucene.util.TestRuleReportUncaughtExceptions$1.evaluate(TestRuleReportUncaughtExceptions.java:68)
	at org.apache.lucene.util.TestRuleStoreClassName$1.evaluate(TestRuleStoreClassName.java:38)
	at org.apache.lucene.util.TestRuleIcuHack$1.evaluate(TestRuleIcuHack.java:51)
	at com.carrotsearch.randomizedtesting.rules.SystemPropertiesInvariantRule$1.evaluate(SystemPropertiesInvariantRule.java:55)
	at org.apache.lucene.util.TestRuleNoInstanceHooksOverrides$1.evaluate(TestRuleNoInstanceHooksOverrides.java:53)
	at org.apache.lucene.util.TestRuleNoStaticHooksShadowing$1.evaluate(TestRuleNoStaticHooksShadowing.java:52)
	at org.apache.lucene.util.TestRuleAssertionsRequired$1.evaluate(TestRuleAssertionsRequired.java:36)
	at org.apache.lucene.util.TestRuleMarkFailure$1.evaluate(TestRuleMarkFailure.java:48)
	at org.apache.lucene.util.TestRuleIgnoreAfterMaxFailures$1.evaluate(TestRuleIgnoreAfterMaxFailures.java:70)
	at org.apache.lucene.util.TestRuleIgnoreTestSuites$1.evaluate(TestRuleIgnoreTestSuites.java:55)
	at com.carrotsearch.randomizedtesting.RandomizedRunner.runSuite(RandomizedRunner.java:605)
	at com.carrotsearch.randomizedtesting.RandomizedRunner.access$400(RandomizedRunner.java:132)
	at com.carrotsearch.randomizedtesting.RandomizedRunner$2.run(RandomizedRunner.java:551)




Build Log:
[...truncated 6499 lines...]
[junit4:junit4] Suite: org.apache.solr.handler.TestReplicationHandler
[junit4:junit4]    > (@BeforeClass output)
[junit4:junit4]   2> 1 T1322 oejs.Server.doStart jetty-8.1.2.v20120308
[junit4:junit4]   2> 4 T1322 oejs.AbstractConnector.doStart Started SocketConnector@0.0.0.0:50465
[junit4:junit4]   2> 4 T1322 oasc.SolrResourceLoader.locateSolrHome JNDI not configured
for solr (NoInitialContextEx)
[junit4:junit4]   2> 4 T1322 oasc.SolrResourceLoader.locateSolrHome using system property
solr.solr.home: ./org.apache.solr.handler.TestReplicationHandler$SolrInstance-1342957729520/master
[junit4:junit4]   2> 5 T1322 oasc.SolrResourceLoader.<init> new SolrResourceLoader
for deduced Solr Home: './org.apache.solr.handler.TestReplicationHandler$SolrInstance-1342957729520/master/'
[junit4:junit4]   2> 7 T1322 oass.SolrDispatchFilter.init SolrDispatchFilter.init()
[junit4:junit4]   2> 7 T1322 oasc.SolrResourceLoader.locateSolrHome JNDI not configured
for solr (NoInitialContextEx)
[junit4:junit4]   2> 8 T1322 oasc.SolrResourceLoader.locateSolrHome using system property
solr.solr.home: ./org.apache.solr.handler.TestReplicationHandler$SolrInstance-1342957729520/master
[junit4:junit4]   2> 8 T1322 oasc.CoreContainer$Initializer.initialize looking for solr.xml:
/mnt/ssd/jenkins/workspace/Lucene-Solr-trunk-Linux-Java6-64/checkout/solr/build/solr-core/test/J1/./org.apache.solr.handler.TestReplicationHandler$SolrInstance-1342957729520/master/solr.xml
[junit4:junit4]   2> 8 T1322 oasc.CoreContainer.<init> New CoreContainer 1610611656
[junit4:junit4]   2> 8 T1322 oasc.CoreContainer$Initializer.initialize no solr.xml file
found - using default
[junit4:junit4]   2> 8 T1322 oasc.CoreContainer.load Loading CoreContainer using Solr Home:
'./org.apache.solr.handler.TestReplicationHandler$SolrInstance-1342957729520/master/'
[junit4:junit4]   2> 8 T1322 oasc.SolrResourceLoader.<init> new SolrResourceLoader
for directory: './org.apache.solr.handler.TestReplicationHandler$SolrInstance-1342957729520/master/'
[junit4:junit4]   2> 13 T1322 oasc.CoreContainer.load Registering Log Listener
[junit4:junit4]   2> 20 T1322 oashc.HttpShardHandlerFactory.getParameter Setting socketTimeout
to: 0
[junit4:junit4]   2> 20 T1322 oashc.HttpShardHandlerFactory.getParameter Setting urlScheme
to: http://
[junit4:junit4]   2> 20 T1322 oashc.HttpShardHandlerFactory.getParameter Setting connTimeout
to: 0
[junit4:junit4]   2> 20 T1322 oashc.HttpShardHandlerFactory.getParameter Setting maxConnectionsPerHost
to: 20
[junit4:junit4]   2> 20 T1322 oashc.HttpShardHandlerFactory.getParameter Setting corePoolSize
to: 0
[junit4:junit4]   2> 20 T1322 oashc.HttpShardHandlerFactory.getParameter Setting maximumPoolSize
to: 2147483647
[junit4:junit4]   2> 21 T1322 oashc.HttpShardHandlerFactory.getParameter Setting maxThreadIdleTime
to: 5
[junit4:junit4]   2> 21 T1322 oashc.HttpShardHandlerFactory.getParameter Setting sizeOfQueue
to: -1
[junit4:junit4]   2> 21 T1322 oashc.HttpShardHandlerFactory.getParameter Setting fairnessPolicy
to: false
[junit4:junit4]   2> 21 T1322 oascsi.HttpClientUtil.createClient Creating new http client,
config:maxConnectionsPerHost=20&maxConnections=10000&socketTimeout=0&connTimeout=0&retry=false
[junit4:junit4]   2> 26 T1322 oasc.CoreContainer.create Creating SolrCore 'collection1'
using instanceDir: ./org.apache.solr.handler.TestReplicationHandler$SolrInstance-1342957729520/master/collection1
[junit4:junit4]   2> 26 T1322 oasc.SolrResourceLoader.<init> new SolrResourceLoader
for directory: './org.apache.solr.handler.TestReplicationHandler$SolrInstance-1342957729520/master/collection1/'
[junit4:junit4]   2> 44 T1322 oasc.SolrConfig.<init> Using Lucene MatchVersion: LUCENE_50
[junit4:junit4]   2> 77 T1322 oasc.SolrConfig.<init> Loaded SolrConfig: solrconfig.xml
[junit4:junit4]   2> 77 T1322 oass.IndexSchema.readSchema Reading Solr Schema
[junit4:junit4]   2> 80 T1322 oass.IndexSchema.readSchema Schema name=test
[junit4:junit4]   2> 94 T1322 oass.IndexSchema.readSchema unique key field: id
[junit4:junit4]   2> 96 T1322 oasc.SolrCore.<init> [collection1] Opening new SolrCore
at ./org.apache.solr.handler.TestReplicationHandler$SolrInstance-1342957729520/master/collection1/,
dataDir=./org.apache.solr.handler.TestReplicationHandler$SolrInstance-1342957729520/master/collection1/data/
[junit4:junit4]   2> 96 T1322 oasc.SolrCore.<init> JMX monitoring not detected for
core: collection1
[junit4:junit4]   2> 99 T1322 oasc.SolrCore.getNewIndexDir WARNING New index directory
detected: old=null new=./org.apache.solr.handler.TestReplicationHandler$SolrInstance-1342957729520/master/collection1/data/index/
[junit4:junit4]   2> 99 T1322 oasc.SolrCore.initIndex WARNING [collection1] Solr index
directory './org.apache.solr.handler.TestReplicationHandler$SolrInstance-1342957729520/master/collection1/data/index'
doesn't exist. Creating new index...
[junit4:junit4]   2> 101 T1322 oasc.SolrDeletionPolicy.onCommit SolrDeletionPolicy.onCommit:
commits:num=1
[junit4:junit4]   2> 		commit{dir=/mnt/ssd/jenkins/workspace/Lucene-Solr-trunk-Linux-Java6-64/checkout/solr/build/solr-core/test/J1/org.apache.solr.handler.TestReplicationHandler$SolrInstance-1342957729520/master/collection1/data/index,segFN=segments_1,generation=1,filenames=[segments_1]
[junit4:junit4]   2> 102 T1322 oasc.SolrDeletionPolicy.updateCommits newest commit = 1
[junit4:junit4]   2> 102 T1322 oasc.RequestHandlers.initHandlersFromConfig created standard:
solr.StandardRequestHandler
[junit4:junit4]   2> 102 T1322 oasc.RequestHandlers.initHandlersFromConfig created /replication:
solr.ReplicationHandler
[junit4:junit4]   2> 103 T1322 oasc.RequestHandlers.initHandlersFromConfig created defaults:
solr.StandardRequestHandler
[junit4:junit4]   2> 103 T1322 oasc.RequestHandlers.initHandlersFromConfig adding lazy
requestHandler: solr.StandardRequestHandler
[junit4:junit4]   2> 103 T1322 oasc.RequestHandlers.initHandlersFromConfig created lazy:
solr.StandardRequestHandler
[junit4:junit4]   2> 103 T1322 oasc.RequestHandlers.initHandlersFromConfig created /update:
solr.UpdateRequestHandler
[junit4:junit4]   2> 104 T1322 oashl.XMLLoader.init xsltCacheLifetimeSeconds=60
[junit4:junit4]   2> 106 T1322 oass.SolrIndexSearcher.<init> Opening Searcher@56d14a98
main
[junit4:junit4]   2> 106 T1322 oasu.CommitTracker.<init> Hard AutoCommit: disabled
[junit4:junit4]   2> 106 T1322 oasu.CommitTracker.<init> Soft AutoCommit: disabled
[junit4:junit4]   2> 107 T1322 oash.ReplicationHandler.inform Replication enabled for following
config files: schema.xml
[junit4:junit4]   2> 107 T1322 oash.ReplicationHandler.inform Commits will be reserved
for  10000
[junit4:junit4]   2> 107 T1332 oasc.SolrCore.registerSearcher [collection1] Registered
new searcher Searcher@56d14a98 main{StandardDirectoryReader(segments_1:1)}
[junit4:junit4]   2> 107 T1322 oasc.CoreContainer.register registering core: collection1
[junit4:junit4]   2> 107 T1322 oass.SolrDispatchFilter.init user.dir=/mnt/ssd/jenkins/workspace/Lucene-Solr-trunk-Linux-Java6-64/checkout/solr/build/solr-core/test/J1
[junit4:junit4]   2> 107 T1322 oass.SolrDispatchFilter.init SolrDispatchFilter.init() done
[junit4:junit4]   2> 107 T1322 oascsi.HttpClientUtil.createClient Creating new http client,
config:maxConnections=128&maxConnectionsPerHost=32&followRedirects=false
[junit4:junit4]   2> 110 T1322 oejs.Server.doStart jetty-8.1.2.v20120308
[junit4:junit4]   2> 112 T1322 oejs.AbstractConnector.doStart Started SocketConnector@0.0.0.0:33275
[junit4:junit4]   2> 112 T1322 oasc.SolrResourceLoader.locateSolrHome JNDI not configured
for solr (NoInitialContextEx)
[junit4:junit4]   2> 112 T1322 oasc.SolrResourceLoader.locateSolrHome using system property
solr.solr.home: ./org.apache.solr.handler.TestReplicationHandler$SolrInstance-1342957729629/slave
[junit4:junit4]   2> 112 T1322 oasc.SolrResourceLoader.<init> new SolrResourceLoader
for deduced Solr Home: './org.apache.solr.handler.TestReplicationHandler$SolrInstance-1342957729629/slave/'
[junit4:junit4]   2> 115 T1322 oass.SolrDispatchFilter.init SolrDispatchFilter.init()
[junit4:junit4]   2> 116 T1322 oasc.SolrResourceLoader.locateSolrHome JNDI not configured
for solr (NoInitialContextEx)
[junit4:junit4]   2> 116 T1322 oasc.SolrResourceLoader.locateSolrHome using system property
solr.solr.home: ./org.apache.solr.handler.TestReplicationHandler$SolrInstance-1342957729629/slave
[junit4:junit4]   2> 116 T1322 oasc.CoreContainer$Initializer.initialize looking for solr.xml:
/mnt/ssd/jenkins/workspace/Lucene-Solr-trunk-Linux-Java6-64/checkout/solr/build/solr-core/test/J1/./org.apache.solr.handler.TestReplicationHandler$SolrInstance-1342957729629/slave/solr.xml
[junit4:junit4]   2> 116 T1322 oasc.CoreContainer.<init> New CoreContainer 1251131711
[junit4:junit4]   2> 116 T1322 oasc.CoreContainer$Initializer.initialize no solr.xml file
found - using default
[junit4:junit4]   2> 116 T1322 oasc.CoreContainer.load Loading CoreContainer using Solr
Home: './org.apache.solr.handler.TestReplicationHandler$SolrInstance-1342957729629/slave/'
[junit4:junit4]   2> 117 T1322 oasc.SolrResourceLoader.<init> new SolrResourceLoader
for directory: './org.apache.solr.handler.TestReplicationHandler$SolrInstance-1342957729629/slave/'
[junit4:junit4]   2> 122 T1322 oasc.CoreContainer.load Registering Log Listener
[junit4:junit4]   2> 129 T1322 oashc.HttpShardHandlerFactory.getParameter Setting socketTimeout
to: 0
[junit4:junit4]   2> 129 T1322 oashc.HttpShardHandlerFactory.getParameter Setting urlScheme
to: http://
[junit4:junit4]   2> 129 T1322 oashc.HttpShardHandlerFactory.getParameter Setting connTimeout
to: 0
[junit4:junit4]   2> 129 T1322 oashc.HttpShardHandlerFactory.getParameter Setting maxConnectionsPerHost
to: 20
[junit4:junit4]   2> 129 T1322 oashc.HttpShardHandlerFactory.getParameter Setting corePoolSize
to: 0
[junit4:junit4]   2> 130 T1322 oashc.HttpShardHandlerFactory.getParameter Setting maximumPoolSize
to: 2147483647
[junit4:junit4]   2> 130 T1322 oashc.HttpShardHandlerFactory.getParameter Setting maxThreadIdleTime
to: 5
[junit4:junit4]   2> 130 T1322 oashc.HttpShardHandlerFactory.getParameter Setting sizeOfQueue
to: -1
[junit4:junit4]   2> 130 T1322 oashc.HttpShardHandlerFactory.getParameter Setting fairnessPolicy
to: false
[junit4:junit4]   2> 130 T1322 oascsi.HttpClientUtil.createClient Creating new http client,
config:maxConnectionsPerHost=20&maxConnections=10000&socketTimeout=0&connTimeout=0&retry=false
[junit4:junit4]   2> 134 T1322 oasc.CoreContainer.create Creating SolrCore 'collection1'
using instanceDir: ./org.apache.solr.handler.TestReplicationHandler$SolrInstance-1342957729629/slave/collection1
[junit4:junit4]   2> 135 T1322 oasc.SolrResourceLoader.<init> new SolrResourceLoader
for directory: './org.apache.solr.handler.TestReplicationHandler$SolrInstance-1342957729629/slave/collection1/'
[junit4:junit4]   2> 157 T1322 oasc.SolrConfig.<init> Using Lucene MatchVersion:
LUCENE_50
[junit4:junit4]   2> 189 T1322 oasc.SolrConfig.<init> Loaded SolrConfig: solrconfig.xml
[junit4:junit4]   2> 189 T1322 oass.IndexSchema.readSchema Reading Solr Schema
[junit4:junit4]   2> 191 T1322 oass.IndexSchema.readSchema Schema name=test
[junit4:junit4]   2> 205 T1322 oass.IndexSchema.readSchema unique key field: id
[junit4:junit4]   2> 206 T1322 oasc.SolrCore.<init> [collection1] Opening new SolrCore
at ./org.apache.solr.handler.TestReplicationHandler$SolrInstance-1342957729629/slave/collection1/,
dataDir=./org.apache.solr.handler.TestReplicationHandler$SolrInstance-1342957729629/slave/collection1/data/
[junit4:junit4]   2> 206 T1322 oasc.SolrCore.<init> JMX monitoring not detected for
core: collection1
[junit4:junit4]   2> 206 T1322 oasc.SolrCore.getNewIndexDir WARNING New index directory
detected: old=null new=./org.apache.solr.handler.TestReplicationHandler$SolrInstance-1342957729629/slave/collection1/data/index/
[junit4:junit4]   2> 207 T1322 oasc.SolrCore.initIndex WARNING [collection1] Solr index
directory './org.apache.solr.handler.TestReplicationHandler$SolrInstance-1342957729629/slave/collection1/data/index'
doesn't exist. Creating new index...
[junit4:junit4]   2> 209 T1322 oasc.SolrDeletionPolicy.onCommit SolrDeletionPolicy.onCommit:
commits:num=1
[junit4:junit4]   2> 		commit{dir=/mnt/ssd/jenkins/workspace/Lucene-Solr-trunk-Linux-Java6-64/checkout/solr/build/solr-core/test/J1/org.apache.solr.handler.TestReplicationHandler$SolrInstance-1342957729629/slave/collection1/data/index,segFN=segments_1,generation=1,filenames=[segments_1]
[junit4:junit4]   2> 209 T1322 oasc.SolrDeletionPolicy.updateCommits newest commit = 1
[junit4:junit4]   2> 210 T1322 oasc.RequestHandlers.initHandlersFromConfig created standard:
solr.StandardRequestHandler
[junit4:junit4]   2> 210 T1322 oasc.RequestHandlers.initHandlersFromConfig created defaults:
solr.StandardRequestHandler
[junit4:junit4]   2> 210 T1322 oasc.RequestHandlers.initHandlersFromConfig adding lazy
requestHandler: solr.StandardRequestHandler
[junit4:junit4]   2> 210 T1322 oasc.RequestHandlers.initHandlersFromConfig created lazy:
solr.StandardRequestHandler
[junit4:junit4]   2> 211 T1322 oasc.RequestHandlers.initHandlersFromConfig created /update:
solr.UpdateRequestHandler
[junit4:junit4]   2> 211 T1322 oasc.RequestHandlers.initHandlersFromConfig created /replication:
solr.ReplicationHandler
[junit4:junit4]   2> 211 T1322 oashl.XMLLoader.init xsltCacheLifetimeSeconds=60
[junit4:junit4]   2> 213 T1322 oass.SolrIndexSearcher.<init> Opening Searcher@100e3234
main
[junit4:junit4]   2> 214 T1322 oasu.CommitTracker.<init> Hard AutoCommit: disabled
[junit4:junit4]   2> 214 T1322 oasu.CommitTracker.<init> Soft AutoCommit: disabled
[junit4:junit4]   2> 215 T1322 oash.SnapPuller.startExecutorService Poll Scheduled at an
interval of 1000ms
[junit4:junit4]   2> 215 T1342 oasc.SolrCore.registerSearcher [collection1] Registered
new searcher Searcher@100e3234 main{StandardDirectoryReader(segments_1:1)}
[junit4:junit4]   2> 215 T1322 oasc.CoreContainer.register registering core: collection1
[junit4:junit4]   2> 215 T1322 oass.SolrDispatchFilter.init user.dir=/mnt/ssd/jenkins/workspace/Lucene-Solr-trunk-Linux-Java6-64/checkout/solr/build/solr-core/test/J1
[junit4:junit4]   2> 215 T1322 oass.SolrDispatchFilter.init SolrDispatchFilter.init() done
[junit4:junit4]   2> 215 T1322 oascsi.HttpClientUtil.createClient Creating new http client,
config:maxConnections=128&maxConnectionsPerHost=32&followRedirects=false
[junit4:junit4]   2> 
[junit4:junit4]    > (@AfterClass output)
[junit4:junit4]   2> 27222 T1322 oasc.CoreContainer.shutdown Shutting down CoreContainer
instance=1402538056
[junit4:junit4]   2> 27222 T1322 oasc.SolrCore.close [collection1]  CLOSING SolrCore org.apache.solr.core.SolrCore@743749e8
[junit4:junit4]   2> 27222 T1322 oasc.SolrCore.closeSearcher [collection1] Closing main
searcher on request.
[junit4:junit4]   2> 27222 T1322 oasu.DirectUpdateHandler2.close closing DirectUpdateHandler2{commits=1,autocommits=0,soft
autocommits=0,optimizes=0,rollbacks=0,expungeDeletes=0,docsPending=0,adds=0,deletesById=0,deletesByQuery=0,errors=0,cumulative_adds=493,cumulative_deletesById=0,cumulative_deletesByQuery=1,cumulative_errors=0}
[junit4:junit4]   2> 27224 T1322 oejsh.ContextHandler.doStop stopped o.e.j.s.ServletContextHandler{/solr,null}
[junit4:junit4]   2> 27275 T1322 oasc.CoreContainer.shutdown Shutting down CoreContainer
instance=1543214786
[junit4:junit4]   2> 27275 T1322 oasc.SolrCore.close [collection1]  CLOSING SolrCore org.apache.solr.core.SolrCore@2b03704e
[junit4:junit4]   2> 27275 T1322 oasc.SolrCore.closeSearcher [collection1] Closing main
searcher on request.
[junit4:junit4]   2> 27276 T1322 oasu.DirectUpdateHandler2.close closing DirectUpdateHandler2{commits=2,autocommits=0,soft
autocommits=0,optimizes=0,rollbacks=0,expungeDeletes=0,docsPending=0,adds=0,deletesById=0,deletesByQuery=0,errors=0,cumulative_adds=1,cumulative_deletesById=0,cumulative_deletesByQuery=0,cumulative_errors=0}
[junit4:junit4]   2> 27276 T1322 oejsh.ContextHandler.doStop stopped o.e.j.s.ServletContextHandler{/solr,null}
[junit4:junit4]   2> 27329 T1322 oas.SolrTestCaseJ4.deleteCore ###deleteCore
[junit4:junit4]   2> 148342 T1322 oas.SolrTestCaseJ4.endTrackingSearchers SEVERE ERROR:
SolrIndexSearcher opens=76 closes=75
[junit4:junit4]   2> NOTE: test params are: codec=SimpleText, sim=RandomSimilarityProvider(queryNorm=true,coord=true):
{}, locale=ar_SA, timezone=US/Aleutian
[junit4:junit4]   2> NOTE: Linux 3.2.0-26-generic amd64/Sun Microsystems Inc. 1.6.0_33
(64-bit)/cpus=8,threads=1,free=74185128,total=252182528
[junit4:junit4]   2> NOTE: All tests run in this JVM: [WordBreakSolrSpellCheckerTest, TestGroupingSearch,
TestSolrDeletionPolicy1, TestPorterStemFilterFactory, TestElisionFilterFactory, UpdateParamsTest,
TestNorwegianMinimalStemFilterFactory, URLClassifyProcessorTest, TestTurkishLowerCaseFilterFactory,
SoftAutoCommitTest, TestPortugueseLightStemFilterFactory, TestGermanNormalizationFilterFactory,
JsonLoaderTest, TestQuerySenderNoQuery, TestEnglishMinimalStemFilterFactory, FieldAnalysisRequestHandlerTest,
TestLuceneMatchVersion, TestDocumentBuilder, ReturnFieldsTest, TestStressVersions, TestSolrDeletionPolicy2,
NotRequiredUniqueKeyTest, TestStopFilterFactory, DebugComponentTest, SortByFunctionTest, TestReverseStringFilterFactory,
DistributedTermsComponentTest, TestMultiCoreConfBootstrap, TestGreekStemFilterFactory, SolrCoreTest,
TestPluginEnable, DistanceFunctionTest, TestNGramFilters, SignatureUpdateProcessorFactoryTest,
LengthFilterTest, MBeansHandlerTest, TestPatternReplaceFilterFactory, IndexSchemaTest, TestGermanMinimalStemFilterFactory,
CSVRequestHandlerTest, LeaderElectionTest, FieldMutatingUpdateProcessorTest, TestRussianLightStemFilterFactory,
TestTrie, TestBeiderMorseFilterFactory, IndexReaderFactoryTest, TestMultiWordSynonyms, TestSolrJ,
TermVectorComponentTest, SpellingQueryConverterTest, TestJapaneseReadingFormFilterFactory,
UUIDFieldTest, TestIndexSearcher, TestFastLRUCache, TestJapaneseTokenizerFactory, TestPropInjectDefaults,
BadIndexSchemaTest, SpellPossibilityIteratorTest, TestPseudoReturnFields, TestJmxMonitoredMap,
TestUtils, TestSystemIdResolver, CommonGramsFilterFactoryTest, TestArbitraryIndexDir, TestCoreContainer,
ZkSolrClientTest, TestLMJelinekMercerSimilarityFactory, DocumentAnalysisRequestHandlerTest,
PolyFieldTest, BasicDistributedZkTest, RecoveryZkTest, SpellCheckComponentTest, TestReplicationHandler]
[junit4:junit4]   2> NOTE: reproduce with: ant test  -Dtestcase=TestReplicationHandler
-Dtests.seed=97751CC63F248CA5 -Dtests.multiplier=3 -Dtests.slow=true -Dtests.locale=ar_SA
-Dtests.timezone=US/Aleutian -Dtests.file.encoding=UTF-8
[junit4:junit4]   2> 
[junit4:junit4] ERROR   0.00s J1 | TestReplicationHandler (suite)
[junit4:junit4]    > Throwable #1: java.lang.AssertionError: ERROR: SolrIndexSearcher opens=76
closes=75
[junit4:junit4]    > 	at __randomizedtesting.SeedInfo.seed([97751CC63F248CA5]:0)
[junit4:junit4]    > 	at org.junit.Assert.fail(Assert.java:93)
[junit4:junit4]    > 	at org.apache.solr.SolrTestCaseJ4.endTrackingSearchers(SolrTestCaseJ4.java:216)
[junit4:junit4]    > 	at org.apache.solr.SolrTestCaseJ4.afterClass(SolrTestCaseJ4.java:82)
[junit4:junit4]    > 	at sun.reflect.GeneratedMethodAccessor15.invoke(Unknown Source)
[junit4:junit4]    > 	at sun.reflect.DelegatingMethodAccessorImpl.invoke(DelegatingMethodAccessorImpl.java:25)
[junit4:junit4]    > 	at java.lang.reflect.Method.invoke(Method.java:597)
[junit4:junit4]    > 	at com.carrotsearch.randomizedtesting.RandomizedRunner.invoke(RandomizedRunner.java:1995)
[junit4:junit4]    > 	at com.carrotsearch.randomizedtesting.RandomizedRunner.access$1100(RandomizedRunner.java:132)
[junit4:junit4]    > 	at com.carrotsearch.randomizedtesting.RandomizedRunner$5.evaluate(RandomizedRunner.java:754)
[junit4:junit4]    > 	at com.carrotsearch.randomizedtesting.rules.SystemPropertiesRestoreRule$1.evaluate(SystemPropertiesRestoreRule.java:53)
[junit4:junit4]    > 	at org.apache.lucene.util.AbstractBeforeAfterRule$1.evaluate(AbstractBeforeAfterRule.java:45)
[junit4:junit4]    > 	at org.apache.lucene.util.TestRuleReportUncaughtExceptions$1.evaluate(TestRuleReportUncaughtExceptions.java:68)
[junit4:junit4]    > 	at org.apache.lucene.util.TestRuleStoreClassName$1.evaluate(TestRuleStoreClassName.java:38)
[junit4:junit4]    > 	at org.apache.lucene.util.TestRuleIcuHack$1.evaluate(TestRuleIcuHack.java:51)
[junit4:junit4]    > 	at com.carrotsearch.randomizedtesting.rules.SystemPropertiesInvariantRule$1.evaluate(SystemPropertiesInvariantRule.java:55)
[junit4:junit4]    > 	at org.apache.lucene.util.TestRuleNoInstanceHooksOverrides$1.evaluate(TestRuleNoInstanceHooksOverrides.java:53)
[junit4:junit4]    > 	at org.apache.lucene.util.TestRuleNoStaticHooksShadowing$1.evaluate(TestRuleNoStaticHooksShadowing.java:52)
[junit4:junit4]    > 	at org.apache.lucene.util.TestRuleAssertionsRequired$1.evaluate(TestRuleAssertionsRequired.java:36)
[junit4:junit4]    > 	at org.apache.lucene.util.TestRuleMarkFailure$1.evaluate(TestRuleMarkFailure.java:48)
[junit4:junit4]    > 	at org.apache.lucene.util.TestRuleIgnoreAfterMaxFailures$1.evaluate(TestRuleIgnoreAfterMaxFailures.java:70)
[junit4:junit4]    > 	at org.apache.lucene.util.TestRuleIgnoreTestSuites$1.evaluate(TestRuleIgnoreTestSuites.java:55)
[junit4:junit4]    > 	at com.carrotsearch.randomizedtesting.RandomizedRunner.runSuite(RandomizedRunner.java:605)
[junit4:junit4]    > 	at com.carrotsearch.randomizedtesting.RandomizedRunner.access$400(RandomizedRunner.java:132)
[junit4:junit4]    > 	at com.carrotsearch.randomizedtesting.RandomizedRunner$2.run(RandomizedRunner.java:551)
[junit4:junit4]    >
[junit4:junit4] Completed on J1 in 148.37s, 1 test, 1 failure <<< FAILURES!

[...truncated 396 lines...]
BUILD FAILED
/mnt/ssd/jenkins/workspace/Lucene-Solr-trunk-Linux-Java6-64/checkout/build.xml:29: The following
error occurred while executing this line:
/mnt/ssd/jenkins/workspace/Lucene-Solr-trunk-Linux-Java6-64/checkout/solr/build.xml:144: The
following error occurred while executing this line:
/mnt/ssd/jenkins/workspace/Lucene-Solr-trunk-Linux-Java6-64/checkout/lucene/module-build.xml:62:
The following error occurred while executing this line:
/mnt/ssd/jenkins/workspace/Lucene-Solr-trunk-Linux-Java6-64/checkout/lucene/common-build.xml:1094:
The following error occurred while executing this line:
/mnt/ssd/jenkins/workspace/Lucene-Solr-trunk-Linux-Java6-64/checkout/lucene/common-build.xml:789:
There were test failures: 296 suites, 1052 tests, 1 suite-level error, 5 ignored

Total time: 19 minutes 47 seconds
Build step 'Execute shell' marked build as failure
Archiving artifacts
Recording test results
Email was triggered for: Failure
Sending email for trigger: Failure




Mime
View raw message