lucene-dev mailing list archives

Site index · List index
Message view « Date » · « Thread »
Top « Date » · « Thread »
From Policeman Jenkins Server <jenk...@sd-datasolutions.de>
Subject [JENKINS] Lucene-Solr-trunk-Linux-Java8-64 - Build # 2 - Still Failing!
Date Sun, 01 Jul 2012 21:08:31 GMT
Build: http://jenkins.sd-datasolutions.de/job/Lucene-Solr-trunk-Linux-Java8-64/2/

1 tests failed.
FAILED:  org.apache.solr.schema.PreAnalyzedFieldTest.testParsers

Error Message:
expected:<{"[v":"1","str":"test ąćęłńóśźż","tokens":[{"e":128,"i":22,"p":"DQ4KDQsODg8=","s":123,"t":"one","y":"word"},{"e":8,"i":1,"s":5,"t":"two","y":"word"},{"e":22,"i":1,"s":20,"t":"three","y":"foobar"}]]}>
but was:<{"[tokens":[{"e":128,"i":22,"p":"DQ4KDQsODg8=","s":123,"t":"one","y":"word"},{"e":8,"i":1,"s":5,"t":"two","y":"word"},{"e":22,"i":1,"s":20,"t":"three","y":"foobar"}],"v":"1","str":"test
ąćęłńóśźż"]}>

Stack Trace:
junit.framework.ComparisonFailure: expected:<{"[v":"1","str":"test ąćęłńóśźż","tokens":[{"e":128,"i":22,"p":"DQ4KDQsODg8=","s":123,"t":"one","y":"word"},{"e":8,"i":1,"s":5,"t":"two","y":"word"},{"e":22,"i":1,"s":20,"t":"three","y":"foobar"}]]}>
but was:<{"[tokens":[{"e":128,"i":22,"p":"DQ4KDQsODg8=","s":123,"t":"one","y":"word"},{"e":8,"i":1,"s":5,"t":"two","y":"word"},{"e":22,"i":1,"s":20,"t":"three","y":"foobar"}],"v":"1","str":"test
ąćęłńóśźż"]}>
	at junit.framework.Assert.assertEquals(Assert.java:85)
	at junit.framework.Assert.assertEquals(Assert.java:91)
	at org.apache.solr.schema.PreAnalyzedFieldTest.testParsers(PreAnalyzedFieldTest.java:145)
	at sun.reflect.NativeMethodAccessorImpl.invoke0(Native Method)
	at sun.reflect.NativeMethodAccessorImpl.invoke(NativeMethodAccessorImpl.java:57)
	at sun.reflect.DelegatingMethodAccessorImpl.invoke(DelegatingMethodAccessorImpl.java:43)
	at java.lang.reflect.Method.invoke(Method.java:474)
	at junit.framework.TestCase.runTest(TestCase.java:168)
	at junit.framework.TestCase.runBare(TestCase.java:134)
	at junit.framework.TestResult$1.protect(TestResult.java:110)
	at junit.framework.TestResult.runProtected(TestResult.java:128)
	at junit.framework.TestResult.run(TestResult.java:113)
	at junit.framework.TestCase.run(TestCase.java:124)
	at junit.framework.TestSuite.runTest(TestSuite.java:243)
	at junit.framework.TestSuite.run(TestSuite.java:238)
	at org.junit.internal.runners.JUnit38ClassRunner.run(JUnit38ClassRunner.java:83)
	at com.carrotsearch.ant.tasks.junit4.slave.SlaveMain.execute(SlaveMain.java:145)
	at com.carrotsearch.ant.tasks.junit4.slave.SlaveMain.main(SlaveMain.java:238)
	at com.carrotsearch.ant.tasks.junit4.slave.SlaveMainSafe.main(SlaveMainSafe.java:12)




Build Log:
[...truncated 7594 lines...]
   [junit4] Suite: org.apache.solr.schema.PreAnalyzedFieldTest
   [junit4] FAILURE 0.03s J0 | PreAnalyzedFieldTest.testParsers
   [junit4]    > Throwable #1: junit.framework.ComparisonFailure: expected:<{"[v":"1","str":"test
ąćęłńóśźż","tokens":[{"e":128,"i":22,"p":"DQ4KDQsODg8=","s":123,"t":"one","y":"word"},{"e":8,"i":1,"s":5,"t":"two","y":"word"},{"e":22,"i":1,"s":20,"t":"three","y":"foobar"}]]}>
but was:<{"[tokens":[{"e":128,"i":22,"p":"DQ4KDQsODg8=","s":123,"t":"one","y":"word"},{"e":8,"i":1,"s":5,"t":"two","y":"word"},{"e":22,"i":1,"s":20,"t":"three","y":"foobar"}],"v":"1","str":"test
ąćęłńóśźż"]}>
   [junit4]    > 	at junit.framework.Assert.assertEquals(Assert.java:85)
   [junit4]    > 	at junit.framework.Assert.assertEquals(Assert.java:91)
   [junit4]    > 	at org.apache.solr.schema.PreAnalyzedFieldTest.testParsers(PreAnalyzedFieldTest.java:145)
   [junit4]    > 	at sun.reflect.NativeMethodAccessorImpl.invoke0(Native Method)
   [junit4]    > 	at sun.reflect.NativeMethodAccessorImpl.invoke(NativeMethodAccessorImpl.java:57)
   [junit4]    > 	at sun.reflect.DelegatingMethodAccessorImpl.invoke(DelegatingMethodAccessorImpl.java:43)
   [junit4]    > 	at java.lang.reflect.Method.invoke(Method.java:474)
   [junit4]    > 	at junit.framework.TestCase.runTest(TestCase.java:168)
   [junit4]    > 	at junit.framework.TestCase.runBare(TestCase.java:134)
   [junit4]    > 	at junit.framework.TestResult$1.protect(TestResult.java:110)
   [junit4]    > 	at junit.framework.TestResult.runProtected(TestResult.java:128)
   [junit4]    > 	at junit.framework.TestResult.run(TestResult.java:113)
   [junit4]    > 	at junit.framework.TestCase.run(TestCase.java:124)
   [junit4]    > 	at junit.framework.TestSuite.runTest(TestSuite.java:243)
   [junit4]    > 	at junit.framework.TestSuite.run(TestSuite.java:238)
   [junit4]    > 	at org.junit.internal.runners.JUnit38ClassRunner.run(JUnit38ClassRunner.java:83)
   [junit4]    > 	at com.carrotsearch.ant.tasks.junit4.slave.SlaveMain.execute(SlaveMain.java:145)
   [junit4]    > 	at com.carrotsearch.ant.tasks.junit4.slave.SlaveMain.main(SlaveMain.java:238)
   [junit4]    > 	at com.carrotsearch.ant.tasks.junit4.slave.SlaveMainSafe.main(SlaveMainSafe.java:12)
   [junit4]    >
   [junit4] Completed on J0 in 0.03s, 3 tests, 1 failure <<< FAILURES!

[...truncated 678 lines...]
BUILD FAILED
/mnt/ssd/jenkins/workspace/Lucene-Solr-trunk-Linux-Java8-64/checkout/build.xml:29: The following
error occurred while executing this line:
/mnt/ssd/jenkins/workspace/Lucene-Solr-trunk-Linux-Java8-64/checkout/solr/build.xml:144: The
following error occurred while executing this line:
/mnt/ssd/jenkins/workspace/Lucene-Solr-trunk-Linux-Java8-64/checkout/lucene/module-build.xml:62:
The following error occurred while executing this line:
/mnt/ssd/jenkins/workspace/Lucene-Solr-trunk-Linux-Java8-64/checkout/lucene/common-build.xml:1047:
The following error occurred while executing this line:
/mnt/ssd/jenkins/workspace/Lucene-Solr-trunk-Linux-Java8-64/checkout/lucene/common-build.xml:760:
There were test failures: 282 suites, 1022 tests, 1 failure, 5 ignored

Total time: 19 minutes 17 seconds
Build step 'Execute shell' marked build as failure
Archiving artifacts
Recording test results
Email was triggered for: Failure
Sending email for trigger: Failure




Mime
View raw message