lucene-dev mailing list archives

Site index · List index
Message view « Date » · « Thread »
Top « Date » · « Thread »
From Policeman Jenkins Server <jenk...@sd-datasolutions.de>
Subject [JENKINS] Lucene-Solr-4.x-Linux-Java8-64 - Build # 28 - Still Failing!
Date Sun, 29 Jul 2012 12:48:28 GMT
Build: http://jenkins.sd-datasolutions.de/job/Lucene-Solr-4.x-Linux-Java8-64/28/

1 tests failed.
FAILED:  org.apache.solr.handler.component.SpellCheckComponentTest.testPerDictionary

Error Message:
mismatch: '0'!='2' @ spellcheck/suggestions/bar/startOffset

Stack Trace:
java.lang.RuntimeException: mismatch: '0'!='2' @ spellcheck/suggestions/bar/startOffset
	at __randomizedtesting.SeedInfo.seed([8E8386449A09509D:498D72EC926545D5]:0)
	at org.apache.solr.SolrTestCaseJ4.assertJQ(SolrTestCaseJ4.java:572)
	at org.apache.solr.SolrTestCaseJ4.assertJQ(SolrTestCaseJ4.java:520)
	at org.apache.solr.handler.component.SpellCheckComponentTest.testPerDictionary(SpellCheckComponentTest.java:102)
	at sun.reflect.NativeMethodAccessorImpl.invoke0(Native Method)
	at sun.reflect.NativeMethodAccessorImpl.invoke(NativeMethodAccessorImpl.java:57)
	at sun.reflect.DelegatingMethodAccessorImpl.invoke(DelegatingMethodAccessorImpl.java:43)
	at java.lang.reflect.Method.invoke(Method.java:474)
	at com.carrotsearch.randomizedtesting.RandomizedRunner.invoke(RandomizedRunner.java:1995)
	at com.carrotsearch.randomizedtesting.RandomizedRunner.access$1100(RandomizedRunner.java:132)
	at com.carrotsearch.randomizedtesting.RandomizedRunner$6.evaluate(RandomizedRunner.java:818)
	at com.carrotsearch.randomizedtesting.RandomizedRunner$7.evaluate(RandomizedRunner.java:877)
	at com.carrotsearch.randomizedtesting.RandomizedRunner$8.evaluate(RandomizedRunner.java:891)
	at com.carrotsearch.randomizedtesting.rules.SystemPropertiesRestoreRule$1.evaluate(SystemPropertiesRestoreRule.java:53)
	at org.apache.lucene.util.TestRuleSetupTeardownChained$1.evaluate(TestRuleSetupTeardownChained.java:50)
	at org.apache.lucene.util.TestRuleFieldCacheSanity$1.evaluate(TestRuleFieldCacheSanity.java:32)
	at org.apache.lucene.util.AbstractBeforeAfterRule$1.evaluate(AbstractBeforeAfterRule.java:45)
	at com.carrotsearch.randomizedtesting.rules.SystemPropertiesInvariantRule$1.evaluate(SystemPropertiesInvariantRule.java:55)
	at org.apache.lucene.util.TestRuleReportUncaughtExceptions$1.evaluate(TestRuleReportUncaughtExceptions.java:68)
	at org.apache.lucene.util.TestRuleThreadAndTestName$1.evaluate(TestRuleThreadAndTestName.java:48)
	at org.apache.lucene.util.TestRuleIgnoreAfterMaxFailures$1.evaluate(TestRuleIgnoreAfterMaxFailures.java:70)
	at org.apache.lucene.util.TestRuleMarkFailure$1.evaluate(TestRuleMarkFailure.java:48)
	at com.carrotsearch.randomizedtesting.RandomizedRunner.runSingleTest(RandomizedRunner.java:825)
	at com.carrotsearch.randomizedtesting.RandomizedRunner.access$700(RandomizedRunner.java:132)
	at com.carrotsearch.randomizedtesting.RandomizedRunner$3$1.run(RandomizedRunner.java:671)
	at com.carrotsearch.randomizedtesting.RandomizedRunner$3.evaluate(RandomizedRunner.java:697)
	at com.carrotsearch.randomizedtesting.RandomizedRunner$4.evaluate(RandomizedRunner.java:736)
	at com.carrotsearch.randomizedtesting.RandomizedRunner$5.evaluate(RandomizedRunner.java:747)
	at com.carrotsearch.randomizedtesting.rules.SystemPropertiesRestoreRule$1.evaluate(SystemPropertiesRestoreRule.java:53)
	at org.apache.lucene.util.AbstractBeforeAfterRule$1.evaluate(AbstractBeforeAfterRule.java:45)
	at org.apache.lucene.util.TestRuleReportUncaughtExceptions$1.evaluate(TestRuleReportUncaughtExceptions.java:68)
	at org.apache.lucene.util.TestRuleStoreClassName$1.evaluate(TestRuleStoreClassName.java:38)
	at com.carrotsearch.randomizedtesting.rules.SystemPropertiesInvariantRule$1.evaluate(SystemPropertiesInvariantRule.java:55)
	at org.apache.lucene.util.TestRuleNoInstanceHooksOverrides$1.evaluate(TestRuleNoInstanceHooksOverrides.java:53)
	at org.apache.lucene.util.TestRuleNoStaticHooksShadowing$1.evaluate(TestRuleNoStaticHooksShadowing.java:52)
	at org.apache.lucene.util.TestRuleAssertionsRequired$1.evaluate(TestRuleAssertionsRequired.java:36)
	at org.apache.lucene.util.TestRuleMarkFailure$1.evaluate(TestRuleMarkFailure.java:48)
	at org.apache.lucene.util.TestRuleIgnoreAfterMaxFailures$1.evaluate(TestRuleIgnoreAfterMaxFailures.java:70)
	at org.apache.lucene.util.TestRuleIgnoreTestSuites$1.evaluate(TestRuleIgnoreTestSuites.java:55)
	at com.carrotsearch.randomizedtesting.RandomizedRunner.runSuite(RandomizedRunner.java:605)
	at com.carrotsearch.randomizedtesting.RandomizedRunner.access$400(RandomizedRunner.java:132)
	at com.carrotsearch.randomizedtesting.RandomizedRunner$2.run(RandomizedRunner.java:551)




Build Log:
[...truncated 7280 lines...]
[junit4:junit4] Suite: org.apache.solr.handler.component.SpellCheckComponentTest
[junit4:junit4]    > (@BeforeClass output)
[junit4:junit4]   2> 0 T165 oas.SolrTestCaseJ4.initCore ####initCore
[junit4:junit4]   2> Creating dataDir: /mnt/ssd/jenkins/workspace/Lucene-Solr-4.x-Linux-Java8-64/checkout/solr/build/solr-core/test/J1/./solrtest-SpellCheckComponentTest-1343565715864
[junit4:junit4]   2> 1 T165 oasc.SolrResourceLoader.<init> new SolrResourceLoader
for directory: '/mnt/ssd/jenkins/workspace/Lucene-Solr-4.x-Linux-Java8-64/checkout/solr/build/solr-core/test-files/solr/collection1/'
[junit4:junit4]   2> 1 T165 oasc.SolrResourceLoader.replaceClassLoader Adding 'file:/mnt/ssd/jenkins/workspace/Lucene-Solr-4.x-Linux-Java8-64/checkout/solr/build/solr-core/test-files/solr/collection1/lib/README'
to classloader
[junit4:junit4]   2> 1 T165 oasc.SolrResourceLoader.replaceClassLoader Adding 'file:/mnt/ssd/jenkins/workspace/Lucene-Solr-4.x-Linux-Java8-64/checkout/solr/build/solr-core/test-files/solr/collection1/lib/classes/'
to classloader
[junit4:junit4]   2> 24 T165 oasc.SolrConfig.<init> Using Lucene MatchVersion: LUCENE_40
[junit4:junit4]   2> 48 T165 oasc.SolrConfig.<init> Loaded SolrConfig: solrconfig-spellcheckcomponent.xml
[junit4:junit4]   2> 48 T165 oass.IndexSchema.readSchema Reading Solr Schema
[junit4:junit4]   2> 52 T165 oass.IndexSchema.readSchema Schema name=test
[junit4:junit4]   2> 315 T165 oass.OpenExchangeRatesOrgProvider.init Initialized with rates=open-exchange-rates.json,
refreshInterval=1440.
[junit4:junit4]   2> 320 T165 oass.IndexSchema.readSchema default search field in schema
is text
[junit4:junit4]   2> 322 T165 oass.IndexSchema.readSchema unique key field: id
[junit4:junit4]   2> 326 T165 oass.FileExchangeRateProvider.reload Reloading exchange rates
from file currency.xml
[junit4:junit4]   2> 328 T165 oass.FileExchangeRateProvider.reload Reloading exchange rates
from file currency.xml
[junit4:junit4]   2> 329 T165 oass.OpenExchangeRatesOrgProvider.reload Reloading exchange
rates from open-exchange-rates.json
[junit4:junit4]   2> 330 T165 oass.OpenExchangeRatesOrgProvider.reload Reloading exchange
rates from open-exchange-rates.json
[junit4:junit4]   2> 330 T165 oasc.SolrResourceLoader.locateSolrHome JNDI not configured
for solr (NoInitialContextEx)
[junit4:junit4]   2> 330 T165 oasc.SolrResourceLoader.locateSolrHome using system property
solr.solr.home: /mnt/ssd/jenkins/workspace/Lucene-Solr-4.x-Linux-Java8-64/checkout/solr/build/solr-core/test-files/solr
[junit4:junit4]   2> 330 T165 oasc.SolrResourceLoader.<init> new SolrResourceLoader
for directory: '/mnt/ssd/jenkins/workspace/Lucene-Solr-4.x-Linux-Java8-64/checkout/solr/build/solr-core/test-files/solr/'
[junit4:junit4]   2> 334 T165 oasc.CoreContainer.<init> New CoreContainer 740264689
[junit4:junit4]   2> 334 T165 oasc.SolrCore.<init> [collection1] Opening new SolrCore
at /mnt/ssd/jenkins/workspace/Lucene-Solr-4.x-Linux-Java8-64/checkout/solr/build/solr-core/test-files/solr/collection1/,
dataDir=/mnt/ssd/jenkins/workspace/Lucene-Solr-4.x-Linux-Java8-64/checkout/solr/build/solr-core/test/J1/./solrtest-SpellCheckComponentTest-1343565715864/
[junit4:junit4]   2> 334 T165 oasc.SolrCore.<init> JMX monitoring not detected for
core: collection1
[junit4:junit4]   2> 334 T165 oasc.SolrCore.getNewIndexDir WARNING New index directory
detected: old=null new=/mnt/ssd/jenkins/workspace/Lucene-Solr-4.x-Linux-Java8-64/checkout/solr/build/solr-core/test/J1/./solrtest-SpellCheckComponentTest-1343565715864/index/
[junit4:junit4]   2> 335 T165 oasc.SolrCore.initIndex WARNING [collection1] Solr index
directory '/mnt/ssd/jenkins/workspace/Lucene-Solr-4.x-Linux-Java8-64/checkout/solr/build/solr-core/test/J1/./solrtest-SpellCheckComponentTest-1343565715864/index'
doesn't exist. Creating new index...
[junit4:junit4]   2> 336 T165 oasc.SolrDeletionPolicy.onCommit SolrDeletionPolicy.onCommit:
commits:num=1
[junit4:junit4]   2> 		commit{dir=MockDirWrapper(org.apache.lucene.store.RAMDirectory@6bb4ab2b
lockFactory=org.apache.lucene.store.NativeFSLockFactory@27f9ba87),segFN=segments_1,generation=1,filenames=[segments_1]
[junit4:junit4]   2> 336 T165 oasc.SolrDeletionPolicy.updateCommits newest commit = 1
[junit4:junit4]   2> 336 T165 oasc.RequestHandlers.initHandlersFromConfig created standard:
solr.StandardRequestHandler
[junit4:junit4]   2> 337 T165 oasc.RequestHandlers.initHandlersFromConfig created spellCheckCompRH:
org.apache.solr.handler.component.SearchHandler
[junit4:junit4]   2> 337 T165 oasc.RequestHandlers.initHandlersFromConfig created spellCheckCompRH1:
org.apache.solr.handler.component.SearchHandler
[junit4:junit4]   2> 337 T165 oasc.RequestHandlers.initHandlersFromConfig created spellCheckWithWordbreak:
org.apache.solr.handler.component.SearchHandler
[junit4:junit4]   2> 338 T165 oass.SolrIndexSearcher.<init> Opening Searcher@35f25f88
main
[junit4:junit4]   2> 339 T165 oass.SolrIndexSearcher.getIndexDir WARNING WARNING: Directory
impl does not support setting indexDir: org.apache.lucene.store.MockDirectoryWrapper
[junit4:junit4]   2> 339 T165 oasu.CommitTracker.<init> Hard AutoCommit: disabled
[junit4:junit4]   2> 339 T165 oasu.CommitTracker.<init> Soft AutoCommit: disabled
[junit4:junit4]   2> 339 T165 oashc.SpellCheckComponent.inform Initializing spell checkers
[junit4:junit4]   2> 342 T165 oashc.SpellCheckComponent.inform Registering newSearcher
listener for spellchecker: default
[junit4:junit4]   2> 344 T165 oashc.SpellCheckComponent.inform Registering newSearcher
listener for spellchecker: default_teststop
[junit4:junit4]   2> 347 T165 oass.DirectSolrSpellChecker.init init: {name=direct,classname=solr.DirectSolrSpellChecker,minQueryLength=3,maxQueryFrequency=100.0,field=teststop}
[junit4:junit4]   2> 347 T165 oass.DirectSolrSpellChecker.init init: {name=direct_lowerfilt,classname=solr.DirectSolrSpellChecker,minQueryLength=3,maxQueryFrequency=100.0,field=lowerfilt}
[junit4:junit4]   2> 351 T165 oashc.SpellCheckComponent.inform Registering newSearcher
listener for spellchecker: threshold
[junit4:junit4]   2> 351 T165 oass.DirectSolrSpellChecker.init init: {name=threshold_direct,classname=solr.DirectSolrSpellChecker,field=lowerfilt,spellcheckIndexDir=spellcheckerThreshold,buildOnCommit=true,thresholdTokenFrequency=0.29}
[junit4:junit4]   2> 351 T165 oashc.SpellCheckComponent.inform Registering newSearcher
listener for spellchecker: threshold_direct
[junit4:junit4]   2> 354 T165 oashc.SpellCheckComponent.inform Registering newSearcher
listener for spellchecker: multipleFields
[junit4:junit4]   2> 364 T165 oashc.SpellCheckComponent.inform Registering newSearcher
listener for spellchecker: freq
[junit4:junit4]   2> 367 T165 oashc.SpellCheckComponent.inform Registering newSearcher
listener for spellchecker: fqcn
[junit4:junit4]   2> 367 T165 oashc.HttpShardHandlerFactory.getParameter Setting socketTimeout
to: 0
[junit4:junit4]   2> 368 T165 oashc.HttpShardHandlerFactory.getParameter Setting urlScheme
to: http://
[junit4:junit4]   2> 368 T165 oashc.HttpShardHandlerFactory.getParameter Setting connTimeout
to: 0
[junit4:junit4]   2> 368 T165 oashc.HttpShardHandlerFactory.getParameter Setting maxConnectionsPerHost
to: 20
[junit4:junit4]   2> 368 T165 oashc.HttpShardHandlerFactory.getParameter Setting corePoolSize
to: 0
[junit4:junit4]   2> 368 T165 oashc.HttpShardHandlerFactory.getParameter Setting maximumPoolSize
to: 2147483647
[junit4:junit4]   2> 368 T165 oashc.HttpShardHandlerFactory.getParameter Setting maxThreadIdleTime
to: 5
[junit4:junit4]   2> 369 T165 oashc.HttpShardHandlerFactory.getParameter Setting sizeOfQueue
to: -1
[junit4:junit4]   2> 369 T165 oashc.HttpShardHandlerFactory.getParameter Setting fairnessPolicy
to: false
[junit4:junit4]   2> 369 T165 oascsi.HttpClientUtil.createClient Creating new http client,
config:maxConnectionsPerHost=20&maxConnections=10000&socketTimeout=0&connTimeout=0&retry=false
[junit4:junit4]   2> 372 T166 oasc.SolrCore.registerSearcher [collection1] Registered new
searcher Searcher@35f25f88 main{StandardDirectoryReader(segments_1:1)}
[junit4:junit4]   2> 372 T165 oasc.CoreContainer.register registering core: collection1
[junit4:junit4]   2> 373 T165 oas.SolrTestCaseJ4.initCore ####initCore end
[junit4:junit4]   2> 
[junit4:junit4] ERROR   0.66s J1 | SpellCheckComponentTest.testPerDictionary
[junit4:junit4]    > Throwable #1: java.lang.RuntimeException: mismatch: '0'!='2' @ spellcheck/suggestions/bar/startOffset
[junit4:junit4]    > 	at __randomizedtesting.SeedInfo.seed([8E8386449A09509D:498D72EC926545D5]:0)
[junit4:junit4]    > 	at org.apache.solr.SolrTestCaseJ4.assertJQ(SolrTestCaseJ4.java:572)
[junit4:junit4]    > 	at org.apache.solr.SolrTestCaseJ4.assertJQ(SolrTestCaseJ4.java:520)
[junit4:junit4]    > 	at org.apache.solr.handler.component.SpellCheckComponentTest.testPerDictionary(SpellCheckComponentTest.java:102)
[junit4:junit4]    > 	at sun.reflect.NativeMethodAccessorImpl.invoke0(Native Method)
[junit4:junit4]    > 	at sun.reflect.NativeMethodAccessorImpl.invoke(NativeMethodAccessorImpl.java:57)
[junit4:junit4]    > 	at sun.reflect.DelegatingMethodAccessorImpl.invoke(DelegatingMethodAccessorImpl.java:43)
[junit4:junit4]    > 	at java.lang.reflect.Method.invoke(Method.java:474)
[junit4:junit4]    > 	at com.carrotsearch.randomizedtesting.RandomizedRunner.invoke(RandomizedRunner.java:1995)
[junit4:junit4]    > 	at com.carrotsearch.randomizedtesting.RandomizedRunner.access$1100(RandomizedRunner.java:132)
[junit4:junit4]    > 	at com.carrotsearch.randomizedtesting.RandomizedRunner$6.evaluate(RandomizedRunner.java:818)
[junit4:junit4]    > 	at com.carrotsearch.randomizedtesting.RandomizedRunner$7.evaluate(RandomizedRunner.java:877)
[junit4:junit4]    > 	at com.carrotsearch.randomizedtesting.RandomizedRunner$8.evaluate(RandomizedRunner.java:891)
[junit4:junit4]    > 	at com.carrotsearch.randomizedtesting.rules.SystemPropertiesRestoreRule$1.evaluate(SystemPropertiesRestoreRule.java:53)
[junit4:junit4]    > 	at org.apache.lucene.util.TestRuleSetupTeardownChained$1.evaluate(TestRuleSetupTeardownChained.java:50)
[junit4:junit4]    > 	at org.apache.lucene.util.TestRuleFieldCacheSanity$1.evaluate(TestRuleFieldCacheSanity.java:32)
[junit4:junit4]    > 	at org.apache.lucene.util.AbstractBeforeAfterRule$1.evaluate(AbstractBeforeAfterRule.java:45)
[junit4:junit4]    > 	at com.carrotsearch.randomizedtesting.rules.SystemPropertiesInvariantRule$1.evaluate(SystemPropertiesInvariantRule.java:55)
[junit4:junit4]    > 	at org.apache.lucene.util.TestRuleReportUncaughtExceptions$1.evaluate(TestRuleReportUncaughtExceptions.java:68)
[junit4:junit4]    > 	at org.apache.lucene.util.TestRuleThreadAndTestName$1.evaluate(TestRuleThreadAndTestName.java:48)
[junit4:junit4]    > 	at org.apache.lucene.util.TestRuleIgnoreAfterMaxFailures$1.evaluate(TestRuleIgnoreAfterMaxFailures.java:70)
[junit4:junit4]    > 	at org.apache.lucene.util.TestRuleMarkFailure$1.evaluate(TestRuleMarkFailure.java:48)
[junit4:junit4]    > 	at com.carrotsearch.randomizedtesting.RandomizedRunner.runSingleTest(RandomizedRunner.java:825)
[junit4:junit4]    > 	at com.carrotsearch.randomizedtesting.RandomizedRunner.access$700(RandomizedRunner.java:132)
[junit4:junit4]    > 	at com.carrotsearch.randomizedtesting.RandomizedRunner$3$1.run(RandomizedRunner.java:671)
[junit4:junit4]    > 	at com.carrotsearch.randomizedtesting.RandomizedRunner$3.evaluate(RandomizedRunner.java:697)
[junit4:junit4]    > 	at com.carrotsearch.randomizedtesting.RandomizedRunner$4.evaluate(RandomizedRunner.java:736)
[junit4:junit4]    > 	at com.carrotsearch.randomizedtesting.RandomizedRunner$5.evaluate(RandomizedRunner.java:747)
[junit4:junit4]    > 	at com.carrotsearch.randomizedtesting.rules.SystemPropertiesRestoreRule$1.evaluate(SystemPropertiesRestoreRule.java:53)
[junit4:junit4]    > 	at org.apache.lucene.util.AbstractBeforeAfterRule$1.evaluate(AbstractBeforeAfterRule.java:45)
[junit4:junit4]    > 	at org.apache.lucene.util.TestRuleReportUncaughtExceptions$1.evaluate(TestRuleReportUncaughtExceptions.java:68)
[junit4:junit4]    > 	at org.apache.lucene.util.TestRuleStoreClassName$1.evaluate(TestRuleStoreClassName.java:38)
[junit4:junit4]    > 	at com.carrotsearch.randomizedtesting.rules.SystemPropertiesInvariantRule$1.evaluate(SystemPropertiesInvariantRule.java:55)
[junit4:junit4]    > 	at org.apache.lucene.util.TestRuleNoInstanceHooksOverrides$1.evaluate(TestRuleNoInstanceHooksOverrides.java:53)
[junit4:junit4]    > 	at org.apache.lucene.util.TestRuleNoStaticHooksShadowing$1.evaluate(TestRuleNoStaticHooksShadowing.java:52)
[junit4:junit4]    > 	at org.apache.lucene.util.TestRuleAssertionsRequired$1.evaluate(TestRuleAssertionsRequired.java:36)
[junit4:junit4]    > 	at org.apache.lucene.util.TestRuleMarkFailure$1.evaluate(TestRuleMarkFailure.java:48)
[junit4:junit4]    > 	at org.apache.lucene.util.TestRuleIgnoreAfterMaxFailures$1.evaluate(TestRuleIgnoreAfterMaxFailures.java:70)
[junit4:junit4]    > 	at org.apache.lucene.util.TestRuleIgnoreTestSuites$1.evaluate(TestRuleIgnoreTestSuites.java:55)
[junit4:junit4]    > 	at com.carrotsearch.randomizedtesting.RandomizedRunner.runSuite(RandomizedRunner.java:605)
[junit4:junit4]    > 	at com.carrotsearch.randomizedtesting.RandomizedRunner.access$400(RandomizedRunner.java:132)
[junit4:junit4]    > 	at com.carrotsearch.randomizedtesting.RandomizedRunner$2.run(RandomizedRunner.java:551)
[junit4:junit4]    > 
[junit4:junit4]   2> 5314 T165 oas.SolrTestCaseJ4.setUp ###Starting testPerDictionary
[junit4:junit4]   2> 5318 T165 C18 UPDATE [collection1] webapp=null path=null params={}
{add=[0]} 0 1
[junit4:junit4]   2> 5328 T165 C18 UPDATE [collection1] webapp=null path=null params={}
{add=[1]} 0 0
[junit4:junit4]   2> 5333 T165 C18 UPDATE [collection1] webapp=null path=null params={}
{add=[2]} 0 1
[junit4:junit4]   2> 5337 T165 C18 UPDATE [collection1] webapp=null path=null params={}
{add=[3]} 0 0
[junit4:junit4]   2> 5342 T165 C18 UPDATE [collection1] webapp=null path=null params={}
{add=[4]} 0 1
[junit4:junit4]   2> 5346 T165 C18 UPDATE [collection1] webapp=null path=null params={}
{add=[5]} 0 0
[junit4:junit4]   2> 5350 T165 C18 UPDATE [collection1] webapp=null path=null params={}
{add=[6]} 0 0
[junit4:junit4]   2> 5355 T165 C18 UPDATE [collection1] webapp=null path=null params={}
{add=[7]} 0 1
[junit4:junit4]   2> 5359 T165 C18 UPDATE [collection1] webapp=null path=null params={}
{add=[8]} 0 1
[junit4:junit4]   2> 5363 T165 C18 UPDATE [collection1] webapp=null path=null params={}
{add=[9]} 0 0
[junit4:junit4]   2> 5367 T165 C18 oasu.DirectUpdateHandler2.commit start commit{flags=0,_version_=0,optimize=false,openSearcher=true,waitSearcher=true,expungeDeletes=false,softCommit=false}
[junit4:junit4]   2> 5370 T165 C18 oasc.SolrDeletionPolicy.onCommit SolrDeletionPolicy.onCommit:
commits:num=2
[junit4:junit4]   2> 		commit{dir=MockDirWrapper(org.apache.lucene.store.RAMDirectory@6bb4ab2b
lockFactory=org.apache.lucene.store.NativeFSLockFactory@27f9ba87),segFN=segments_f,generation=15,filenames=[segments_f]
[junit4:junit4]   2> 		commit{dir=MockDirWrapper(org.apache.lucene.store.RAMDirectory@6bb4ab2b
lockFactory=org.apache.lucene.store.NativeFSLockFactory@27f9ba87),segFN=segments_g,generation=16,filenames=[_8_NestedPulsing_0.tim,
_8_MockSep_0.tii, _8_NestedPulsing_0.prx, segments_g, _8_NestedPulsing_0.tip, _8_Direct_0.tim,
_8_MockSep_0.doc, _8_MockSep_0.pos, _8.fdx, _8.fnm, _8_MockSep_0.frq, _8_MockSep_0.pyl, _8_nrm.cfs,
_8_Direct_0.frq, _8_nrm.cfe, _8.si, _8_Direct_0.prx, _8_NestedPulsing_0.frq, _8_Direct_0.tip,
_8_MockSep_0.skp, _8.fdt, _8_MockSep_0.tib]
[junit4:junit4]   2> 5370 T165 C18 oasc.SolrDeletionPolicy.updateCommits newest commit
= 16
[junit4:junit4]   2> 5372 T165 C18 oass.SolrIndexSearcher.<init> Opening Searcher@109ec777
main
[junit4:junit4]   2> 5372 T165 C18 oass.SolrIndexSearcher.getIndexDir WARNING WARNING:
Directory impl does not support setting indexDir: org.apache.lucene.store.MockDirectoryWrapper
[junit4:junit4]   2> 5372 T166 oashc.SpellCheckComponent$SpellCheckerListener.buildSpellIndex
Building spell index for spell checker: default
[junit4:junit4]   2> 5372 T165 C18 oasu.DirectUpdateHandler2.commit end_commit_flush
[junit4:junit4]   2> 5403 T166 oashc.SpellCheckComponent$SpellCheckerListener.buildSpellIndex
Building spell index for spell checker: default_teststop
[junit4:junit4]   2> 5423 T166 oashc.SpellCheckComponent$SpellCheckerListener.buildSpellIndex
Building spell index for spell checker: threshold
[junit4:junit4]   2> 5463 T166 oashc.SpellCheckComponent$SpellCheckerListener.buildSpellIndex
Building spell index for spell checker: threshold_direct
[junit4:junit4]   2> 5463 T166 oashc.SpellCheckComponent$SpellCheckerListener.buildSpellIndex
Building spell index for spell checker: multipleFields
[junit4:junit4]   2> 5524 T166 oashc.SpellCheckComponent$SpellCheckerListener.buildSpellIndex
Building spell index for spell checker: freq
[junit4:junit4]   2> 5563 T166 oashc.SpellCheckComponent$SpellCheckerListener.buildSpellIndex
Building spell index for spell checker: fqcn
[junit4:junit4]   2> 5733 T166 oasc.SolrCore.registerSearcher [collection1] Registered
new searcher Searcher@109ec777 main{StandardDirectoryReader(segments_g:26 _8(4.0.0.1):C10)}
[junit4:junit4]   2> 5734 T165 C18 UPDATE [collection1] webapp=null path=null params={}
{commit=} 0 367
[junit4:junit4]   2> 5735 T165 C18 REQ [collection1] webapp=null path=null params={spellcheck.dictionary=perDict&q=documemt&spellcheck=true&spellcheck.build=true&json.nl=map&spellcheck..perDict.foo=bar&qt=spellCheckCompRH&spellcheck..perDict.bar=foo}
hits=0 status=0 QTime=0 
[junit4:junit4]   2> 5736 T165 oas.SolrTestCaseJ4.assertJQ SEVERE query failed JSON validation.
error=mismatch: '0'!='2' @ spellcheck/suggestions/bar/startOffset
[junit4:junit4]   2> 	 expected =/spellcheck/suggestions/bar=={"numFound":1, "startOffset":0,
"endOffset":1, "suggestion":["foo"]}
[junit4:junit4]   2> 	 response = {
[junit4:junit4]   2> 	  "responseHeader":{
[junit4:junit4]   2> 	    "status":0,
[junit4:junit4]   2> 	    "QTime":0},
[junit4:junit4]   2> 	  "command":"build",
[junit4:junit4]   2> 	  "response":{"numFound":0,"start":0,"docs":[]
[junit4:junit4]   2> 	  },
[junit4:junit4]   2> 	  "spellcheck":{
[junit4:junit4]   2> 	    "suggestions":{
[junit4:junit4]   2> 	      "foo":{
[junit4:junit4]   2> 	        "numFound":1,
[junit4:junit4]   2> 	        "startOffset":0,
[junit4:junit4]   2> 	        "endOffset":1,
[junit4:junit4]   2> 	        "suggestion":["bar"]},
[junit4:junit4]   2> 	      "bar":{
[junit4:junit4]   2> 	        "numFound":1,
[junit4:junit4]   2> 	        "startOffset":2,
[junit4:junit4]   2> 	        "endOffset":3,
[junit4:junit4]   2> 	        "suggestion":["foo"]}}}}
[junit4:junit4]   2> 	
[junit4:junit4]   2> 	 request = spellcheck.dictionary=perDict&q=documemt&spellcheck=true&spellcheck.build=true&json.nl=map&spellcheck..perDict.foo=bar&qt=spellCheckCompRH&spellcheck..perDict.bar=foo
[junit4:junit4]   2> 5736 T165 oas.SolrTestCaseJ4.tearDown ###Ending testPerDictionary
[junit4:junit4]   2> 5738 T165 C18 oasu.DirectUpdateHandler2.deleteAll [collection1] REMOVING
ALL DOCUMENTS FROM INDEX
[junit4:junit4]   2> 5739 T165 C18 UPDATE [collection1] webapp=null path=null params={}
{deleteByQuery=*:*} 0 1
[junit4:junit4]   2> 5741 T165 C18 oasu.DirectUpdateHandler2.commit start commit{flags=0,_version_=0,optimize=false,openSearcher=true,waitSearcher=true,expungeDeletes=false,softCommit=false}
[junit4:junit4]   2> 5742 T165 C18 oasc.SolrDeletionPolicy.onCommit SolrDeletionPolicy.onCommit:
commits:num=2
[junit4:junit4]   2> 		commit{dir=MockDirWrapper(org.apache.lucene.store.RAMDirectory@6bb4ab2b
lockFactory=org.apache.lucene.store.NativeFSLockFactory@27f9ba87),segFN=segments_g,generation=16,filenames=[_8_NestedPulsing_0.tim,
_8_MockSep_0.tii, _8_NestedPulsing_0.prx, segments_g, _8_NestedPulsing_0.tip, _8_Direct_0.tim,
_8_MockSep_0.doc, _8_MockSep_0.pos, _8.fdx, _8.fnm, _8_MockSep_0.frq, _8_MockSep_0.pyl, _8_nrm.cfs,
_8_Direct_0.frq, _8_nrm.cfe, _8.si, _8_Direct_0.prx, _8_NestedPulsing_0.frq, _8_Direct_0.tip,
_8_MockSep_0.skp, _8.fdt, _8_MockSep_0.tib]
[junit4:junit4]   2> 		commit{dir=MockDirWrapper(org.apache.lucene.store.RAMDirectory@6bb4ab2b
lockFactory=org.apache.lucene.store.NativeFSLockFactory@27f9ba87),segFN=segments_h,generation=17,filenames=[segments_h]
[junit4:junit4]   2> 5742 T165 C18 oasc.SolrDeletionPolicy.updateCommits newest commit
= 17
[junit4:junit4]   2> 5742 T165 C18 oass.SolrIndexSearcher.<init> Opening Searcher@6d60098d
main
[junit4:junit4]   2> 5743 T165 C18 oass.SolrIndexSearcher.getIndexDir WARNING WARNING:
Directory impl does not support setting indexDir: org.apache.lucene.store.MockDirectoryWrapper
[junit4:junit4]   2> 5743 T166 oashc.SpellCheckComponent$SpellCheckerListener.buildSpellIndex
Building spell index for spell checker: default
[junit4:junit4]   2> 5743 T165 C18 oasu.DirectUpdateHandler2.commit end_commit_flush
[junit4:junit4]   2> 5763 T166 oashc.SpellCheckComponent$SpellCheckerListener.buildSpellIndex
Building spell index for spell checker: default_teststop
[junit4:junit4]   2> 5783 T166 oashc.SpellCheckComponent$SpellCheckerListener.buildSpellIndex
Building spell index for spell checker: threshold
[junit4:junit4]   2> 5803 T166 oashc.SpellCheckComponent$SpellCheckerListener.buildSpellIndex
Building spell index for spell checker: threshold_direct
[junit4:junit4]   2> 5803 T166 oashc.SpellCheckComponent$SpellCheckerListener.buildSpellIndex
Building spell index for spell checker: multipleFields
[junit4:junit4]   2> 5834 T166 oashc.SpellCheckComponent$SpellCheckerListener.buildSpellIndex
Building spell index for spell checker: freq
[junit4:junit4]   2> 5864 T166 oashc.SpellCheckComponent$SpellCheckerListener.buildSpellIndex
Building spell index for spell checker: fqcn
[junit4:junit4]   2> 5894 T166 oasc.SolrCore.registerSearcher [collection1] Registered
new searcher Searcher@6d60098d main{StandardDirectoryReader(segments_h:27)}
[junit4:junit4]   2> 5894 T165 C18 UPDATE [collection1] webapp=null path=null params={}
{commit=} 0 153
[junit4:junit4]   2> NOTE: reproduce with: ant test  -Dtestcase=SpellCheckComponentTest
-Dtests.method=testPerDictionary -Dtests.seed=8E8386449A09509D -Dtests.multiplier=3 -Dtests.slow=true
-Dtests.locale=th_TH -Dtests.timezone=Australia/Hobart -Dtests.file.encoding=ISO-8859-1
[junit4:junit4]   2>
[junit4:junit4]    > (@AfterClass output)
[junit4:junit4]   2> 7441 T165 oas.SolrTestCaseJ4.deleteCore ###deleteCore
[junit4:junit4]   2> 7442 T165 oasc.CoreContainer.shutdown Shutting down CoreContainer
instance=740264689
[junit4:junit4]   2> 7442 T165 oasc.SolrCore.close [collection1]  CLOSING SolrCore org.apache.solr.core.SolrCore@327ca223
[junit4:junit4]   2> 7442 T165 oasc.SolrCore.closeSearcher [collection1] Closing main searcher
on request.
[junit4:junit4]   2> 7442 T165 oasu.DirectUpdateHandler2.close closing DirectUpdateHandler2{commits=20,autocommits=0,soft
autocommits=0,optimizes=0,rollbacks=0,expungeDeletes=0,docsPending=0,adds=0,deletesById=0,deletesByQuery=0,errors=0,cumulative_adds=92,cumulative_deletesById=0,cumulative_deletesByQuery=9,cumulative_errors=0}
[junit4:junit4]   2> NOTE: test params are: codec=Lucene40: {start2=PostingsFormat(name=Direct),
gram3=PostingsFormat(name=MockSep), gram1=PostingsFormat(name=Direct), lowerfilt1and2=PostingsFormat(name=Direct),
end4=MockVariableIntBlock(baseBlockSize=74), gram4=MockVariableIntBlock(baseBlockSize=74),
id=PostingsFormat(name=NestedPulsing), start3=MockVariableIntBlock(baseBlockSize=74), start1=PostingsFormat(name=NestedPulsing),
range_facet_l=PostingsFormat(name=Direct), range_facet_sl=PostingsFormat(name=NestedPulsing),
timestamp=PostingsFormat(name=Direct), gram2=PostingsFormat(name=NestedPulsing), intDefault=PostingsFormat(name=MockSep),
end1=PostingsFormat(name=Direct), range_facet_si=PostingsFormat(name=Direct), end2=PostingsFormat(name=NestedPulsing),
lowerfilt=PostingsFormat(name=Direct), multiDefault=PostingsFormat(name=Direct), end3=PostingsFormat(name=MockSep),
word=PostingsFormat(name=Direct), start4=PostingsFormat(name=MockSep)}, sim=DefaultSimilarity,
locale=th_TH, timezone=Australia/Hobart
[junit4:junit4]   2> NOTE: Linux 3.2.0-27-generic amd64/Oracle Corporation 1.8.0-ea (64-bit)/cpus=8,threads=1,free=40104872,total=262209536
[junit4:junit4]   2> NOTE: All tests run in this JVM: [TestSolrJ, CloudStateUpdateTest,
StatsComponentTest, ReturnFieldsTest, UpdateParamsTest, IndexSchemaTest, TestRealTimeGet,
TestLRUCache, ConvertedLegacyTest, TestCollationKeyRangeQueries, TestQuerySenderListener,
URLClassifyProcessorTest, TestFoldingMultitermQuery, SolrPluginUtilsTest, TimeZoneUtilsTest,
IndexReaderFactoryTest, FieldAnalysisRequestHandlerTest, BadIndexSchemaTest, OutputWriterTest,
OpenExchangeRatesOrgProviderTest, TestPHPSerializedResponseWriter, StatelessScriptUpdateProcessorFactoryTest,
TestBinaryResponseWriter, SpellCheckComponentTest]
[junit4:junit4]   2> 
[junit4:junit4] Completed on J1 in 7.54s, 9 tests, 1 error <<< FAILURES!

[...truncated 541 lines...]
BUILD FAILED
/mnt/ssd/jenkins/workspace/Lucene-Solr-4.x-Linux-Java8-64/checkout/build.xml:29: The following
error occurred while executing this line:
/mnt/ssd/jenkins/workspace/Lucene-Solr-4.x-Linux-Java8-64/checkout/solr/build.xml:144: The
following error occurred while executing this line:
/mnt/ssd/jenkins/workspace/Lucene-Solr-4.x-Linux-Java8-64/checkout/lucene/module-build.xml:62:
The following error occurred while executing this line:
/mnt/ssd/jenkins/workspace/Lucene-Solr-4.x-Linux-Java8-64/checkout/lucene/common-build.xml:1095:
The following error occurred while executing this line:
/mnt/ssd/jenkins/workspace/Lucene-Solr-4.x-Linux-Java8-64/checkout/lucene/common-build.xml:790:
There were test failures: 223 suites, 901 tests, 1 error, 5 ignored

Total time: 20 minutes 58 seconds
Build step 'Execute shell' marked build as failure
Archiving artifacts
Recording test results
Email was triggered for: Failure
Sending email for trigger: Failure




Mime
View raw message