lucene-dev mailing list archives

Site index · List index
Message view « Date » · « Thread »
Top « Date » · « Thread »
From Apache Jenkins Server <jenk...@builds.apache.org>
Subject [JENKINS] Lucene-Solr-tests-only-trunk-java7 - Build # 2982 - Failure
Date Sat, 28 Jul 2012 19:58:01 GMT
Build: https://builds.apache.org/job/Lucene-Solr-tests-only-trunk-java7/2982/

1 tests failed.
FAILED:  org.apache.lucene.analysis.util.TestFilesystemResourceLoader.testBaseDir

Error Message:
Resource not found: ./fsResourceLoaderBase2772427724tmp/template.txt

Stack Trace:
java.io.IOException: Resource not found: ./fsResourceLoaderBase2772427724tmp/template.txt
	at __randomizedtesting.SeedInfo.seed([E2DA674FCFE4EDB2:D8F3D1C5B9C2E38A]:0)
	at org.apache.lucene.analysis.util.ClasspathResourceLoader.openResource(ClasspathResourceLoader.java:67)
	at org.apache.lucene.analysis.util.FilesystemResourceLoader.openResource(FilesystemResourceLoader.java:86)
	at org.apache.lucene.analysis.util.TestFilesystemResourceLoader.testBaseDir(TestFilesystemResourceLoader.java:77)
	at sun.reflect.NativeMethodAccessorImpl.invoke0(Native Method)
	at sun.reflect.NativeMethodAccessorImpl.invoke(NativeMethodAccessorImpl.java:57)
	at sun.reflect.DelegatingMethodAccessorImpl.invoke(DelegatingMethodAccessorImpl.java:43)
	at java.lang.reflect.Method.invoke(Method.java:601)
	at com.carrotsearch.randomizedtesting.RandomizedRunner.invoke(RandomizedRunner.java:1995)
	at com.carrotsearch.randomizedtesting.RandomizedRunner.access$1100(RandomizedRunner.java:132)
	at com.carrotsearch.randomizedtesting.RandomizedRunner$6.evaluate(RandomizedRunner.java:818)
	at com.carrotsearch.randomizedtesting.RandomizedRunner$7.evaluate(RandomizedRunner.java:877)
	at com.carrotsearch.randomizedtesting.RandomizedRunner$8.evaluate(RandomizedRunner.java:891)
	at org.apache.lucene.util.TestRuleSetupTeardownChained$1.evaluate(TestRuleSetupTeardownChained.java:50)
	at org.apache.lucene.util.TestRuleFieldCacheSanity$1.evaluate(TestRuleFieldCacheSanity.java:32)
	at org.apache.lucene.util.AbstractBeforeAfterRule$1.evaluate(AbstractBeforeAfterRule.java:45)
	at com.carrotsearch.randomizedtesting.rules.SystemPropertiesInvariantRule$1.evaluate(SystemPropertiesInvariantRule.java:55)
	at org.apache.lucene.util.TestRuleReportUncaughtExceptions$1.evaluate(TestRuleReportUncaughtExceptions.java:68)
	at org.apache.lucene.util.TestRuleThreadAndTestName$1.evaluate(TestRuleThreadAndTestName.java:48)
	at org.apache.lucene.util.TestRuleIgnoreAfterMaxFailures$1.evaluate(TestRuleIgnoreAfterMaxFailures.java:70)
	at org.apache.lucene.util.TestRuleMarkFailure$1.evaluate(TestRuleMarkFailure.java:48)
	at com.carrotsearch.randomizedtesting.RandomizedRunner.runSingleTest(RandomizedRunner.java:825)
	at com.carrotsearch.randomizedtesting.RandomizedRunner.access$700(RandomizedRunner.java:132)
	at com.carrotsearch.randomizedtesting.RandomizedRunner$3$1.run(RandomizedRunner.java:671)
	at com.carrotsearch.randomizedtesting.RandomizedRunner$3.evaluate(RandomizedRunner.java:697)
	at com.carrotsearch.randomizedtesting.RandomizedRunner$4.evaluate(RandomizedRunner.java:736)
	at com.carrotsearch.randomizedtesting.RandomizedRunner$5.evaluate(RandomizedRunner.java:747)
	at org.apache.lucene.util.AbstractBeforeAfterRule$1.evaluate(AbstractBeforeAfterRule.java:45)
	at org.apache.lucene.util.TestRuleReportUncaughtExceptions$1.evaluate(TestRuleReportUncaughtExceptions.java:68)
	at org.apache.lucene.util.TestRuleStoreClassName$1.evaluate(TestRuleStoreClassName.java:38)
	at com.carrotsearch.randomizedtesting.rules.SystemPropertiesInvariantRule$1.evaluate(SystemPropertiesInvariantRule.java:55)
	at org.apache.lucene.util.TestRuleNoInstanceHooksOverrides$1.evaluate(TestRuleNoInstanceHooksOverrides.java:53)
	at org.apache.lucene.util.TestRuleNoStaticHooksShadowing$1.evaluate(TestRuleNoStaticHooksShadowing.java:52)
	at org.apache.lucene.util.TestRuleAssertionsRequired$1.evaluate(TestRuleAssertionsRequired.java:36)
	at org.apache.lucene.util.TestRuleMarkFailure$1.evaluate(TestRuleMarkFailure.java:48)
	at org.apache.lucene.util.TestRuleIgnoreAfterMaxFailures$1.evaluate(TestRuleIgnoreAfterMaxFailures.java:70)
	at org.apache.lucene.util.TestRuleIgnoreTestSuites$1.evaluate(TestRuleIgnoreTestSuites.java:55)
	at com.carrotsearch.randomizedtesting.RandomizedRunner.runSuite(RandomizedRunner.java:605)
	at com.carrotsearch.randomizedtesting.RandomizedRunner.access$400(RandomizedRunner.java:132)
	at com.carrotsearch.randomizedtesting.RandomizedRunner$2.run(RandomizedRunner.java:551)




Build Log:
[...truncated 4927 lines...]
compile-lucene-core:

init:

-clover.disable:

-clover.setup:

clover:

common.compile-core:

compile-core:

compile-test-framework:

ivy-availability-check:

ivy-fail:

ivy-configure:
[ivy:configure] :: loading settings :: file = /usr/home/hudson/hudson-slave/workspace/Lucene-Solr-tests-only-trunk-java7/checkout/lucene/ivy-settings.xml

resolve:

init:

compile-lucene-core:

compile-core:

common.compile-test:

install-junit4-taskdef:

-clover.disable:

-clover.setup:

clover:

validate:

common.test:
    [mkdir] Created dir: /usr/home/hudson/hudson-slave/workspace/Lucene-Solr-tests-only-trunk-java7/checkout/lucene/build/analysis/common/test
[junit4:junit4] <JUnit4> says hi! Master seed: E2DA674FCFE4EDB2
[junit4:junit4] Your console's encoding may not display certain unicode glyphs: US-ASCII
[junit4:junit4] Executing 210 suites with 2 JVMs.
[junit4:junit4] Suite: org.apache.lucene.analysis.no.TestNorwegianMinimalStemFilter
[junit4:junit4] Completed on J0 in 1.65s, 4 tests
[junit4:junit4]  
[junit4:junit4] Suite: org.apache.lucene.analysis.core.TestStopFilter
[junit4:junit4] Completed on J0 in 0.20s, 4 tests
[junit4:junit4]  
[junit4:junit4] Suite: org.apache.lucene.analysis.ro.TestRomanianAnalyzer
[junit4:junit4] Completed on J1 in 1.59s, 4 tests
[junit4:junit4]  
[junit4:junit4] Suite: org.apache.lucene.analysis.util.TestAnalysisSPILoader
[junit4:junit4] Completed on J0 in 0.25s, 15 tests
[junit4:junit4]  
[junit4:junit4] Suite: org.apache.lucene.analysis.miscellaneous.TestPrefixAwareTokenFilter
[junit4:junit4] Completed on J0 in 0.02s, 1 test
[junit4:junit4]  
[junit4:junit4] Suite: org.apache.lucene.analysis.lv.TestLatvianAnalyzer
[junit4:junit4] Completed on J1 in 0.83s, 4 tests
[junit4:junit4]  
[junit4:junit4] Suite: org.apache.lucene.analysis.bg.TestBulgarianAnalyzer
[junit4:junit4] Completed on J0 in 0.88s, 7 tests
[junit4:junit4]  
[junit4:junit4] Suite: org.apache.lucene.analysis.pt.TestPortugueseStemFilter
[junit4:junit4] Completed on J1 in 1.54s, 5 tests
[junit4:junit4]  
[junit4:junit4] Suite: org.apache.lucene.analysis.util.TestCharacterUtils
[junit4:junit4] Completed on J1 in 0.06s, 7 tests
[junit4:junit4]  
[junit4:junit4] Suite: org.apache.lucene.analysis.id.TestIndonesianStemmer
[junit4:junit4] Completed on J1 in 0.04s, 5 tests
[junit4:junit4]  
[junit4:junit4] Suite: org.apache.lucene.analysis.hunspell.HunspellStemFilterTest
[junit4:junit4] Completed on J1 in 0.73s, 3 tests
[junit4:junit4]  
[junit4:junit4] Suite: org.apache.lucene.analysis.it.TestItalianAnalyzer
[junit4:junit4] Completed on J1 in 0.51s, 5 tests
[junit4:junit4]  
[junit4:junit4] Suite: org.apache.lucene.analysis.hi.TestHindiNormalizer
[junit4:junit4] Completed on J1 in 0.02s, 3 tests
[junit4:junit4]  
[junit4:junit4] Suite: org.apache.lucene.analysis.de.TestGermanNormalizationFilterFactory
[junit4:junit4] Completed on J1 in 0.05s, 1 test
[junit4:junit4]  
[junit4:junit4] Suite: org.apache.lucene.analysis.de.TestGermanAnalyzer
[junit4:junit4] Completed on J1 in 0.37s, 5 tests
[junit4:junit4]  
[junit4:junit4] Suite: org.apache.lucene.analysis.commongrams.CommonGramsFilterTest
[junit4:junit4] Completed on J1 in 1.09s, 10 tests
[junit4:junit4]  
[junit4:junit4] Suite: org.apache.lucene.analysis.miscellaneous.TestTrimFilter
[junit4:junit4] Completed on J1 in 0.62s, 3 tests
[junit4:junit4]  
[junit4:junit4] Suite: org.apache.lucene.analysis.util.TestFilesystemResourceLoader
[junit4:junit4] ERROR   0.05s J1 | TestFilesystemResourceLoader.testBaseDir
[junit4:junit4]    > Throwable #1: java.io.IOException: Resource not found: ./fsResourceLoaderBase2772427724tmp/template.txt
[junit4:junit4]    > 	at __randomizedtesting.SeedInfo.seed([E2DA674FCFE4EDB2:D8F3D1C5B9C2E38A]:0)
[junit4:junit4]    > 	at org.apache.lucene.analysis.util.ClasspathResourceLoader.openResource(ClasspathResourceLoader.java:67)
[junit4:junit4]    > 	at org.apache.lucene.analysis.util.FilesystemResourceLoader.openResource(FilesystemResourceLoader.java:86)
[junit4:junit4]    > 	at org.apache.lucene.analysis.util.TestFilesystemResourceLoader.testBaseDir(TestFilesystemResourceLoader.java:77)
[junit4:junit4]    > 	at sun.reflect.NativeMethodAccessorImpl.invoke0(Native Method)
[junit4:junit4]    > 	at sun.reflect.NativeMethodAccessorImpl.invoke(NativeMethodAccessorImpl.java:57)
[junit4:junit4]    > 	at sun.reflect.DelegatingMethodAccessorImpl.invoke(DelegatingMethodAccessorImpl.java:43)
[junit4:junit4]    > 	at java.lang.reflect.Method.invoke(Method.java:601)
[junit4:junit4]    > 	at com.carrotsearch.randomizedtesting.RandomizedRunner.invoke(RandomizedRunner.java:1995)
[junit4:junit4]    > 	at com.carrotsearch.randomizedtesting.RandomizedRunner.access$1100(RandomizedRunner.java:132)
[junit4:junit4]    > 	at com.carrotsearch.randomizedtesting.RandomizedRunner$6.evaluate(RandomizedRunner.java:818)
[junit4:junit4]    > 	at com.carrotsearch.randomizedtesting.RandomizedRunner$7.evaluate(RandomizedRunner.java:877)
[junit4:junit4]    > 	at com.carrotsearch.randomizedtesting.RandomizedRunner$8.evaluate(RandomizedRunner.java:891)
[junit4:junit4]    > 	at org.apache.lucene.util.TestRuleSetupTeardownChained$1.evaluate(TestRuleSetupTeardownChained.java:50)
[junit4:junit4]    > 	at org.apache.lucene.util.TestRuleFieldCacheSanity$1.evaluate(TestRuleFieldCacheSanity.java:32)
[junit4:junit4]    > 	at org.apache.lucene.util.AbstractBeforeAfterRule$1.evaluate(AbstractBeforeAfterRule.java:45)
[junit4:junit4]    > 	at com.carrotsearch.randomizedtesting.rules.SystemPropertiesInvariantRule$1.evaluate(SystemPropertiesInvariantRule.java:55)
[junit4:junit4]    > 	at org.apache.lucene.util.TestRuleReportUncaughtExceptions$1.evaluate(TestRuleReportUncaughtExceptions.java:68)
[junit4:junit4]    > 	at org.apache.lucene.util.TestRuleThreadAndTestName$1.evaluate(TestRuleThreadAndTestName.java:48)
[junit4:junit4]    > 	at org.apache.lucene.util.TestRuleIgnoreAfterMaxFailures$1.evaluate(TestRuleIgnoreAfterMaxFailures.java:70)
[junit4:junit4]    > 	at org.apache.lucene.util.TestRuleMarkFailure$1.evaluate(TestRuleMarkFailure.java:48)
[junit4:junit4]    > 	at com.carrotsearch.randomizedtesting.RandomizedRunner.runSingleTest(RandomizedRunner.java:825)
[junit4:junit4]    > 	at com.carrotsearch.randomizedtesting.RandomizedRunner.access$700(RandomizedRunner.java:132)
[junit4:junit4]    > 	at com.carrotsearch.randomizedtesting.RandomizedRunner$3$1.run(RandomizedRunner.java:671)
[junit4:junit4]    > 	at com.carrotsearch.randomizedtesting.RandomizedRunner$3.evaluate(RandomizedRunner.java:697)
[junit4:junit4]    > 	at com.carrotsearch.randomizedtesting.RandomizedRunner$4.evaluate(RandomizedRunner.java:736)
[junit4:junit4]    > 	at com.carrotsearch.randomizedtesting.RandomizedRunner$5.evaluate(RandomizedRunner.java:747)
[junit4:junit4]    > 	at org.apache.lucene.util.AbstractBeforeAfterRule$1.evaluate(AbstractBeforeAfterRule.java:45)
[junit4:junit4]    > 	at org.apache.lucene.util.TestRuleReportUncaughtExceptions$1.evaluate(TestRuleReportUncaughtExceptions.java:68)
[junit4:junit4]    > 	at org.apache.lucene.util.TestRuleStoreClassName$1.evaluate(TestRuleStoreClassName.java:38)
[junit4:junit4]    > 	at com.carrotsearch.randomizedtesting.rules.SystemPropertiesInvariantRule$1.evaluate(SystemPropertiesInvariantRule.java:55)
[junit4:junit4]    > 	at org.apache.lucene.util.TestRuleNoInstanceHooksOverrides$1.evaluate(TestRuleNoInstanceHooksOverrides.java:53)
[junit4:junit4]    > 	at org.apache.lucene.util.TestRuleNoStaticHooksShadowing$1.evaluate(TestRuleNoStaticHooksShadowing.java:52)
[junit4:junit4]    > 	at org.apache.lucene.util.TestRuleAssertionsRequired$1.evaluate(TestRuleAssertionsRequired.java:36)
[junit4:junit4]    > 	at org.apache.lucene.util.TestRuleMarkFailure$1.evaluate(TestRuleMarkFailure.java:48)
[junit4:junit4]    > 	at org.apache.lucene.util.TestRuleIgnoreAfterMaxFailures$1.evaluate(TestRuleIgnoreAfterMaxFailures.java:70)
[junit4:junit4]    > 	at org.apache.lucene.util.TestRuleIgnoreTestSuites$1.evaluate(TestRuleIgnoreTestSuites.java:55)
[junit4:junit4]    > 	at com.carrotsearch.randomizedtesting.RandomizedRunner.runSuite(RandomizedRunner.java:605)
[junit4:junit4]    > 	at com.carrotsearch.randomizedtesting.RandomizedRunner.access$400(RandomizedRunner.java:132)
[junit4:junit4]    > 	at com.carrotsearch.randomizedtesting.RandomizedRunner$2.run(RandomizedRunner.java:551)
[junit4:junit4]    > 
[junit4:junit4]   2> NOTE: reproduce with: ant test  -Dtestcase=TestFilesystemResourceLoader
-Dtests.method=testBaseDir -Dtests.seed=E2DA674FCFE4EDB2 -Dtests.multiplier=3 -Dtests.slow=true
-Dtests.locale=ar_SY -Dtests.timezone=Asia/Baku -Dtests.file.encoding=US-ASCII
[junit4:junit4]   2>
[junit4:junit4]    > (@AfterClass output)
[junit4:junit4]   2> NOTE: test params are: codec=Lucene40: {}, sim=RandomSimilarityProvider(queryNorm=true,coord=false):
{}, locale=ar_SY, timezone=Asia/Baku
[junit4:junit4]   2> NOTE: FreeBSD 9.0-RELEASE amd64/Oracle Corporation 1.7.0_04 (64-bit)/cpus=16,threads=1,free=78562008,total=117440512
[junit4:junit4]   2> NOTE: All tests run in this JVM: [TestRomanianAnalyzer, TestLatvianAnalyzer,
TestPortugueseStemFilter, TestCharacterUtils, TestIndonesianStemmer, HunspellStemFilterTest,
TestItalianAnalyzer, TestHindiNormalizer, TestGermanNormalizationFilterFactory, TestGermanAnalyzer,
CommonGramsFilterTest, TestTrimFilter, TestFilesystemResourceLoader]
[junit4:junit4]   2> 
[junit4:junit4] Completed on J1 in 0.07s, 2 tests, 1 error <<< FAILURES!
[...truncated 600 lines...]

[...truncated 5678 lines...]

[...truncated 5678 lines...]

[...truncated 5678 lines...]

[...truncated 5678 lines...]

[...truncated 5662 lines...]
BUILD FAILED
/usr/home/hudson/hudson-slave/workspace/Lucene-Solr-tests-only-trunk-java7/checkout/build.xml:29:
The following error occurred while executing this line:
/usr/home/hudson/hudson-slave/workspace/Lucene-Solr-tests-only-trunk-java7/checkout/lucene/build.xml:503:
The following error occurred while executing this line:
/usr/home/hudson/hudson-slave/workspace/Lucene-Solr-tests-only-trunk-java7/checkout/lucene/common-build.xml:1497:
The following error occurred while executing this line:
/usr/home/hudson/hudson-slave/workspace/Lucene-Solr-tests-only-trunk-java7/checkout/lucene/analysis/build.xml:101:
The following error occurred while executing this line:
/usr/home/hudson/hudson-slave/workspace/Lucene-Solr-tests-only-trunk-java7/checkout/lucene/analysis/build.xml:38:
The following error occurred while executing this line:
/usr/home/hudson/hudson-slave/workspace/Lucene-Solr-tests-only-trunk-java7/checkout/lucene/module-build.xml:62:
The following error occurred while executing this line:
/usr/home/hudson/hudson-slave/workspace/Lucene-Solr-tests-only-trunk-java7/checkout/lucene/common-build.xml:1095:
The following error occurred while executing this line:
/usr/home/hudson/hudson-slave/workspace/Lucene-Solr-tests-only-trunk-java7/checkout/lucene/common-build.xml:790:
There were test failures: 210 suites, 1062 tests, 1 error, 1 ignored

Total time: 7 minutes 30 seconds
Build step 'Execute shell' marked build as failure
Archiving artifacts
Recording test results
Email was triggered for: Failure
Sending email for trigger: Failure



Mime
View raw message