lucene-dev mailing list archives

Site index · List index
Message view « Date » · « Thread »
Top « Date » · « Thread »
From Apache Jenkins Server <jenk...@builds.apache.org>
Subject [JENKINS] Lucene-Solr-tests-only-trunk-java7 - Build # 2939 - Failure
Date Sat, 21 Jul 2012 12:04:11 GMT
Build: https://builds.apache.org/job/Lucene-Solr-tests-only-trunk-java7/2939/

1 tests failed.
REGRESSION:  org.apache.lucene.index.TestDocumentsWriterStallControl.testSimpleStall

Error Message:
Left-over thread detected  (and terminated): Thread[Thread-1377,5,] (stack trace is a snapshot
location of the thread at the moment of killing, see the system logger for probes and more
information).

Stack Trace:
com.carrotsearch.randomizedtesting.ThreadingError: Left-over thread detected  (and terminated):
Thread[Thread-1377,5,] (stack trace is a snapshot location of the thread at the moment of
killing, see the system logger for probes and more information).
	at __randomizedtesting.SeedInfo.seed([BE1A80DB98EB0A4D]:0)
	at java.lang.Object.wait(Native Method)
	at java.lang.Object.wait(Object.java:503)
	at org.apache.lucene.index.DocumentsWriterStallControl.waitIfStalled(DocumentsWriterStallControl.java:74)
	at org.apache.lucene.index.TestDocumentsWriterStallControl$2.run(TestDocumentsWriterStallControl.java:325)




Build Log:
[...truncated 989 lines...]
[junit4:junit4]    > 	at org.apache.lucene.util.TestRuleNoInstanceHooksOverrides$1.evaluate(TestRuleNoInstanceHooksOverrides.java:53)
[junit4:junit4]    > 	at org.apache.lucene.util.TestRuleNoStaticHooksShadowing$1.evaluate(TestRuleNoStaticHooksShadowing.java:52)
[junit4:junit4]    > 	at org.apache.lucene.util.TestRuleAssertionsRequired$1.evaluate(TestRuleAssertionsRequired.java:36)
[junit4:junit4]    > 	at org.apache.lucene.util.TestRuleMarkFailure$1.evaluate(TestRuleMarkFailure.java:48)
[junit4:junit4]    > 	at org.apache.lucene.util.TestRuleIgnoreAfterMaxFailures$1.evaluate(TestRuleIgnoreAfterMaxFailures.java:70)
[junit4:junit4]    > 	at org.apache.lucene.util.TestRuleIgnoreTestSuites$1.evaluate(TestRuleIgnoreTestSuites.java:55)
[junit4:junit4]    > 	at com.carrotsearch.randomizedtesting.RandomizedRunner.runSuite(RandomizedRunner.java:605)
[junit4:junit4]    > 	at com.carrotsearch.randomizedtesting.RandomizedRunner.access$400(RandomizedRunner.java:132)
[junit4:junit4]    > 	at com.carrotsearch.randomizedtesting.RandomizedRunner$2.run(RandomizedRunner.java:551)
[junit4:junit4]    > Caused by: org.apache.lucene.util.ThreadInterruptedException: java.lang.InterruptedException
[junit4:junit4]    > 	at __randomizedtesting.SeedInfo.seed([BE1A80DB98EB0A4D]:0)
[junit4:junit4]    > 	at org.apache.lucene.index.DocumentsWriterStallControl.waitIfStalled(DocumentsWriterStallControl.java:77)
[junit4:junit4]    > 	at org.apache.lucene.index.TestDocumentsWriterStallControl$2.run(TestDocumentsWriterStallControl.java:325)
[junit4:junit4]    > Caused by: java.lang.InterruptedException
[junit4:junit4]    > 	at java.lang.Object.wait(Native Method)
[junit4:junit4]    > 	at java.lang.Object.wait(Object.java:503)
[junit4:junit4]    > 	at org.apache.lucene.index.DocumentsWriterStallControl.waitIfStalled(DocumentsWriterStallControl.java:74)
[junit4:junit4]    > 	... 1 more
[junit4:junit4]    > Throwable #10: java.lang.RuntimeException: Thread threw an uncaught
exception (after termination attempt), thread: Thread[Thread-1373,5,]
[junit4:junit4]    > 	at com.carrotsearch.randomizedtesting.RunnerThreadGroup.processUncaught(RunnerThreadGroup.java:96)
[junit4:junit4]    > 	at com.carrotsearch.randomizedtesting.RandomizedRunner.runSingleTest(RandomizedRunner.java:859)
[junit4:junit4]    > 	at com.carrotsearch.randomizedtesting.RandomizedRunner.access$700(RandomizedRunner.java:132)
[junit4:junit4]    > 	at com.carrotsearch.randomizedtesting.RandomizedRunner$3$1.run(RandomizedRunner.java:671)
[junit4:junit4]    > 	at com.carrotsearch.randomizedtesting.RandomizedRunner$3.evaluate(RandomizedRunner.java:697)
[junit4:junit4]    > 	at com.carrotsearch.randomizedtesting.RandomizedRunner$4.evaluate(RandomizedRunner.java:736)
[junit4:junit4]    > 	at com.carrotsearch.randomizedtesting.RandomizedRunner$5.evaluate(RandomizedRunner.java:747)
[junit4:junit4]    > 	at org.apache.lucene.util.AbstractBeforeAfterRule$1.evaluate(AbstractBeforeAfterRule.java:45)
[junit4:junit4]    > 	at org.apache.lucene.util.TestRuleReportUncaughtExceptions$1.evaluate(TestRuleReportUncaughtExceptions.java:68)
[junit4:junit4]    > 	at org.apache.lucene.util.TestRuleStoreClassName$1.evaluate(TestRuleStoreClassName.java:38)
[junit4:junit4]    > 	at org.apache.lucene.util.TestRuleIcuHack$1.evaluate(TestRuleIcuHack.java:51)
[junit4:junit4]    > 	at com.carrotsearch.randomizedtesting.rules.SystemPropertiesInvariantRule$1.evaluate(SystemPropertiesInvariantRule.java:55)
[junit4:junit4]    > 	at org.apache.lucene.util.TestRuleNoInstanceHooksOverrides$1.evaluate(TestRuleNoInstanceHooksOverrides.java:53)
[junit4:junit4]    > 	at org.apache.lucene.util.TestRuleNoStaticHooksShadowing$1.evaluate(TestRuleNoStaticHooksShadowing.java:52)
[junit4:junit4]    > 	at org.apache.lucene.util.TestRuleAssertionsRequired$1.evaluate(TestRuleAssertionsRequired.java:36)
[junit4:junit4]    > 	at org.apache.lucene.util.TestRuleMarkFailure$1.evaluate(TestRuleMarkFailure.java:48)
[junit4:junit4]    > 	at org.apache.lucene.util.TestRuleIgnoreAfterMaxFailures$1.evaluate(TestRuleIgnoreAfterMaxFailures.java:70)
[junit4:junit4]    > 	at org.apache.lucene.util.TestRuleIgnoreTestSuites$1.evaluate(TestRuleIgnoreTestSuites.java:55)
[junit4:junit4]    > 	at com.carrotsearch.randomizedtesting.RandomizedRunner.runSuite(RandomizedRunner.java:605)
[junit4:junit4]    > 	at com.carrotsearch.randomizedtesting.RandomizedRunner.access$400(RandomizedRunner.java:132)
[junit4:junit4]    > 	at com.carrotsearch.randomizedtesting.RandomizedRunner$2.run(RandomizedRunner.java:551)
[junit4:junit4]    > Caused by: org.apache.lucene.util.ThreadInterruptedException: java.lang.InterruptedException
[junit4:junit4]    > 	at __randomizedtesting.SeedInfo.seed([BE1A80DB98EB0A4D]:0)
[junit4:junit4]    > 	at org.apache.lucene.index.DocumentsWriterStallControl.waitIfStalled(DocumentsWriterStallControl.java:77)
[junit4:junit4]    > 	at org.apache.lucene.index.TestDocumentsWriterStallControl$2.run(TestDocumentsWriterStallControl.java:325)
[junit4:junit4]    > Caused by: java.lang.InterruptedException
[junit4:junit4]    > 	at java.lang.Object.wait(Native Method)
[junit4:junit4]    > 	at java.lang.Object.wait(Object.java:503)
[junit4:junit4]    > 	at org.apache.lucene.index.DocumentsWriterStallControl.waitIfStalled(DocumentsWriterStallControl.java:74)
[junit4:junit4]    > 	... 1 more
[junit4:junit4]    > Throwable #11: java.lang.RuntimeException: Thread threw an uncaught
exception (after termination attempt), thread: Thread[Thread-1374,5,]
[junit4:junit4]    > 	at com.carrotsearch.randomizedtesting.RunnerThreadGroup.processUncaught(RunnerThreadGroup.java:96)
[junit4:junit4]    > 	at com.carrotsearch.randomizedtesting.RandomizedRunner.runSingleTest(RandomizedRunner.java:859)
[junit4:junit4]    > 	at com.carrotsearch.randomizedtesting.RandomizedRunner.access$700(RandomizedRunner.java:132)
[junit4:junit4]    > 	at com.carrotsearch.randomizedtesting.RandomizedRunner$3$1.run(RandomizedRunner.java:671)
[junit4:junit4]    > 	at com.carrotsearch.randomizedtesting.RandomizedRunner$3.evaluate(RandomizedRunner.java:697)
[junit4:junit4]    > 	at com.carrotsearch.randomizedtesting.RandomizedRunner$4.evaluate(RandomizedRunner.java:736)
[junit4:junit4]    > 	at com.carrotsearch.randomizedtesting.RandomizedRunner$5.evaluate(RandomizedRunner.java:747)
[junit4:junit4]    > 	at org.apache.lucene.util.AbstractBeforeAfterRule$1.evaluate(AbstractBeforeAfterRule.java:45)
[junit4:junit4]    > 	at org.apache.lucene.util.TestRuleReportUncaughtExceptions$1.evaluate(TestRuleReportUncaughtExceptions.java:68)
[junit4:junit4]    > 	at org.apache.lucene.util.TestRuleStoreClassName$1.evaluate(TestRuleStoreClassName.java:38)
[junit4:junit4]    > 	at org.apache.lucene.util.TestRuleIcuHack$1.evaluate(TestRuleIcuHack.java:51)
[junit4:junit4]    > 	at com.carrotsearch.randomizedtesting.rules.SystemPropertiesInvariantRule$1.evaluate(SystemPropertiesInvariantRule.java:55)
[junit4:junit4]    > 	at org.apache.lucene.util.TestRuleNoInstanceHooksOverrides$1.evaluate(TestRuleNoInstanceHooksOverrides.java:53)
[junit4:junit4]    > 	at org.apache.lucene.util.TestRuleNoStaticHooksShadowing$1.evaluate(TestRuleNoStaticHooksShadowing.java:52)
[junit4:junit4]    > 	at org.apache.lucene.util.TestRuleAssertionsRequired$1.evaluate(TestRuleAssertionsRequired.java:36)
[junit4:junit4]    > 	at org.apache.lucene.util.TestRuleMarkFailure$1.evaluate(TestRuleMarkFailure.java:48)
[junit4:junit4]    > 	at org.apache.lucene.util.TestRuleIgnoreAfterMaxFailures$1.evaluate(TestRuleIgnoreAfterMaxFailures.java:70)
[junit4:junit4]    > 	at org.apache.lucene.util.TestRuleIgnoreTestSuites$1.evaluate(TestRuleIgnoreTestSuites.java:55)
[junit4:junit4]    > 	at com.carrotsearch.randomizedtesting.RandomizedRunner.runSuite(RandomizedRunner.java:605)
[junit4:junit4]    > 	at com.carrotsearch.randomizedtesting.RandomizedRunner.access$400(RandomizedRunner.java:132)
[junit4:junit4]    > 	at com.carrotsearch.randomizedtesting.RandomizedRunner$2.run(RandomizedRunner.java:551)
[junit4:junit4]    > Caused by: org.apache.lucene.util.ThreadInterruptedException: java.lang.InterruptedException
[junit4:junit4]    > 	at __randomizedtesting.SeedInfo.seed([BE1A80DB98EB0A4D]:0)
[junit4:junit4]    > 	at org.apache.lucene.index.DocumentsWriterStallControl.waitIfStalled(DocumentsWriterStallControl.java:77)
[junit4:junit4]    > 	at org.apache.lucene.index.TestDocumentsWriterStallControl$2.run(TestDocumentsWriterStallControl.java:325)
[junit4:junit4]    > Caused by: java.lang.InterruptedException
[junit4:junit4]    > 	at java.lang.Object.wait(Native Method)
[junit4:junit4]    > 	at java.lang.Object.wait(Object.java:503)
[junit4:junit4]    > 	at org.apache.lucene.index.DocumentsWriterStallControl.waitIfStalled(DocumentsWriterStallControl.java:74)
[junit4:junit4]    > 	... 1 more
[junit4:junit4]    > Throwable #12: java.lang.RuntimeException: Thread threw an uncaught
exception (after termination attempt), thread: Thread[Thread-1375,5,]
[junit4:junit4]    > 	at com.carrotsearch.randomizedtesting.RunnerThreadGroup.processUncaught(RunnerThreadGroup.java:96)
[junit4:junit4]    > 	at com.carrotsearch.randomizedtesting.RandomizedRunner.runSingleTest(RandomizedRunner.java:859)
[junit4:junit4]    > 	at com.carrotsearch.randomizedtesting.RandomizedRunner.access$700(RandomizedRunner.java:132)
[junit4:junit4]    > 	at com.carrotsearch.randomizedtesting.RandomizedRunner$3$1.run(RandomizedRunner.java:671)
[junit4:junit4]    > 	at com.carrotsearch.randomizedtesting.RandomizedRunner$3.evaluate(RandomizedRunner.java:697)
[junit4:junit4]    > 	at com.carrotsearch.randomizedtesting.RandomizedRunner$4.evaluate(RandomizedRunner.java:736)
[junit4:junit4]    > 	at com.carrotsearch.randomizedtesting.RandomizedRunner$5.evaluate(RandomizedRunner.java:747)
[junit4:junit4]    > 	at org.apache.lucene.util.AbstractBeforeAfterRule$1.evaluate(AbstractBeforeAfterRule.java:45)
[junit4:junit4]    > 	at org.apache.lucene.util.TestRuleReportUncaughtExceptions$1.evaluate(TestRuleReportUncaughtExceptions.java:68)
[junit4:junit4]    > 	at org.apache.lucene.util.TestRuleStoreClassName$1.evaluate(TestRuleStoreClassName.java:38)
[junit4:junit4]    > 	at org.apache.lucene.util.TestRuleIcuHack$1.evaluate(TestRuleIcuHack.java:51)
[junit4:junit4]    > 	at com.carrotsearch.randomizedtesting.rules.SystemPropertiesInvariantRule$1.evaluate(SystemPropertiesInvariantRule.java:55)
[junit4:junit4]    > 	at org.apache.lucene.util.TestRuleNoInstanceHooksOverrides$1.evaluate(TestRuleNoInstanceHooksOverrides.java:53)
[junit4:junit4]    > 	at org.apache.lucene.util.TestRuleNoStaticHooksShadowing$1.evaluate(TestRuleNoStaticHooksShadowing.java:52)
[junit4:junit4]    > 	at org.apache.lucene.util.TestRuleAssertionsRequired$1.evaluate(TestRuleAssertionsRequired.java:36)
[junit4:junit4]    > 	at org.apache.lucene.util.TestRuleMarkFailure$1.evaluate(TestRuleMarkFailure.java:48)
[junit4:junit4]    > 	at org.apache.lucene.util.TestRuleIgnoreAfterMaxFailures$1.evaluate(TestRuleIgnoreAfterMaxFailures.java:70)
[junit4:junit4]    > 	at org.apache.lucene.util.TestRuleIgnoreTestSuites$1.evaluate(TestRuleIgnoreTestSuites.java:55)
[junit4:junit4]    > 	at com.carrotsearch.randomizedtesting.RandomizedRunner.runSuite(RandomizedRunner.java:605)
[junit4:junit4]    > 	at com.carrotsearch.randomizedtesting.RandomizedRunner.access$400(RandomizedRunner.java:132)
[junit4:junit4]    > 	at com.carrotsearch.randomizedtesting.RandomizedRunner$2.run(RandomizedRunner.java:551)
[junit4:junit4]    > Caused by: org.apache.lucene.util.ThreadInterruptedException: java.lang.InterruptedException
[junit4:junit4]    > 	at __randomizedtesting.SeedInfo.seed([BE1A80DB98EB0A4D]:0)
[junit4:junit4]    > 	at org.apache.lucene.index.DocumentsWriterStallControl.waitIfStalled(DocumentsWriterStallControl.java:77)
[junit4:junit4]    > 	at org.apache.lucene.index.TestDocumentsWriterStallControl$2.run(TestDocumentsWriterStallControl.java:325)
[junit4:junit4]    > Caused by: java.lang.InterruptedException
[junit4:junit4]    > 	at java.lang.Object.wait(Native Method)
[junit4:junit4]    > 	at java.lang.Object.wait(Object.java:503)
[junit4:junit4]    > 	at org.apache.lucene.index.DocumentsWriterStallControl.waitIfStalled(DocumentsWriterStallControl.java:74)
[junit4:junit4]    > 	... 1 more
[junit4:junit4]    > Throwable #13: java.lang.RuntimeException: Thread threw an uncaught
exception (after termination attempt), thread: Thread[Thread-1372,5,]
[junit4:junit4]    > 	at com.carrotsearch.randomizedtesting.RunnerThreadGroup.processUncaught(RunnerThreadGroup.java:96)
[junit4:junit4]    > 	at com.carrotsearch.randomizedtesting.RandomizedRunner.runSingleTest(RandomizedRunner.java:859)
[junit4:junit4]    > 	at com.carrotsearch.randomizedtesting.RandomizedRunner.access$700(RandomizedRunner.java:132)
[junit4:junit4]    > 	at com.carrotsearch.randomizedtesting.RandomizedRunner$3$1.run(RandomizedRunner.java:671)
[junit4:junit4]    > 	at com.carrotsearch.randomizedtesting.RandomizedRunner$3.evaluate(RandomizedRunner.java:697)
[junit4:junit4]    > 	at com.carrotsearch.randomizedtesting.RandomizedRunner$4.evaluate(RandomizedRunner.java:736)
[junit4:junit4]    > 	at com.carrotsearch.randomizedtesting.RandomizedRunner$5.evaluate(RandomizedRunner.java:747)
[junit4:junit4]    > 	at org.apache.lucene.util.AbstractBeforeAfterRule$1.evaluate(AbstractBeforeAfterRule.java:45)
[junit4:junit4]    > 	at org.apache.lucene.util.TestRuleReportUncaughtExceptions$1.evaluate(TestRuleReportUncaughtExceptions.java:68)
[junit4:junit4]    > 	at org.apache.lucene.util.TestRuleStoreClassName$1.evaluate(TestRuleStoreClassName.java:38)
[junit4:junit4]    > 	at org.apache.lucene.util.TestRuleIcuHack$1.evaluate(TestRuleIcuHack.java:51)
[junit4:junit4]    > 	at com.carrotsearch.randomizedtesting.rules.SystemPropertiesInvariantRule$1.evaluate(SystemPropertiesInvariantRule.java:55)
[junit4:junit4]    > 	at org.apache.lucene.util.TestRuleNoInstanceHooksOverrides$1.evaluate(TestRuleNoInstanceHooksOverrides.java:53)
[junit4:junit4]    > 	at org.apache.lucene.util.TestRuleNoStaticHooksShadowing$1.evaluate(TestRuleNoStaticHooksShadowing.java:52)
[junit4:junit4]    > 	at org.apache.lucene.util.TestRuleAssertionsRequired$1.evaluate(TestRuleAssertionsRequired.java:36)
[junit4:junit4]    > 	at org.apache.lucene.util.TestRuleMarkFailure$1.evaluate(TestRuleMarkFailure.java:48)
[junit4:junit4]    > 	at org.apache.lucene.util.TestRuleIgnoreAfterMaxFailures$1.evaluate(TestRuleIgnoreAfterMaxFailures.java:70)
[junit4:junit4]    > 	at org.apache.lucene.util.TestRuleIgnoreTestSuites$1.evaluate(TestRuleIgnoreTestSuites.java:55)
[junit4:junit4]    > 	at com.carrotsearch.randomizedtesting.RandomizedRunner.runSuite(RandomizedRunner.java:605)
[junit4:junit4]    > 	at com.carrotsearch.randomizedtesting.RandomizedRunner.access$400(RandomizedRunner.java:132)
[junit4:junit4]    > 	at com.carrotsearch.randomizedtesting.RandomizedRunner$2.run(RandomizedRunner.java:551)
[junit4:junit4]    > Caused by: org.apache.lucene.util.ThreadInterruptedException: java.lang.InterruptedException
[junit4:junit4]    > 	at __randomizedtesting.SeedInfo.seed([BE1A80DB98EB0A4D]:0)
[junit4:junit4]    > 	at org.apache.lucene.index.DocumentsWriterStallControl.waitIfStalled(DocumentsWriterStallControl.java:77)
[junit4:junit4]    > 	at org.apache.lucene.index.TestDocumentsWriterStallControl$2.run(TestDocumentsWriterStallControl.java:325)
[junit4:junit4]    > Caused by: java.lang.InterruptedException
[junit4:junit4]    > 	at java.lang.Object.wait(Native Method)
[junit4:junit4]    > 	at java.lang.Object.wait(Object.java:503)
[junit4:junit4]    > 	at org.apache.lucene.index.DocumentsWriterStallControl.waitIfStalled(DocumentsWriterStallControl.java:74)
[junit4:junit4]    > 	... 1 more
[junit4:junit4]    > 
[junit4:junit4]   2> NOTE: reproduce with: ant test  -Dtestcase=TestDocumentsWriterStallControl
-Dtests.method=testSimpleStall -Dtests.seed=BE1A80DB98EB0A4D -Dtests.multiplier=3 -Dtests.slow=true
-Dtests.locale=pt_PT -Dtests.timezone=Australia/Lindeman -Dtests.file.encoding=UTF-8
[junit4:junit4]   2>
[junit4:junit4]    > (@AfterClass output)
[junit4:junit4]   2> NOTE: test params are: codec=Asserting, sim=DefaultSimilarity, locale=pt_PT,
timezone=Australia/Lindeman
[junit4:junit4]   2> NOTE: FreeBSD 9.0-RELEASE amd64/Oracle Corporation 1.7.0_04 (64-bit)/cpus=16,threads=1,free=76655136,total=123731968
[junit4:junit4]   2> NOTE: All tests run in this JVM: [TestLevenshteinAutomata, TestFlushByRamOrCountsPolicy,
TestVersionComparator, TestIndexableField, TestPayloadTermQuery, TestPayloadNearQuery, TestSimpleExplanationsOfNonMatches,
TestExternalCodecs, Nested, TestRegexpQuery, TestDeterminizeLexicon, TestStressIndexing2,
TestSpanSearchEquivalence, TestPulsingReuse, TestTermScorer, TestAssertions, TestPrefixCodedTerms,
TestMultiTermConstantScore, TestNumericUtils, TestNot, InBeforeClass, InAfterClass, InTestMethod,
NonStringProperties, TestDocValuesIndexing, TestPrefixInBooleanQuery, TestFixedBitSet, TestSpansAdvanced2,
TestArrayUtil, TestSpanFirstQuery, TestFileSwitchDirectory, TestSearchAfter, Test2BTerms,
TestSort, TestWindowsMMap, TestSnapshotDeletionPolicy, NestedSetupChain, NestedTeardownChain,
TestPriorityQueue, TestIndexWriterReader, TestIndexWriter, TestMockCharFilter, TestDocumentWriter,
TestSegmentReader, TestPayloadProcessorProvider, TestFlex, TestDocBoost, TestByteBlockPool,
TestMaxTermFrequency, TestIndexWriterWithThreads, TestIndexWriterCommit, TestDocValues, Nested,
TestSizeBoundedForceMerge, TestIndexCommit, TestCharsRef, TestCopyBytes, TestOmitNorms, TestFieldCacheRangeFilter,
TestTopDocsCollector, TestDeletionPolicy, TestCharFilter, TestBytesRef, TestBooleanQueryVisitSubscorers,
TestSearchForDuplicates, TestTermdocPerf, TestSetOnce, TestTransactionRollback, TestSearch,
TestRollingCharBuffer, TestAllFilesHaveCodecHeader, TestRegexpRandom, TestParallelReaderEmptyIndex,
TestFieldInfos, TestDateSort, TestElevationComparator, TestBooleanScorer, TestPagedBytes,
TestPositionIncrement, TestFieldCache, TestSloppyPhraseQuery, TestPackedInts, TestGraphTokenizers,
TestShardSearching, TestSearcherManager, TestBasics, TestByteSlices, TestTermsEnum, TestTimeLimitingCollector,
TestNeverDelete, TestMinimize, TestPersistentSnapshotDeletionPolicy, TestBackwardsCompatibility,
TestIndexWriterUnicode, TestDirectoryReaderReopen, TestBufferedIndexInput, TestIndexWriterForceMerge,
TestWeakIdentityMap, TestTypePromotion, TestCompoundFile, TestMockAnalyzer, TestDocumentsWriterStallControl]
[junit4:junit4]   2> 
[junit4:junit4] Completed on J0 in 14.70s, 3 tests, 1 error <<< FAILURES!
[...truncated 365 lines...]

[...truncated 1505 lines...]

[...truncated 1505 lines...]

[...truncated 1505 lines...]

[...truncated 1505 lines...]

[...truncated 1493 lines...]
BUILD FAILED
/usr/home/hudson/hudson-slave/workspace/Lucene-Solr-tests-only-trunk-java7/checkout/build.xml:29:
The following error occurred while executing this line:
/usr/home/hudson/hudson-slave/workspace/Lucene-Solr-tests-only-trunk-java7/checkout/lucene/build.xml:50:
The following error occurred while executing this line:
/usr/home/hudson/hudson-slave/workspace/Lucene-Solr-tests-only-trunk-java7/checkout/lucene/common-build.xml:1094:
The following error occurred while executing this line:
/usr/home/hudson/hudson-slave/workspace/Lucene-Solr-tests-only-trunk-java7/checkout/lucene/common-build.xml:789:
There were test failures: 304 suites, 1720 tests, 1 error, 11 ignored (9 assumptions)

Total time: 5 minutes 54 seconds
Build step 'Execute shell' marked build as failure
Archiving artifacts
Recording test results
Email was triggered for: Failure
Sending email for trigger: Failure



Mime
View raw message