lucene-dev mailing list archives

Site index · List index
Message view « Date » · « Thread »
Top « Date » · « Thread »
From Apache Jenkins Server <jenk...@builds.apache.org>
Subject [JENKINS] Lucene-Solr-tests-only-4.x-java7 - Build # 82 - Failure
Date Wed, 04 Jul 2012 13:29:05 GMT
Build: https://builds.apache.org/job/Lucene-Solr-tests-only-4.x-java7/82/

1 tests failed.
REGRESSION:  org.apache.solr.search.TestRealTimeGet.testStressReorderVersions

Error Message:
Thread threw an uncaught exception, thread: Thread[READER2,5,]

Stack Trace:
java.lang.RuntimeException: Thread threw an uncaught exception, thread: Thread[READER2,5,]
	at com.carrotsearch.randomizedtesting.RunnerThreadGroup.processUncaught(RunnerThreadGroup.java:96)
	at com.carrotsearch.randomizedtesting.RandomizedRunner.runSingleTest(RandomizedRunner.java:857)
	at com.carrotsearch.randomizedtesting.RandomizedRunner.access$700(RandomizedRunner.java:132)
	at com.carrotsearch.randomizedtesting.RandomizedRunner$3$1.run(RandomizedRunner.java:669)
	at com.carrotsearch.randomizedtesting.RandomizedRunner$3.evaluate(RandomizedRunner.java:695)
	at com.carrotsearch.randomizedtesting.RandomizedRunner$4.evaluate(RandomizedRunner.java:734)
	at com.carrotsearch.randomizedtesting.RandomizedRunner$5.evaluate(RandomizedRunner.java:745)
	at com.carrotsearch.randomizedtesting.rules.SystemPropertiesRestoreRule$1.evaluate(SystemPropertiesRestoreRule.java:53)
	at org.apache.lucene.util.AbstractBeforeAfterRule$1.evaluate(AbstractBeforeAfterRule.java:45)
	at org.apache.lucene.util.TestRuleReportUncaughtExceptions$1.evaluate(TestRuleReportUncaughtExceptions.java:68)
	at org.apache.lucene.util.TestRuleStoreClassName$1.evaluate(TestRuleStoreClassName.java:38)
	at org.apache.lucene.util.TestRuleIcuHack$1.evaluate(TestRuleIcuHack.java:51)
	at com.carrotsearch.randomizedtesting.rules.SystemPropertiesInvariantRule$1.evaluate(SystemPropertiesInvariantRule.java:55)
	at org.apache.lucene.util.TestRuleNoInstanceHooksOverrides$1.evaluate(TestRuleNoInstanceHooksOverrides.java:53)
	at org.apache.lucene.util.TestRuleNoStaticHooksShadowing$1.evaluate(TestRuleNoStaticHooksShadowing.java:52)
	at org.apache.lucene.util.TestRuleAssertionsRequired$1.evaluate(TestRuleAssertionsRequired.java:36)
	at org.apache.lucene.util.TestRuleMarkFailure$1.evaluate(TestRuleMarkFailure.java:48)
	at org.apache.lucene.util.TestRuleIgnoreAfterMaxFailures$1.evaluate(TestRuleIgnoreAfterMaxFailures.java:70)
	at org.apache.lucene.util.TestRuleIgnoreTestSuites$1.evaluate(TestRuleIgnoreTestSuites.java:55)
	at com.carrotsearch.randomizedtesting.RandomizedRunner.runSuite(RandomizedRunner.java:605)
	at com.carrotsearch.randomizedtesting.RandomizedRunner.access$400(RandomizedRunner.java:132)
	at com.carrotsearch.randomizedtesting.RandomizedRunner$2.run(RandomizedRunner.java:551)
Caused by: java.lang.RuntimeException: java.lang.AssertionError
	at __randomizedtesting.SeedInfo.seed([1667350F8A858E70]:0)
	at org.apache.solr.search.TestRealTimeGet$6.run(TestRealTimeGet.java:1264)
Caused by: java.lang.AssertionError
	at org.junit.Assert.fail(Assert.java:92)
	at org.junit.Assert.assertTrue(Assert.java:43)
	at org.junit.Assert.assertTrue(Assert.java:54)
	at org.apache.solr.search.TestRealTimeGet$6.run(TestRealTimeGet.java:1257)




Build Log:
[...truncated 48350 lines...]
   [junit4]   2> 	at org.junit.Assert.assertTrue(Assert.java:43)
   [junit4]   2> 	at org.junit.Assert.assertTrue(Assert.java:54)
   [junit4]   2> 	at org.apache.solr.search.TestRealTimeGet$6.run(TestRealTimeGet.java:1257)
   [junit4]   2> 
   [junit4]   2> 17266 T1575 oash.JsonUpdateRequestHandler.init WARNING Using deprecated
class: JsonUpdateRequestHandler -- replace with UpdateRequestHandler
   [junit4]   2> 17267 T1571 C82 oass.SolrIndexSearcher.<init> Opening Searcher@3a01114e
realtime
   [junit4]   2> 17267 T1571 C82 oass.SolrIndexSearcher.<init> WARNING WARNING: Directory
impl does not support setting indexDir: org.apache.lucene.store.MockDirectoryWrapper
   [junit4]   2> 17268 T1571 C82 REQ [collection1] webapp=null path=null params={update.distrib=FROMLEADER&versions=true&wt=json&indent=true}
status=0 QTime=82 
   [junit4]   2> 17268 T1584 oash.JsonUpdateRequestHandler.init WARNING Using deprecated
class: JsonUpdateRequestHandler -- replace with UpdateRequestHandler
   [junit4]   2> 17268 T1573 C82 REQ [collection1] webapp=null path=null params={update.distrib=FROMLEADER&versions=true&wt=json&indent=true}
status=0 QTime=20 
   [junit4]   2> 17268 T1591 C82 REQ [collection1] webapp=null path=null params={update.distrib=FROMLEADER&versions=true&wt=json&indent=true}
status=0 QTime=34 
   [junit4]   2> 17268 T1586 oash.JsonUpdateRequestHandler.init WARNING Using deprecated
class: JsonUpdateRequestHandler -- replace with UpdateRequestHandler
   [junit4]   2> 17268 T1598 C82 REQ [collection1] webapp=null path=null params={ids=16&qt=/get&wt=json}
status=0 QTime=14 
   [junit4]   2> 17269 T1602 C82 REQ [collection1] webapp=null path=null params={ids=18&qt=/get&wt=json}
status=0 QTime=13 
   [junit4]   2> 17269 T1602 oass.TestRealTimeGet$6.run SEVERE  java.lang.AssertionError
   [junit4]   2> 	at org.junit.Assert.fail(Assert.java:92)
   [junit4]   2> 	at org.junit.Assert.assertTrue(Assert.java:43)
   [junit4]   2> 	at org.junit.Assert.assertTrue(Assert.java:54)
   [junit4]   2> 	at org.apache.solr.search.TestRealTimeGet$6.run(TestRealTimeGet.java:1257)
   [junit4]   2> 
   [junit4]   2> 17270 T1602 ccr.RunnerThreadGroup.uncaughtException WARNING RunnerThreadGroup's
sub thread threw an uncaught exception. java.lang.RuntimeException: java.lang.AssertionError
   [junit4]   2> 	at org.apache.solr.search.TestRealTimeGet$6.run(TestRealTimeGet.java:1264)
   [junit4]   2> Caused by: java.lang.AssertionError
   [junit4]   2> 	at org.junit.Assert.fail(Assert.java:92)
   [junit4]   2> 	at org.junit.Assert.assertTrue(Assert.java:43)
   [junit4]   2> 	at org.junit.Assert.assertTrue(Assert.java:54)
   [junit4]   2> 	at org.apache.solr.search.TestRealTimeGet$6.run(TestRealTimeGet.java:1257)
   [junit4]   2> 
   [junit4]   2> 17270 T1594 oash.JsonUpdateRequestHandler.init WARNING Using deprecated
class: JsonUpdateRequestHandler -- replace with UpdateRequestHandler
   [junit4]   2> 17270 T1578 oash.JsonUpdateRequestHandler.init WARNING Using deprecated
class: JsonUpdateRequestHandler -- replace with UpdateRequestHandler
   [junit4]   2> 17270 T1593 oash.JsonUpdateRequestHandler.init WARNING Using deprecated
class: JsonUpdateRequestHandler -- replace with UpdateRequestHandler
   [junit4]   2> 17270 T1583 oash.JsonUpdateRequestHandler.init WARNING Using deprecated
class: JsonUpdateRequestHandler -- replace with UpdateRequestHandler
   [junit4]   2> 17272 T1581 C82 oass.SolrIndexSearcher.<init> Opening Searcher@50d6d249
realtime
   [junit4]   2> 17272 T1581 C82 oass.SolrIndexSearcher.<init> WARNING WARNING: Directory
impl does not support setting indexDir: org.apache.lucene.store.MockDirectoryWrapper
   [junit4]   2> 17273 T1581 C82 REQ [collection1] webapp=null path=null params={update.distrib=FROMLEADER&versions=true&wt=json&indent=true}
status=0 QTime=87 
   [junit4]   2> 17273 T1595 C82 REQ [collection1] webapp=null path=null params={update.distrib=FROMLEADER&versions=true&wt=json&indent=true}
status=0 QTime=86 
   [junit4]   2> 17273 T1585 C82 REQ [collection1] webapp=null path=null params={update.distrib=FROMLEADER&versions=true&wt=json&indent=true}
status=0 QTime=26 
   [junit4]   2> 17273 T1577 C82 REQ [collection1] webapp=null path=null params={update.distrib=FROMLEADER&versions=true&wt=json&indent=true}
status=0 QTime=38 
   [junit4]   2> 17273 T1570 C82 REQ [collection1] webapp=null path=null params={update.distrib=FROMLEADER&versions=true&wt=json&indent=true}
status=0 QTime=25 
   [junit4]   2> 17273 T1592 C82 REQ [collection1] webapp=null path=null params={update.distrib=FROMLEADER&versions=true&wt=json&indent=true}
status=0 QTime=50 
   [junit4]   2> 17274 T1589 oash.JsonUpdateRequestHandler.init WARNING Using deprecated
class: JsonUpdateRequestHandler -- replace with UpdateRequestHandler
   [junit4]   2> 17275 T1579 C82 oass.SolrIndexSearcher.<init> Opening Searcher@79d1810a
main
   [junit4]   2> 17275 T1579 C82 oass.SolrIndexSearcher.<init> WARNING WARNING: Directory
impl does not support setting indexDir: org.apache.lucene.store.MockDirectoryWrapper
   [junit4]   2> 17278 T1507 oasc.SolrCore.registerSearcher [collection1] Registered new
searcher Searcher@79d1810a main{StandardDirectoryReader(segments_5r:3506:nrt _ys(4.0):C11/8
_yn(4.0):C6/5 _yu(4.0):C5/4 _z0(4.0):C3/2 _z2(4.0):C3 _z3(4.0):C2 _z4(4.0):C2 _z6(4.0):C1
_z7(4.0):C1)}
   [junit4]   2> 17278 T1579 C82 oasu.DirectUpdateHandler2.commit end_commit_flush
   [junit4]   2> 17279 T1579 C82 UPDATE [collection1] webapp=null path=null params={} {commit=}
0 77
   [junit4]   2> 17279 T1582 C82 oasu.DirectUpdateHandler2.commit start commit{flags=0,version=0,optimize=false,openSearcher=true,waitSearcher=true,expungeDeletes=false,softCommit=false}
   [junit4]   2> 17280 T1582 C82 oasc.SolrDeletionPolicy.onCommit SolrDeletionPolicy.onCommit:
commits:num=2
   [junit4]   2> 		commit{dir=MockDirWrapper(org.apache.lucene.store.RAMDirectory@19a62d0
lockFactory=org.apache.lucene.store.NativeFSLockFactory@16d02104),segFN=segments_5r,generation=207,filenames=[_ys_Lucene40_0.frq,
_z0_1.del, _yz.fnm, _yz_Lucene40_0.frq, _z0_Lucene40_0.frq, _ys_Lucene40_0.tim, _z0.fdx, _ys_Lucene40_0.tip,
_z0.fdt, _yz.fdt, _ys.fnm, _yu_Lucene40_0.frq, _yz.fdx, _yw_1.del, _yz_Lucene40_0.tip, _yw.si,
_yz_Lucene40_0.tim, _yn.fdt, _yy.si, _yn.fdx, _z0.fnm, _yw.fdx, _yw_Lucene40_0.frq, _yw.fdt,
segments_5r, _yu.si, _yw.fnm, _yu.fnm, _yy.fdx, _yn_Lucene40_0.frq, _yy_Lucene40_0.tip, _yu_Lucene40_0.tim,
_yy.fdt, _z0.si, _ys_1.del, _yu_2.del, _yy_Lucene40_0.tim, _yn.si, _ys.si, _z0_Lucene40_0.tip,
_yw_Lucene40_0.tim, _yz.si, _yu_Lucene40_0.tip, _z0_Lucene40_0.tim, _yw_Lucene40_0.tip, _ys.fdx,
_yn_Lucene40_0.tip, _yn_Lucene40_0.tim, _ys.fdt, _yn_2.del, _yu.fdt, _yy_Lucene40_0.frq, _yu.fdx,
_yn.fnm, _yy.fnm]
   [junit4]   2> 		commit{dir=MockDirWrapper(org.apache.lucene.store.RAMDirectory@19a62d0
lockFactory=org.apache.lucene.store.NativeFSLockFactory@16d02104),segFN=segments_5s,generation=208,filenames=[_z6_Lucene40_0.tim,
_ys_Lucene40_0.frq, _yu_3.del, _z4_Lucene40_0.frq, _z4.si, _z3.si, _z0_Lucene40_0.frq, _z2_Lucene40_0.tim,
_ys_Lucene40_0.tim, _z0.fdx, _z2_Lucene40_0.tip, _z7_Lucene40_0.frq, _ys_Lucene40_0.tip, _z0.fdt,
_z2.si, _z2_Lucene40_0.frq, _ys.fnm, _z7.fdt, _yu_Lucene40_0.frq, _z6.fdx, _z6.fdt, _z7.fdx,
_z4_Lucene40_0.tip, _z0_2.del, _z2.fnm, _z3.fdt, _yn.fdt, _z3.fdx, _z7.fnm, _z4_Lucene40_0.tim,
_yn.fdx, _z2.fdx, _z0.fnm, _z3.fnm, _z7.si, _z6.fnm, _z3_Lucene40_0.tip, segments_5s, _z3_Lucene40_0.tim,
_yu.si, _z6_Lucene40_0.frq, _yu.fnm, _yn_Lucene40_0.frq, _z7_Lucene40_0.tip, _z7_Lucene40_0.tim,
_yu_Lucene40_0.tim, _z0.si, _ys_1.del, _yn.si, _ys.si, _z0_Lucene40_0.tip, _z4.fnm, _z6.si,
_yu_Lucene40_0.tip, _z0_Lucene40_0.tim, _z3_Lucene40_0.frq, _z4.fdt, _ys.fdx, _z4.fdx, _yn_Lucene40_0.tip,
_yn_Lucene40_0.tim, _ys.fdt, _yn_2.del, _yu.fdt, _yu.fdx, _yn.fnm, _z2.fdt, _z6_Lucene40_0.tip]
   [junit4]   2> 17280 T1582 C82 oasc.SolrDeletionPolicy.updateCommits newest commit =
208
   [junit4]   2> 17281 T1582 C82 oass.SolrIndexSearcher.<init> Opening Searcher@4c77ae13
main
   [junit4]   2> 17281 T1582 C82 oass.SolrIndexSearcher.<init> WARNING WARNING: Directory
impl does not support setting indexDir: org.apache.lucene.store.MockDirectoryWrapper
   [junit4]   2> 17282 T1507 oasc.SolrCore.registerSearcher [collection1] Registered new
searcher Searcher@4c77ae13 main{StandardDirectoryReader(segments_5r:3506:nrt _ys(4.0):C11/8
_yn(4.0):C6/5 _yu(4.0):C5/4 _z0(4.0):C3/2 _z2(4.0):C3 _z3(4.0):C2 _z4(4.0):C2 _z6(4.0):C1
_z7(4.0):C1)}
   [junit4]   2> 17282 T1582 C82 oasu.DirectUpdateHandler2.commit end_commit_flush
   [junit4]   2> 17282 T1582 C82 UPDATE [collection1] webapp=null path=null params={} {commit=}
0 59
   [junit4]   2> 17283 T1580 C82 REQ [collection1] webapp=null path=null params={_version_=-3392&update.distrib=FROMLEADER&versions=true&wt=json&indent=true}
status=0 QTime=35 
   [junit4]   2> 17284 T1590 C82 REQ [collection1] webapp=null path=null params={_version_=-3391&update.distrib=FROMLEADER&versions=true&wt=json&indent=true}
status=0 QTime=36 
   [junit4]   2> 17284 T1576 C82 oasu.DirectUpdateHandler2.commit start commit{flags=0,version=0,optimize=false,openSearcher=true,waitSearcher=true,expungeDeletes=false,softCommit=true}
   [junit4]   2> 17284 T1588 C82 REQ [collection1] webapp=null path=null params={_version_=-3390&update.distrib=FROMLEADER&versions=true&wt=json&indent=true}
status=0 QTime=36 
   [junit4]   2> 17284 T1587 C82 REQ [collection1] webapp=null path=null params={update.distrib=FROMLEADER&versions=true&wt=json&indent=true}
status=0 QTime=36 
   [junit4]   2> 17284 T1596 C82 REQ [collection1] webapp=null path=null params={update.distrib=FROMLEADER&versions=true&wt=json&indent=true}
status=0 QTime=34 
   [junit4]   2> 17285 T1574 C82 REQ [collection1] webapp=null path=null params={update.distrib=FROMLEADER&versions=true&wt=json&indent=true}
status=0 QTime=25 
   [junit4]   2> 17288 T1576 C82 oass.SolrIndexSearcher.<init> Opening Searcher@11649b69
main
   [junit4]   2> 17288 T1576 C82 oass.SolrIndexSearcher.<init> WARNING WARNING: Directory
impl does not support setting indexDir: org.apache.lucene.store.MockDirectoryWrapper
   [junit4]   2> 17289 T1576 C82 oasu.DirectUpdateHandler2.commit end_commit_flush
   [junit4]   2> 17289 T1507 oasc.SolrCore.registerSearcher [collection1] Registered new
searcher Searcher@11649b69 main{StandardDirectoryReader(segments_5s:3509:nrt _ys(4.0):C11/9
_yn(4.0):C6/5 _yu(4.0):C5/4 _z0(4.0):C3/2 _z2(4.0):C3/1 _z3(4.0):C2/1 _z4(4.0):C2 _z6(4.0):C1
_z7(4.0):C1 _z8(4.0):C2/1)}
   [junit4]   2> 17289 T1576 C82 UPDATE [collection1] webapp=null path=null params={} {commit=}
0 32
   [junit4]   2> 17291 T1572 C82 oass.SolrIndexSearcher.<init> Opening Searcher@1e937459
realtime
   [junit4]   2> 17291 T1572 C82 oass.SolrIndexSearcher.<init> WARNING WARNING: Directory
impl does not support setting indexDir: org.apache.lucene.store.MockDirectoryWrapper
   [junit4]   2> 17291 T1572 C82 REQ [collection1] webapp=null path=null params={_version_=-3400&update.distrib=FROMLEADER&versions=true&wt=json&indent=true}
status=0 QTime=26 
   [junit4]   2> 17292 T1593 C82 REQ [collection1] webapp=null path=null params={update.distrib=FROMLEADER&versions=true&wt=json&indent=true}
status=0 QTime=22 
   [junit4]   2> 17296 T1575 C82 oass.SolrIndexSearcher.<init> Opening Searcher@571a1b1
realtime
   [junit4]   2> 17296 T1575 C82 oass.SolrIndexSearcher.<init> WARNING WARNING: Directory
impl does not support setting indexDir: org.apache.lucene.store.MockDirectoryWrapper
   [junit4]   2> 17296 T1575 C82 REQ [collection1] webapp=null path=null params={update.distrib=FROMLEADER&versions=true&wt=json&indent=true}
status=0 QTime=30 
   [junit4]   2> 17296 T1586 C82 REQ [collection1] webapp=null path=null params={update.distrib=FROMLEADER&versions=true&wt=json&indent=true}
status=0 QTime=27 
   [junit4]   2> 17296 T1578 C82 REQ [collection1] webapp=null path=null params={update.distrib=FROMLEADER&versions=true&wt=json&indent=true}
status=0 QTime=26 
   [junit4]   2> 17296 T1583 C82 REQ [collection1] webapp=null path=null params={update.distrib=FROMLEADER&versions=true&wt=json&indent=true}
status=0 QTime=26 
   [junit4]   2> 17297 T1584 C82 REQ [collection1] webapp=null path=null params={update.distrib=FROMLEADER&versions=true&wt=json&indent=true}
status=0 QTime=29 
   [junit4]   2> 17300 T1594 C82 oass.SolrIndexSearcher.<init> Opening Searcher@4fa04fd6
realtime
   [junit4]   2> 17300 T1594 C82 oass.SolrIndexSearcher.<init> WARNING WARNING: Directory
impl does not support setting indexDir: org.apache.lucene.store.MockDirectoryWrapper
   [junit4]   2> 17300 T1594 C82 REQ [collection1] webapp=null path=null params={_version_=-3404&update.distrib=FROMLEADER&versions=true&wt=json&indent=true}
status=0 QTime=30 
   [junit4]   2> 17301 T1589 C82 REQ [collection1] webapp=null path=null params={_version_=-3407&update.distrib=FROMLEADER&versions=true&wt=json&indent=true}
status=0 QTime=27 
   [junit4]   2> 17302 T1506 oas.SolrTestCaseJ4.tearDown ###Ending testStressReorderVersions
   [junit4]   2> NOTE: reproduce with: ant test  -Dtestcase=TestRealTimeGet -Dtests.method=testStressReorderVersions
-Dtests.seed=1667350F8A858E70 -Dtests.multiplier=3 -Dtests.slow=true -Dtests.locale=en_PH
-Dtests.timezone=America/Recife -Dargs="-Dfile.encoding=US-ASCII"
   [junit4]   2>
   [junit4]    > (@AfterClass output)
   [junit4]   2> 41088 T1506 oas.SolrTestCaseJ4.deleteCore ###deleteCore
   [junit4]   2> 41089 T1506 oasc.CoreContainer.shutdown Shutting down CoreContainer instance=1311337631
   [junit4]   2> 41089 T1506 oasc.SolrCore.close [collection1]  CLOSING SolrCore org.apache.solr.core.SolrCore@5ac5c78c
   [junit4]   2> 41089 T1506 oasc.SolrCore.closeSearcher [collection1] Closing main searcher
on request.
   [junit4]   2> 41089 T1506 oasu.DirectUpdateHandler2.close closing DirectUpdateHandler2{commits=2046,autocommits=0,soft
autocommits=0,optimizes=0,rollbacks=0,expungeDeletes=0,docsPending=2,adds=2,deletesById=1,deletesByQuery=1,errors=7,cumulative_adds=4698,cumulative_deletesById=1767,cumulative_deletesByQuery=196,cumulative_errors=7}
   [junit4]   2> 41090 T1506 C82 oasc.SolrDeletionPolicy.onCommit SolrDeletionPolicy.onCommit:
commits:num=2
   [junit4]   2> 		commit{dir=MockDirWrapper(org.apache.lucene.store.RAMDirectory@19a62d0
lockFactory=org.apache.lucene.store.NativeFSLockFactory@16d02104),segFN=segments_8z,generation=323,filenames=[_19l.fdt,
_19l.fnm, _19l.si, _19l_Lucene40_0.tim, _19l_Lucene40_0.tip, _19l_Lucene40_0.frq, _19l.fdx,
segments_8z]
   [junit4]   2> 		commit{dir=MockDirWrapper(org.apache.lucene.store.RAMDirectory@19a62d0
lockFactory=org.apache.lucene.store.NativeFSLockFactory@16d02104),segFN=segments_90,generation=324,filenames=[_19m.fdx,
_19m_Lucene40_0.frq, _19m.si, _19m_Lucene40_0.tim, _19m_1.del, _19m.fnm, segments_90, _19m.fdt,
_19m_Lucene40_0.tip]
   [junit4]   2> 41090 T1506 C82 oasc.SolrDeletionPolicy.updateCommits newest commit =
324
   [junit4]   2> NOTE: test params are: codec=SimpleText, sim=DefaultSimilarity, locale=en_PH,
timezone=America/Recife
   [junit4]   2> NOTE: FreeBSD 9.0-RELEASE amd64/Oracle Corporation 1.7.0_04 (64-bit)/cpus=16,threads=1,free=95227528,total=369098752
   [junit4]   2> NOTE: All tests run in this JVM: [TermVectorComponentTest, TestSort, SampleTest,
TestLRUCache, TestRemoteStreaming, TestFastLRUCache, TestPropInjectDefaults, StandardRequestHandlerTest,
DocumentAnalysisRequestHandlerTest, SuggesterFSTTest, QueryEqualityTest, TestHungarianLightStemFilterFactory,
TestCSVResponseWriter, TestCollationKeyFilterFactory, TestGermanMinimalStemFilterFactory,
SolrPluginUtilsTest, FieldAnalysisRequestHandlerTest, SearchHandlerTest, TestHunspellStemFilterFactory,
UpdateParamsTest, LengthFilterTest, TestReplicationHandler, CommonGramsFilterFactoryTest,
TestRussianLightStemFilterFactory, TestPorterStemFilterFactory, TestGalicianMinimalStemFilterFactory,
TestGroupingSearch, TestIndonesianStemFilterFactory, TestStopFilterFactory, TestIndexSearcher,
TestGreekStemFilterFactory, TestValueSourceCache, TestDocSet, TestPluginEnable, TestReverseStringFilterFactory,
LeaderElectionTest, FullSolrCloudTest, TestRangeQuery, TestBeiderMorseFilterFactory, PolyFieldTest,
TestSolrDeletionPolicy2, TestKeepFilterFactory, TestSolrDeletionPolicy1, TestLuceneMatchVersion,
UniqFieldsUpdateProcessorFactoryTest, HighlighterConfigTest, TestConfig, TestBinaryResponseWriter,
IndexSchemaTest, BasicZkTest, TestCoreContainer, TestIBSimilarityFactory, TestRussianFilters,
TestPersianNormalizationFilterFactory, TestXIncludeConfig, PrimUtilsTest, SpellCheckComponentTest,
IndexSchemaRuntimeFieldTest, SpellCheckCollatorTest, MultiTermTest, FileBasedSpellCheckerTest,
TestTrie, AlternateDirectoryTest, TestDefaultSimilarityFactory, TestOmitPositions, TestPseudoReturnFields,
TestJmxMonitoredMap, TestRecovery, TestJapaneseReadingFormFilterFactory, TestEnglishMinimalStemFilterFactory,
IndexReaderFactoryTest, LoggingHandlerTest, SolrCoreTest, NotRequiredUniqueKeyTest, TestChineseFilterFactory,
TestGermanNormalizationFilterFactory, TestPatternReplaceFilterFactory, TestTurkishLowerCaseFilterFactory,
WordBreakSolrSpellCheckerTest, TestLMJelinekMercerSimilarityFactory, CSVRequestHandlerTest,
URLClassifyProcessorTest, TestNGramFilters, TestSuggestSpellingConverter, TestMultiWordSynonyms,
ResourceLoaderTest, QueryParsingTest, TestArbitraryIndexDir, SortByFunctionTest, TestQuerySenderNoQuery,
ZkSolrClientTest, DistanceFunctionTest, DocumentBuilderTest, SoftAutoCommitTest, TestCollationField,
TestWriterPerf, UUIDFieldTest, FieldMutatingUpdateProcessorTest, TestUAX29URLEmailTokenizerFactory,
DirectSolrConnectionTest, ZkControllerTest, TestShingleFilterFactory, OverseerTest, TestRealTimeGet]
   [junit4]   2> 
   [junit4] Completed on J1 in 41.15s, 8 tests, 1 error <<< FAILURES!
[...truncated 215 lines...]

[...truncated 48666 lines...]

[...truncated 48666 lines...]

[...truncated 48666 lines...]

[...truncated 107 lines...]
ERROR: Failed to update http://svn.apache.org/repos/asf/lucene/dev/branches/branch_4x
org.tmatesoft.svn.core.SVNException: svn: E175002: OPTIONS /repos/asf/lucene/dev/branches/branch_4x
failed
	at org.tmatesoft.svn.core.internal.io.dav.http.HTTPConnection.request(HTTPConnection.java:304)
	at org.tmatesoft.svn.core.internal.io.dav.http.HTTPConnection.request(HTTPConnection.java:289)
	at org.tmatesoft.svn.core.internal.io.dav.http.HTTPConnection.request(HTTPConnection.java:277)
	at org.tmatesoft.svn.core.internal.io.dav.DAVConnection.performHttpRequest(DAVConnection.java:696)
	at org.tmatesoft.svn.core.internal.io.dav.DAVConnection.exchangeCapabilities(DAVConnection.java:619)
	at org.tmatesoft.svn.core.internal.io.dav.DAVConnection.open(DAVConnection.java:103)
	at org.tmatesoft.svn.core.internal.io.dav.DAVRepository.openConnection(DAVRepository.java:1018)
	at org.tmatesoft.svn.core.internal.io.dav.DAVRepository.getRepositoryUUID(DAVRepository.java:148)
	at org.tmatesoft.svn.core.internal.wc16.SVNBasicDelegate.createRepository(SVNBasicDelegate.java:339)
	at org.tmatesoft.svn.core.internal.wc16.SVNBasicDelegate.createRepository(SVNBasicDelegate.java:328)
	at org.tmatesoft.svn.core.internal.wc16.SVNUpdateClient16.update(SVNUpdateClient16.java:532)
	at org.tmatesoft.svn.core.internal.wc16.SVNUpdateClient16.doUpdate(SVNUpdateClient16.java:414)
	at org.tmatesoft.svn.core.internal.wc16.SVNUpdateClient16.doUpdate(SVNUpdateClient16.java:324)
	at org.tmatesoft.svn.core.internal.wc2.old.SvnOldUpdate.run(SvnOldUpdate.java:27)
	at org.tmatesoft.svn.core.internal.wc2.old.SvnOldUpdate.run(SvnOldUpdate.java:11)
	at org.tmatesoft.svn.core.internal.wc2.SvnOperationRunner.run(SvnOperationRunner.java:20)
	at org.tmatesoft.svn.core.wc2.SvnOperationFactory.run(SvnOperationFactory.java:1221)
	at org.tmatesoft.svn.core.wc2.SvnOperation.run(SvnOperation.java:292)
	at org.tmatesoft.svn.core.wc.SVNUpdateClient.doUpdate(SVNUpdateClient.java:315)
	at org.tmatesoft.svn.core.wc.SVNUpdateClient.doUpdate(SVNUpdateClient.java:295)
	at org.tmatesoft.svn.core.wc.SVNUpdateClient.doUpdate(SVNUpdateClient.java:391)
	at hudson.scm.subversion.UpdateUpdater$TaskImpl.perform(UpdateUpdater.java:136)
	at hudson.scm.subversion.WorkspaceUpdater$UpdateTask.delegateTo(WorkspaceUpdater.java:144)
	at hudson.scm.SubversionSCM$CheckOutTask.perform(SubversionSCM.java:789)
	at hudson.scm.SubversionSCM$CheckOutTask.invoke(SubversionSCM.java:770)
	at hudson.scm.SubversionSCM$CheckOutTask.invoke(SubversionSCM.java:753)
	at hudson.FilePath$FileCallableWrapper.call(FilePath.java:2196)
	at hudson.remoting.UserRequest.perform(UserRequest.java:118)
	at hudson.remoting.UserRequest.perform(UserRequest.java:48)
	at hudson.remoting.Request$2.run(Request.java:326)
	at hudson.remoting.InterceptingExecutorService$1.call(InterceptingExecutorService.java:72)
	at java.util.concurrent.FutureTask$Sync.innerRun(FutureTask.java:334)
	at java.util.concurrent.FutureTask.run(FutureTask.java:166)
	at java.util.concurrent.ThreadPoolExecutor.runWorker(ThreadPoolExecutor.java:1110)
	at java.util.concurrent.ThreadPoolExecutor$Worker.run(ThreadPoolExecutor.java:603)
	at java.lang.Thread.run(Thread.java:679)
Caused by: svn: E175002: OPTIONS /repos/asf/lucene/dev/branches/branch_4x failed
	at org.tmatesoft.svn.core.SVNErrorMessage.create(SVNErrorMessage.java:208)
	at org.tmatesoft.svn.core.SVNErrorMessage.create(SVNErrorMessage.java:154)
	at org.tmatesoft.svn.core.SVNErrorMessage.create(SVNErrorMessage.java:97)
	... 36 more
Caused by: org.tmatesoft.svn.core.SVNException: svn: E175002: OPTIONS request failed on '/repos/asf/lucene/dev/branches/branch_4x'
svn: E175002: Broken pipe
	at org.tmatesoft.svn.core.internal.wc.SVNErrorManager.error(SVNErrorManager.java:64)
	at org.tmatesoft.svn.core.internal.wc.SVNErrorManager.error(SVNErrorManager.java:51)
	at org.tmatesoft.svn.core.internal.io.dav.http.HTTPConnection._request(HTTPConnection.java:681)
	at org.tmatesoft.svn.core.internal.io.dav.http.HTTPConnection.request(HTTPConnection.java:298)
	... 35 more
Caused by: svn: E175002: OPTIONS request failed on '/repos/asf/lucene/dev/branches/branch_4x'
	at org.tmatesoft.svn.core.SVNErrorMessage.create(SVNErrorMessage.java:208)
	at org.tmatesoft.svn.core.internal.io.dav.http.HTTPConnection._request(HTTPConnection.java:679)
	... 36 more
Caused by: svn: E175002: Broken pipe
	at org.tmatesoft.svn.core.SVNErrorMessage.create(SVNErrorMessage.java:109)
	at org.tmatesoft.svn.core.internal.io.dav.http.HTTPConnection._request(HTTPConnection.java:433)
	... 36 more
Caused by: java.net.SocketException: Broken pipe
	at java.net.SocketOutputStream.socketWrite0(Native Method)
	at java.net.SocketOutputStream.socketWrite(SocketOutputStream.java:109)
	at java.net.SocketOutputStream.write(SocketOutputStream.java:153)
	at java.io.BufferedOutputStream.flushBuffer(BufferedOutputStream.java:82)
	at java.io.BufferedOutputStream.flush(BufferedOutputStream.java:140)
	at org.tmatesoft.svn.core.internal.io.dav.http.HTTPConnection.sendData(HTTPConnection.java:238)
	at org.tmatesoft.svn.core.internal.io.dav.http.HTTPRequest.dispatch(HTTPRequest.java:168)
	at org.tmatesoft.svn.core.internal.io.dav.http.HTTPConnection._request(HTTPConnection.java:385)
	... 36 more
Cleaning up /home/hudson/hudson-slave/workspace/Lucene-Solr-tests-only-4.x-java7/nightly
Updating http://svn.apache.org/repos/asf/lucene/dev/nightly
ERROR: Failed to update http://svn.apache.org/repos/asf/lucene/dev/nightly
org.tmatesoft.svn.core.SVNException: svn: E175002: OPTIONS /repos/asf/lucene/dev/nightly failed
	at org.tmatesoft.svn.core.internal.io.dav.http.HTTPConnection.request(HTTPConnection.java:304)
	at org.tmatesoft.svn.core.internal.io.dav.http.HTTPConnection.request(HTTPConnection.java:289)
	at org.tmatesoft.svn.core.internal.io.dav.http.HTTPConnection.request(HTTPConnection.java:277)
	at org.tmatesoft.svn.core.internal.io.dav.DAVConnection.performHttpRequest(DAVConnection.java:696)
	at org.tmatesoft.svn.core.internal.io.dav.DAVConnection.exchangeCapabilities(DAVConnection.java:619)
	at org.tmatesoft.svn.core.internal.io.dav.DAVConnection.open(DAVConnection.java:103)
	at org.tmatesoft.svn.core.internal.io.dav.DAVRepository.openConnection(DAVRepository.java:1018)
	at org.tmatesoft.svn.core.internal.io.dav.DAVRepository.getRepositoryUUID(DAVRepository.java:148)
	at org.tmatesoft.svn.core.internal.wc16.SVNBasicDelegate.createRepository(SVNBasicDelegate.java:339)
	at org.tmatesoft.svn.core.internal.wc16.SVNBasicDelegate.createRepository(SVNBasicDelegate.java:328)
	at org.tmatesoft.svn.core.internal.wc16.SVNUpdateClient16.update(SVNUpdateClient16.java:532)
	at org.tmatesoft.svn.core.internal.wc16.SVNUpdateClient16.doUpdate(SVNUpdateClient16.java:414)
	at org.tmatesoft.svn.core.internal.wc16.SVNUpdateClient16.doUpdate(SVNUpdateClient16.java:324)
	at org.tmatesoft.svn.core.internal.wc2.old.SvnOldUpdate.run(SvnOldUpdate.java:27)
	at org.tmatesoft.svn.core.internal.wc2.old.SvnOldUpdate.run(SvnOldUpdate.java:11)
	at org.tmatesoft.svn.core.internal.wc2.SvnOperationRunner.run(SvnOperationRunner.java:20)
	at org.tmatesoft.svn.core.wc2.SvnOperationFactory.run(SvnOperationFactory.java:1221)
	at org.tmatesoft.svn.core.wc2.SvnOperation.run(SvnOperation.java:292)
	at org.tmatesoft.svn.core.wc.SVNUpdateClient.doUpdate(SVNUpdateClient.java:315)
	at org.tmatesoft.svn.core.wc.SVNUpdateClient.doUpdate(SVNUpdateClient.java:295)
	at org.tmatesoft.svn.core.wc.SVNUpdateClient.doUpdate(SVNUpdateClient.java:391)
	at hudson.scm.subversion.UpdateUpdater$TaskImpl.perform(UpdateUpdater.java:136)
	at hudson.scm.subversion.WorkspaceUpdater$UpdateTask.delegateTo(WorkspaceUpdater.java:144)
	at hudson.scm.SubversionSCM$CheckOutTask.perform(SubversionSCM.java:789)
	at hudson.scm.SubversionSCM$CheckOutTask.invoke(SubversionSCM.java:770)
	at hudson.scm.SubversionSCM$CheckOutTask.invoke(SubversionSCM.java:753)
	at hudson.FilePath$FileCallableWrapper.call(FilePath.java:2196)
	at hudson.remoting.UserRequest.perform(UserRequest.java:118)
	at hudson.remoting.UserRequest.perform(UserRequest.java:48)
	at hudson.remoting.Request$2.run(Request.java:326)
	at hudson.remoting.InterceptingExecutorService$1.call(InterceptingExecutorService.java:72)
	at java.util.concurrent.FutureTask$Sync.innerRun(FutureTask.java:334)
	at java.util.concurrent.FutureTask.run(FutureTask.java:166)
	at java.util.concurrent.ThreadPoolExecutor.runWorker(ThreadPoolExecutor.java:1110)
	at java.util.concurrent.ThreadPoolExecutor$Worker.run(ThreadPoolExecutor.java:603)
	at java.lang.Thread.run(Thread.java:679)
Caused by: svn: E175002: OPTIONS /repos/asf/lucene/dev/nightly failed
	at org.tmatesoft.svn.core.SVNErrorMessage.create(SVNErrorMessage.java:208)
	at org.tmatesoft.svn.core.SVNErrorMessage.create(SVNErrorMessage.java:154)
	at org.tmatesoft.svn.core.SVNErrorMessage.create(SVNErrorMessage.java:97)
	... 36 more
Caused by: org.tmatesoft.svn.core.SVNException: svn: E175002: OPTIONS request failed on '/repos/asf/lucene/dev/nightly'
svn: E175002: Connection reset
	at org.tmatesoft.svn.core.internal.wc.SVNErrorManager.error(SVNErrorManager.java:64)
	at org.tmatesoft.svn.core.internal.wc.SVNErrorManager.error(SVNErrorManager.java:51)
	at org.tmatesoft.svn.core.internal.io.dav.http.HTTPConnection._request(HTTPConnection.java:681)
	at org.tmatesoft.svn.core.internal.io.dav.http.HTTPConnection.request(HTTPConnection.java:298)
	... 35 more
Caused by: svn: E175002: OPTIONS request failed on '/repos/asf/lucene/dev/nightly'
	at org.tmatesoft.svn.core.SVNErrorMessage.create(SVNErrorMessage.java:208)
	at org.tmatesoft.svn.core.internal.io.dav.http.HTTPConnection._request(HTTPConnection.java:679)
	... 36 more
Caused by: svn: E175002: Connection reset
	at org.tmatesoft.svn.core.SVNErrorMessage.create(SVNErrorMessage.java:109)
	at org.tmatesoft.svn.core.internal.io.dav.http.HTTPConnection._request(HTTPConnection.java:433)
	... 36 more
Caused by: java.net.SocketException: Connection reset
	at java.net.SocketInputStream.read(SocketInputStream.java:185)
	at java.io.BufferedInputStream.fill(BufferedInputStream.java:235)
	at java.io.BufferedInputStream.read(BufferedInputStream.java:254)
	at org.tmatesoft.svn.core.internal.io.dav.http.HTTPParser.readPlainLine(HTTPParser.java:69)
	at org.tmatesoft.svn.core.internal.io.dav.http.HTTPParser.readLine(HTTPParser.java:51)
	at org.tmatesoft.svn.core.internal.io.dav.http.HTTPParser.parseStatus(HTTPParser.java:39)
	at org.tmatesoft.svn.core.internal.io.dav.http.HTTPConnection.readHeader(HTTPConnection.java:207)
	at org.tmatesoft.svn.core.internal.io.dav.http.HTTPRequest.dispatch(HTTPRequest.java:177)
	at org.tmatesoft.svn.core.internal.io.dav.http.HTTPConnection._request(HTTPConnection.java:385)
	... 36 more
no change for http://svn.apache.org/repos/asf/lucene/dev/branches/branch_4x since the previous
build
no change for http://svn.apache.org/repos/asf/lucene/dev/nightly since the previous build
No emails were triggered.
[Lucene-Solr-tests-only-4.x-java7] $ /bin/bash -xe /var/tmp/hudson866055194942656515.sh
+ sh /home/hudson/hudson-slave/workspace/Lucene-Solr-tests-only-4.x-java7/nightly/hudson-lusolr-tests-trunk.sh
+ [ '' = 1 ]
+ ANT_HOME=/home/hudson/tools/ant/supported18
+ SVNVERSION_EXE=/home/hudson/tools/svn/svnversion
+ SVN_EXE=/home/hudson/tools/svn/svn
+ CLOVER=/home/hudson/tools/clover/clover2latest
+ RAT_JAR=/home/hudson/tools/rat/rat-latest.jar
+ JAVADOC_HOME=/home/hudson/tools/java/api6
+ ROOT_DIR=checkout
+ CORE_DIR=checkout/lucene
+ SOLR_DIR=checkout/solr
+ ARTIFACTS=/home/hudson/hudson-slave/workspace/Lucene-Solr-tests-only-4.x-java7/artifacts
+ DOCUMENTATION_DIR=/home/hudson/hudson-slave/workspace/Lucene-Solr-tests-only-4.x-java7/docs
+ DUMP_DIR=/home/hudson/hudson-slave/workspace/Lucene-Solr-tests-only-4.x-java7/heapdumps
+ TESTS_MULTIPLIER=3
+ TESTS_PARALLELISM=2
+ TEST_LINE_DOCS_FILE=/home/hudson/lucene-data/enwiki.random.lines.txt
+ TEST_JVM_ARGS='-XX:+HeapDumpOnOutOfMemoryError -XX:HeapDumpPath=/home/hudson/hudson-slave/workspace/Lucene-Solr-tests-only-4.x-java7/heapdumps/
-XX:+UseG1GC'
+ set +x
+ mkdir -p /home/hudson/hudson-slave/workspace/Lucene-Solr-tests-only-4.x-java7/heapdumps
+ rm -rf /home/hudson/hudson-slave/workspace/Lucene-Solr-tests-only-4.x-java7/heapdumps/README.txt
+ echo 'This directory contains heap dumps that may be generated by test runs when OOM occurred.'
+ echo 'Using Java from /home/hudson/tools/java/latest1.7 - version output:'
Using Java from /home/hudson/tools/java/latest1.7 - version output:
+ /home/hudson/tools/java/latest1.7/bin/java -version
openjdk version "1.7.0_04"
OpenJDK Runtime Environment (build 1.7.0_04-b22)
OpenJDK 64-Bit Server VM (build 23.0-b21, mixed mode)
+ cd /home/hudson/hudson-slave/workspace/Lucene-Solr-tests-only-4.x-java7/checkout
+ /home/hudson/tools/ant/supported18/bin/ant clean-jars clean
Buildfile: /usr/home/hudson/hudson-slave/workspace/Lucene-Solr-tests-only-4.x-java7/checkout/build.xml

clean-jars:

clean-jars:

clean:

clean:
     [echo] Building solr...

clean:

BUILD SUCCESSFUL
Total time: 2 seconds
+ cd /home/hudson/hudson-slave/workspace/Lucene-Solr-tests-only-4.x-java7/checkout
+ /home/hudson/tools/ant/supported18/bin/ant -Dtests.multiplier=3 -Dtests.jvms=2 -Djunit.formatter=xml
'-Dargs=-XX:+HeapDumpOnOutOfMemoryError -XX:HeapDumpPath=/home/hudson/hudson-slave/workspace/Lucene-Solr-tests-only-4.x-java7/heapdumps/
-XX:+UseG1GC' test
Buildfile: /usr/home/hudson/hudson-slave/workspace/Lucene-Solr-tests-only-4.x-java7/checkout/build.xml

validate:

compile-tools:

ivy-availability-check:

ivy-fail:

ivy-configure:
[ivy:configure] :: Ivy 2.2.0 - 20100923230623 :: http://ant.apache.org/ivy/ ::
[ivy:configure] :: loading settings :: file = /usr/home/hudson/hudson-slave/workspace/Lucene-Solr-tests-only-4.x-java7/checkout/lucene/ivy-settings.xml

resolve:

init:

compile-core:
    [mkdir] Created dir: /usr/home/hudson/hudson-slave/workspace/Lucene-Solr-tests-only-4.x-java7/checkout/lucene/build/tools/classes/java
    [javac] Compiling 2 source files to /usr/home/hudson/hudson-slave/workspace/Lucene-Solr-tests-only-4.x-java7/checkout/lucene/build/tools/classes/java
    [javac] warning: [path] bad path element "/home/hudson/.ant/lib/xbean.jar": no such file
or directory
    [javac] warning: [options] bootstrap class path not set in conjunction with -source 1.6
    [javac] 2 warnings
     [copy] Copying 1 file to /usr/home/hudson/hudson-slave/workspace/Lucene-Solr-tests-only-4.x-java7/checkout/lucene/build/tools/classes/java

resolve:

ivy-availability-check:

ivy-fail:

ivy-configure:
[ivy:configure] :: loading settings :: file = /usr/home/hudson/hudson-slave/workspace/Lucene-Solr-tests-only-4.x-java7/checkout/lucene/ivy-settings.xml

resolve:

resolve:
     [echo] Building analyzers-common...

ivy-availability-check:

ivy-fail:

ivy-configure:
[ivy:configure] :: loading settings :: file = /usr/home/hudson/hudson-slave/workspace/Lucene-Solr-tests-only-4.x-java7/checkout/lucene/ivy-settings.xml

resolve:
     [echo] Building analyzers-icu...

ivy-availability-check:

ivy-fail:

ivy-configure:
[ivy:configure] :: loading settings :: file = /usr/home/hudson/hudson-slave/workspace/Lucene-Solr-tests-only-4.x-java7/checkout/lucene/ivy-settings.xml

resolve:
     [echo] Building analyzers-kuromoji...

ivy-availability-check:

ivy-fail:

ivy-configure:
[ivy:configure] :: loading settings :: file = /usr/home/hudson/hudson-slave/workspace/Lucene-Solr-tests-only-4.x-java7/checkout/lucene/ivy-settings.xml

resolve:
     [echo] Building analyzers-morfologik...

ivy-availability-check:

ivy-fail:

ivy-configure:
[ivy:configure] :: loading settings :: file = /usr/home/hudson/hudson-slave/workspace/Lucene-Solr-tests-only-4.x-java7/checkout/lucene/ivy-settings.xml

resolve:
     [echo] Building analyzers-phonetic...

ivy-availability-check:

ivy-fail:

ivy-configure:
[ivy:configure] :: loading settings :: file = /usr/home/hudson/hudson-slave/workspace/Lucene-Solr-tests-only-4.x-java7/checkout/lucene/ivy-settings.xml

resolve:
     [echo] Building analyzers-smartcn...

ivy-availability-check:

ivy-fail:

ivy-configure:
[ivy:configure] :: loading settings :: file = /usr/home/hudson/hudson-slave/workspace/Lucene-Solr-tests-only-4.x-java7/checkout/lucene/ivy-settings.xml

resolve:
     [echo] Building analyzers-stempel...

ivy-availability-check:

ivy-fail:

ivy-configure:
[ivy:configure] :: loading settings :: file = /usr/home/hudson/hudson-slave/workspace/Lucene-Solr-tests-only-4.x-java7/checkout/lucene/ivy-settings.xml

resolve:
     [echo] Building analyzers-uima...

ivy-availability-check:

ivy-fail:

ivy-configure:
[ivy:configure] :: loading settings :: file = /usr/home/hudson/hudson-slave/workspace/Lucene-Solr-tests-only-4.x-java7/checkout/lucene/ivy-settings.xml

resolve:
     [echo] Building benchmark...

ivy-availability-check:

ivy-fail:

ivy-configure:
[ivy:configure] :: loading settings :: file = /usr/home/hudson/hudson-slave/workspace/Lucene-Solr-tests-only-4.x-java7/checkout/lucene/ivy-settings.xml

resolve:
     [echo] Building demo...

ivy-availability-check:

ivy-fail:

ivy-configure:
[ivy:configure] :: loading settings :: file = /usr/home/hudson/hudson-slave/workspace/Lucene-Solr-tests-only-4.x-java7/checkout/lucene/ivy-settings.xml

resolve:
     [echo] Building facet...

ivy-availability-check:

ivy-fail:

ivy-configure:
[ivy:configure] :: loading settings :: file = /usr/home/hudson/hudson-slave/workspace/Lucene-Solr-tests-only-4.x-java7/checkout/lucene/ivy-settings.xml

resolve:
     [echo] Building grouping...

ivy-availability-check:

ivy-fail:

ivy-configure:
[ivy:configure] :: loading settings :: file = /usr/home/hudson/hudson-slave/workspace/Lucene-Solr-tests-only-4.x-java7/checkout/lucene/ivy-settings.xml

resolve:
     [echo] Building highlighter...

ivy-availability-check:

ivy-fail:

ivy-configure:
[ivy:configure] :: loading settings :: file = /usr/home/hudson/hudson-slave/workspace/Lucene-Solr-tests-only-4.x-java7/checkout/lucene/ivy-settings.xml

resolve:
     [echo] Building join...

ivy-availability-check:

ivy-fail:

ivy-configure:
[ivy:configure] :: loading settings :: file = /usr/home/hudson/hudson-slave/workspace/Lucene-Solr-tests-only-4.x-java7/checkout/lucene/ivy-settings.xml

resolve:
     [echo] Building memory...

ivy-availability-check:

ivy-fail:

ivy-configure:
[ivy:configure] :: loading settings :: file = /usr/home/hudson/hudson-slave/workspace/Lucene-Solr-tests-only-4.x-java7/checkout/lucene/ivy-settings.xml

resolve:
     [echo] Building misc...

ivy-availability-check:

ivy-fail:

ivy-configure:
[ivy:configure] :: loading settings :: file = /usr/home/hudson/hudson-slave/workspace/Lucene-Solr-tests-only-4.x-java7/checkout/lucene/ivy-settings.xml

resolve:
     [echo] Building queries...

ivy-availability-check:

ivy-fail:

ivy-configure:
[ivy:configure] :: loading settings :: file = /usr/home/hudson/hudson-slave/workspace/Lucene-Solr-tests-only-4.x-java7/checkout/lucene/ivy-settings.xml

resolve:
     [echo] Building queryparser...

ivy-availability-check:

ivy-fail:

ivy-configure:
[ivy:configure] :: loading settings :: file = /usr/home/hudson/hudson-slave/workspace/Lucene-Solr-tests-only-4.x-java7/checkout/lucene/ivy-settings.xml

resolve:
     [echo] Building sandbox...

ivy-availability-check:

ivy-fail:

ivy-configure:
[ivy:configure] :: loading settings :: file = /usr/home/hudson/hudson-slave/workspace/Lucene-Solr-tests-only-4.x-java7/checkout/lucene/ivy-settings.xml

resolve:
     [echo] Building spatial...

ivy-availability-check:

ivy-fail:

ivy-configure:
[ivy:configure] :: loading settings :: file = /usr/home/hudson/hudson-slave/workspace/Lucene-Solr-tests-only-4.x-java7/checkout/lucene/ivy-settings.xml

resolve:
     [echo] Building suggest...

ivy-availability-check:

ivy-fail:

ivy-configure:
[ivy:configure] :: loading settings :: file = /usr/home/hudson/hudson-slave/workspace/Lucene-Solr-tests-only-4.x-java7/checkout/lucene/ivy-settings.xml

resolve:

validate:
     [echo] License check under: /usr/home/hudson/hudson-slave/workspace/Lucene-Solr-tests-only-4.x-java7/checkout/lucene
 [licenses] Scanned 18 JAR file(s) for licenses (in 0.31s.), 0 error(s).
     [echo] Building solr...

compile-tools:

ivy-availability-check:

ivy-fail:

ivy-configure:
[ivy:configure] :: loading settings :: file = /usr/home/hudson/hudson-slave/workspace/Lucene-Solr-tests-only-4.x-java7/checkout/lucene/ivy-settings.xml

resolve:

init:

compile-core:

resolve-example:
     [echo] Building solr-example...

ivy-availability-check:

ivy-fail:

ivy-configure:
[ivy:configure] :: loading settings :: file = /usr/home/hudson/hudson-slave/workspace/Lucene-Solr-tests-only-4.x-java7/checkout/lucene/ivy-settings.xml

resolve:
     [echo] Building solr-example-DIH...

ivy-availability-check:

ivy-fail:

ivy-configure:
[ivy:configure] :: loading settings :: file = /usr/home/hudson/hudson-slave/workspace/Lucene-Solr-tests-only-4.x-java7/checkout/lucene/ivy-settings.xml

resolve:

resolve:
     [echo] Building solr-core...

ivy-availability-check:

ivy-fail:

ivy-configure:
[ivy:configure] :: loading settings :: file = /usr/home/hudson/hudson-slave/workspace/Lucene-Solr-tests-only-4.x-java7/checkout/lucene/ivy-settings.xml

resolve:
     [echo] Building solr-solrj...

ivy-availability-check:

ivy-fail:

ivy-configure:
[ivy:configure] :: loading settings :: file = /usr/home/hudson/hudson-slave/workspace/Lucene-Solr-tests-only-4.x-java7/checkout/lucene/ivy-settings.xml

resolve:
     [echo] Building solr-test-framework...

ivy-availability-check:

ivy-fail:

ivy-configure:
[ivy:configure] :: loading settings :: file = /usr/home/hudson/hudson-slave/workspace/Lucene-Solr-tests-only-4.x-java7/checkout/lucene/ivy-settings.xml

resolve:
     [echo] Building solr-analysis-extras...

ivy-availability-check:

ivy-fail:

ivy-configure:
[ivy:configure] :: loading settings :: file = /usr/home/hudson/hudson-slave/workspace/Lucene-Solr-tests-only-4.x-java7/checkout/lucene/ivy-settings.xml

resolve:
     [echo] Building solr-clustering...

ivy-availability-check:

ivy-fail:

ivy-configure:
[ivy:configure] :: loading settings :: file = /usr/home/hudson/hudson-slave/workspace/Lucene-Solr-tests-only-4.x-java7/checkout/lucene/ivy-settings.xml

resolve:
     [echo] Building solr-dataimporthandler-extras...

ivy-availability-check:

ivy-fail:

ivy-configure:
[ivy:configure] :: loading settings :: file = /usr/home/hudson/hudson-slave/workspace/Lucene-Solr-tests-only-4.x-java7/checkout/lucene/ivy-settings.xml

resolve:
     [echo] Building solr-dataimporthandler...

ivy-availability-check:

ivy-fail:

ivy-configure:
[ivy:configure] :: loading settings :: file = /usr/home/hudson/hudson-slave/workspace/Lucene-Solr-tests-only-4.x-java7/checkout/lucene/ivy-settings.xml

resolve:
     [echo] Building solr-cell...

ivy-availability-check:

ivy-fail:

ivy-configure:
[ivy:configure] :: loading settings :: file = /usr/home/hudson/hudson-slave/workspace/Lucene-Solr-tests-only-4.x-java7/checkout/lucene/ivy-settings.xml

resolve:
     [echo] Building solr-langid...

ivy-availability-check:

ivy-fail:

ivy-configure:
[ivy:configure] :: loading settings :: file = /usr/home/hudson/hudson-slave/workspace/Lucene-Solr-tests-only-4.x-java7/checkout/lucene/ivy-settings.xml

[...truncated 47988 lines...]

[...truncated 48666 lines...]



Mime
View raw message