lucene-dev mailing list archives

Site index · List index
Message view « Date » · « Thread »
Top « Date » · « Thread »
From Policeman Jenkins Server <jenk...@sd-datasolutions.de>
Subject [JENKINS] Lucene-Solr-4.x-Linux-Java6-64 - Build # 349 - Failure!
Date Mon, 02 Jul 2012 11:12:16 GMT
Build: http://jenkins.sd-datasolutions.de/job/Lucene-Solr-4.x-Linux-Java6-64/349/

3 tests failed.
REGRESSION:  org.apache.solr.handler.dataimport.TestSqlEntityProcessorDeltaPrefixedPk.testDeltaImport_replace_resolvesUnprefixedPk

Error Message:
Exception during query

Stack Trace:
java.lang.RuntimeException: Exception during query
	at __randomizedtesting.SeedInfo.seed([82D4BE3DF1479E1A:8013CE9423D29096]:0)
	at org.apache.solr.SolrTestCaseJ4.assertQ(SolrTestCaseJ4.java:461)
	at org.apache.solr.SolrTestCaseJ4.assertQ(SolrTestCaseJ4.java:428)
	at org.apache.solr.handler.dataimport.TestSqlEntityProcessorDeltaPrefixedPk.testDeltaImport_replace_resolvesUnprefixedPk(TestSqlEntityProcessorDeltaPrefixedPk.java:118)
	at sun.reflect.NativeMethodAccessorImpl.invoke0(Native Method)
	at sun.reflect.NativeMethodAccessorImpl.invoke(NativeMethodAccessorImpl.java:39)
	at sun.reflect.DelegatingMethodAccessorImpl.invoke(DelegatingMethodAccessorImpl.java:25)
	at java.lang.reflect.Method.invoke(Method.java:597)
	at com.carrotsearch.randomizedtesting.RandomizedRunner.invoke(RandomizedRunner.java:1969)
	at com.carrotsearch.randomizedtesting.RandomizedRunner.access$1100(RandomizedRunner.java:132)
	at com.carrotsearch.randomizedtesting.RandomizedRunner$6.evaluate(RandomizedRunner.java:814)
	at com.carrotsearch.randomizedtesting.RandomizedRunner$7.evaluate(RandomizedRunner.java:875)
	at com.carrotsearch.randomizedtesting.RandomizedRunner$8.evaluate(RandomizedRunner.java:889)
	at com.carrotsearch.randomizedtesting.rules.SystemPropertiesRestoreRule$1.evaluate(SystemPropertiesRestoreRule.java:53)
	at org.apache.lucene.util.TestRuleSetupTeardownChained$1.evaluate(TestRuleSetupTeardownChained.java:50)
	at org.apache.lucene.util.TestRuleFieldCacheSanity$1.evaluate(TestRuleFieldCacheSanity.java:32)
	at org.apache.lucene.util.AbstractBeforeAfterRule$1.evaluate(AbstractBeforeAfterRule.java:45)
	at com.carrotsearch.randomizedtesting.rules.SystemPropertiesInvariantRule$1.evaluate(SystemPropertiesInvariantRule.java:55)
	at org.apache.lucene.util.TestRuleReportUncaughtExceptions$1.evaluate(TestRuleReportUncaughtExceptions.java:68)
	at org.apache.lucene.util.TestRuleThreadAndTestName$1.evaluate(TestRuleThreadAndTestName.java:48)
	at org.apache.lucene.util.TestRuleIgnoreAfterMaxFailures$1.evaluate(TestRuleIgnoreAfterMaxFailures.java:70)
	at org.apache.lucene.util.TestRuleMarkFailure$1.evaluate(TestRuleMarkFailure.java:48)
	at com.carrotsearch.randomizedtesting.RandomizedRunner.runSingleTest(RandomizedRunner.java:821)
	at com.carrotsearch.randomizedtesting.RandomizedRunner.access$700(RandomizedRunner.java:132)
	at com.carrotsearch.randomizedtesting.RandomizedRunner$3$1.run(RandomizedRunner.java:669)
	at com.carrotsearch.randomizedtesting.RandomizedRunner$3.evaluate(RandomizedRunner.java:695)
	at com.carrotsearch.randomizedtesting.RandomizedRunner$4.evaluate(RandomizedRunner.java:734)
	at com.carrotsearch.randomizedtesting.RandomizedRunner$5.evaluate(RandomizedRunner.java:745)
	at com.carrotsearch.randomizedtesting.rules.SystemPropertiesRestoreRule$1.evaluate(SystemPropertiesRestoreRule.java:53)
	at org.apache.lucene.util.AbstractBeforeAfterRule$1.evaluate(AbstractBeforeAfterRule.java:45)
	at org.apache.lucene.util.TestRuleReportUncaughtExceptions$1.evaluate(TestRuleReportUncaughtExceptions.java:68)
	at org.apache.lucene.util.TestRuleStoreClassName$1.evaluate(TestRuleStoreClassName.java:38)
	at org.apache.lucene.util.TestRuleIcuHack$1.evaluate(TestRuleIcuHack.java:51)
	at com.carrotsearch.randomizedtesting.rules.SystemPropertiesInvariantRule$1.evaluate(SystemPropertiesInvariantRule.java:55)
	at org.apache.lucene.util.TestRuleNoInstanceHooksOverrides$1.evaluate(TestRuleNoInstanceHooksOverrides.java:53)
	at org.apache.lucene.util.TestRuleNoStaticHooksShadowing$1.evaluate(TestRuleNoStaticHooksShadowing.java:52)
	at org.apache.lucene.util.TestRuleAssertionsRequired$1.evaluate(TestRuleAssertionsRequired.java:36)
	at org.apache.lucene.util.TestRuleMarkFailure$1.evaluate(TestRuleMarkFailure.java:48)
	at org.apache.lucene.util.TestRuleIgnoreAfterMaxFailures$1.evaluate(TestRuleIgnoreAfterMaxFailures.java:70)
	at org.apache.lucene.util.TestRuleIgnoreTestSuites$1.evaluate(TestRuleIgnoreTestSuites.java:55)
	at com.carrotsearch.randomizedtesting.RandomizedRunner.runSuite(RandomizedRunner.java:605)
	at com.carrotsearch.randomizedtesting.RandomizedRunner.access$400(RandomizedRunner.java:132)
	at com.carrotsearch.randomizedtesting.RandomizedRunner$2.run(RandomizedRunner.java:551)
Caused by: java.lang.RuntimeException: REQUEST FAILED: xpath=//*[@numFound='0']
	xml response was: <?xml version="1.0" encoding="UTF-8"?>
<response>
<lst name="responseHeader"><int name="status">0</int><int name="QTime">0</int><lst name="params"><str name="start">0</str><str name="q">desc:bar</str><str name="qt">standard</str><str name="rows">20</str><str name="version">2.2</str></lst></lst><result name="response" numFound="1" start="0"><doc><str name="id">1</str><arr name="desc"><str>bar</str></arr><date name="timestamp">2012-07-02T11:11:50.92Z</date></doc></result>
</response>

	request was:start=0&q=desc:bar&qt=standard&rows=20&version=2.2
	at org.apache.solr.SolrTestCaseJ4.assertQ(SolrTestCaseJ4.java:454)
	... 41 more


REGRESSION:  org.apache.solr.handler.dataimport.TestSqlEntityProcessorDeltaPrefixedPk.testDeltaImport_deleteResolvesUnprefixedPk

Error Message:
org.apache.lucene.store.AlreadyClosedException: this IndexWriter is closed

Stack Trace:
org.apache.solr.common.SolrException: org.apache.lucene.store.AlreadyClosedException: this IndexWriter is closed
	at __randomizedtesting.SeedInfo.seed([82D4BE3DF1479E1A:1AA92A75F01E45F9]:0)
	at org.apache.solr.util.TestHarness.update(TestHarness.java:233)
	at org.apache.solr.util.TestHarness.checkUpdateStatus(TestHarness.java:277)
	at org.apache.solr.util.TestHarness.validateUpdate(TestHarness.java:247)
	at org.apache.solr.SolrTestCaseJ4.checkUpdateU(SolrTestCaseJ4.java:415)
	at org.apache.solr.SolrTestCaseJ4.assertU(SolrTestCaseJ4.java:394)
	at org.apache.solr.SolrTestCaseJ4.assertU(SolrTestCaseJ4.java:388)
	at org.apache.solr.SolrTestCaseJ4.clearIndex(SolrTestCaseJ4.java:760)
	at org.apache.solr.handler.dataimport.TestSqlEntityProcessorDeltaPrefixedPk.setUp(TestSqlEntityProcessorDeltaPrefixedPk.java:69)
	at sun.reflect.NativeMethodAccessorImpl.invoke0(Native Method)
	at sun.reflect.NativeMethodAccessorImpl.invoke(NativeMethodAccessorImpl.java:39)
	at sun.reflect.DelegatingMethodAccessorImpl.invoke(DelegatingMethodAccessorImpl.java:25)
	at java.lang.reflect.Method.invoke(Method.java:597)
	at com.carrotsearch.randomizedtesting.RandomizedRunner.invoke(RandomizedRunner.java:1969)
	at com.carrotsearch.randomizedtesting.RandomizedRunner.access$1100(RandomizedRunner.java:132)
	at com.carrotsearch.randomizedtesting.RandomizedRunner$7.evaluate(RandomizedRunner.java:873)
	at com.carrotsearch.randomizedtesting.RandomizedRunner$8.evaluate(RandomizedRunner.java:889)
	at com.carrotsearch.randomizedtesting.rules.SystemPropertiesRestoreRule$1.evaluate(SystemPropertiesRestoreRule.java:53)
	at org.apache.lucene.util.TestRuleSetupTeardownChained$1.evaluate(TestRuleSetupTeardownChained.java:50)
	at org.apache.lucene.util.TestRuleFieldCacheSanity$1.evaluate(TestRuleFieldCacheSanity.java:32)
	at org.apache.lucene.util.AbstractBeforeAfterRule$1.evaluate(AbstractBeforeAfterRule.java:45)
	at com.carrotsearch.randomizedtesting.rules.SystemPropertiesInvariantRule$1.evaluate(SystemPropertiesInvariantRule.java:55)
	at org.apache.lucene.util.TestRuleReportUncaughtExceptions$1.evaluate(TestRuleReportUncaughtExceptions.java:68)
	at org.apache.lucene.util.TestRuleThreadAndTestName$1.evaluate(TestRuleThreadAndTestName.java:48)
	at org.apache.lucene.util.TestRuleIgnoreAfterMaxFailures$1.evaluate(TestRuleIgnoreAfterMaxFailures.java:70)
	at org.apache.lucene.util.TestRuleMarkFailure$1.evaluate(TestRuleMarkFailure.java:48)
	at com.carrotsearch.randomizedtesting.RandomizedRunner.runSingleTest(RandomizedRunner.java:821)
	at com.carrotsearch.randomizedtesting.RandomizedRunner.access$700(RandomizedRunner.java:132)
	at com.carrotsearch.randomizedtesting.RandomizedRunner$3$1.run(RandomizedRunner.java:669)
	at com.carrotsearch.randomizedtesting.RandomizedRunner$3.evaluate(RandomizedRunner.java:695)
	at com.carrotsearch.randomizedtesting.RandomizedRunner$4.evaluate(RandomizedRunner.java:734)
	at com.carrotsearch.randomizedtesting.RandomizedRunner$5.evaluate(RandomizedRunner.java:745)
	at com.carrotsearch.randomizedtesting.rules.SystemPropertiesRestoreRule$1.evaluate(SystemPropertiesRestoreRule.java:53)
	at org.apache.lucene.util.AbstractBeforeAfterRule$1.evaluate(AbstractBeforeAfterRule.java:45)
	at org.apache.lucene.util.TestRuleReportUncaughtExceptions$1.evaluate(TestRuleReportUncaughtExceptions.java:68)
	at org.apache.lucene.util.TestRuleStoreClassName$1.evaluate(TestRuleStoreClassName.java:38)
	at org.apache.lucene.util.TestRuleIcuHack$1.evaluate(TestRuleIcuHack.java:51)
	at com.carrotsearch.randomizedtesting.rules.SystemPropertiesInvariantRule$1.evaluate(SystemPropertiesInvariantRule.java:55)
	at org.apache.lucene.util.TestRuleNoInstanceHooksOverrides$1.evaluate(TestRuleNoInstanceHooksOverrides.java:53)
	at org.apache.lucene.util.TestRuleNoStaticHooksShadowing$1.evaluate(TestRuleNoStaticHooksShadowing.java:52)
	at org.apache.lucene.util.TestRuleAssertionsRequired$1.evaluate(TestRuleAssertionsRequired.java:36)
	at org.apache.lucene.util.TestRuleMarkFailure$1.evaluate(TestRuleMarkFailure.java:48)
	at org.apache.lucene.util.TestRuleIgnoreAfterMaxFailures$1.evaluate(TestRuleIgnoreAfterMaxFailures.java:70)
	at org.apache.lucene.util.TestRuleIgnoreTestSuites$1.evaluate(TestRuleIgnoreTestSuites.java:55)
	at com.carrotsearch.randomizedtesting.RandomizedRunner.runSuite(RandomizedRunner.java:605)
	at com.carrotsearch.randomizedtesting.RandomizedRunner.access$400(RandomizedRunner.java:132)
	at com.carrotsearch.randomizedtesting.RandomizedRunner$2.run(RandomizedRunner.java:551)
Caused by: org.apache.lucene.store.AlreadyClosedException: this IndexWriter is closed
	at org.apache.lucene.index.IndexWriter.ensureOpen(IndexWriter.java:553)
	at org.apache.lucene.index.IndexWriter.ensureOpen(IndexWriter.java:558)
	at org.apache.lucene.index.IndexWriter.deleteAll(IndexWriter.java:1882)
	at org.apache.solr.update.DirectUpdateHandler2.deleteAll(DirectUpdateHandler2.java:138)
	at org.apache.solr.update.DirectUpdateHandler2.deleteByQuery(DirectUpdateHandler2.java:290)
	at org.apache.solr.update.processor.RunUpdateProcessor.processDelete(RunUpdateProcessorFactory.java:67)
	at org.apache.solr.update.processor.UpdateRequestProcessor.processDelete(UpdateRequestProcessor.java:55)
	at org.apache.solr.update.processor.DistributedUpdateProcessor.doDeleteByQuery(DistributedUpdateProcessor.java:719)
	at org.apache.solr.update.processor.DistributedUpdateProcessor.processDelete(DistributedUpdateProcessor.java:592)
	at org.apache.solr.update.processor.UpdateRequestProcessor.processDelete(UpdateRequestProcessor.java:55)
	at org.apache.solr.handler.dataimport.AbstractDataImportHandlerTestCase$TestUpdateRequestProcessor.processDelete(AbstractDataImportHandlerTestCase.java:364)
	at org.apache.solr.handler.loader.XMLLoader.processDelete(XMLLoader.java:330)
	at org.apache.solr.handler.loader.XMLLoader.processUpdate(XMLLoader.java:261)
	at org.apache.solr.handler.loader.XMLLoader.load(XMLLoader.java:157)
	at org.apache.solr.handler.UpdateRequestHandler$1.load(UpdateRequestHandler.java:92)
	at org.apache.solr.handler.ContentStreamHandlerBase.handleRequestBody(ContentStreamHandlerBase.java:74)
	at org.apache.solr.handler.RequestHandlerBase.handleRequest(RequestHandlerBase.java:129)
	at org.apache.solr.core.SolrCore.execute(SolrCore.java:1599)
	at org.apache.solr.servlet.DirectSolrConnection.request(DirectSolrConnection.java:131)
	at org.apache.solr.util.TestHarness.update(TestHarness.java:229)
	... 45 more


REGRESSION:  org.apache.solr.handler.dataimport.TestSqlEntityProcessorDeltaPrefixedPk.testDeltaImport_addResolvesUnprefixedPk

Error Message:
org.apache.lucene.store.AlreadyClosedException: this IndexWriter is closed

Stack Trace:
org.apache.solr.common.SolrException: org.apache.lucene.store.AlreadyClosedException: this IndexWriter is closed
	at __randomizedtesting.SeedInfo.seed([82D4BE3DF1479E1A:6AB7BC36990B52B2]:0)
	at org.apache.solr.util.TestHarness.update(TestHarness.java:233)
	at org.apache.solr.util.TestHarness.checkUpdateStatus(TestHarness.java:277)
	at org.apache.solr.util.TestHarness.validateUpdate(TestHarness.java:247)
	at org.apache.solr.SolrTestCaseJ4.checkUpdateU(SolrTestCaseJ4.java:415)
	at org.apache.solr.SolrTestCaseJ4.assertU(SolrTestCaseJ4.java:394)
	at org.apache.solr.SolrTestCaseJ4.assertU(SolrTestCaseJ4.java:388)
	at org.apache.solr.SolrTestCaseJ4.clearIndex(SolrTestCaseJ4.java:760)
	at org.apache.solr.handler.dataimport.TestSqlEntityProcessorDeltaPrefixedPk.setUp(TestSqlEntityProcessorDeltaPrefixedPk.java:69)
	at sun.reflect.NativeMethodAccessorImpl.invoke0(Native Method)
	at sun.reflect.NativeMethodAccessorImpl.invoke(NativeMethodAccessorImpl.java:39)
	at sun.reflect.DelegatingMethodAccessorImpl.invoke(DelegatingMethodAccessorImpl.java:25)
	at java.lang.reflect.Method.invoke(Method.java:597)
	at com.carrotsearch.randomizedtesting.RandomizedRunner.invoke(RandomizedRunner.java:1969)
	at com.carrotsearch.randomizedtesting.RandomizedRunner.access$1100(RandomizedRunner.java:132)
	at com.carrotsearch.randomizedtesting.RandomizedRunner$7.evaluate(RandomizedRunner.java:873)
	at com.carrotsearch.randomizedtesting.RandomizedRunner$8.evaluate(RandomizedRunner.java:889)
	at com.carrotsearch.randomizedtesting.rules.SystemPropertiesRestoreRule$1.evaluate(SystemPropertiesRestoreRule.java:53)
	at org.apache.lucene.util.TestRuleSetupTeardownChained$1.evaluate(TestRuleSetupTeardownChained.java:50)
	at org.apache.lucene.util.TestRuleFieldCacheSanity$1.evaluate(TestRuleFieldCacheSanity.java:32)
	at org.apache.lucene.util.AbstractBeforeAfterRule$1.evaluate(AbstractBeforeAfterRule.java:45)
	at com.carrotsearch.randomizedtesting.rules.SystemPropertiesInvariantRule$1.evaluate(SystemPropertiesInvariantRule.java:55)
	at org.apache.lucene.util.TestRuleReportUncaughtExceptions$1.evaluate(TestRuleReportUncaughtExceptions.java:68)
	at org.apache.lucene.util.TestRuleThreadAndTestName$1.evaluate(TestRuleThreadAndTestName.java:48)
	at org.apache.lucene.util.TestRuleIgnoreAfterMaxFailures$1.evaluate(TestRuleIgnoreAfterMaxFailures.java:70)
	at org.apache.lucene.util.TestRuleMarkFailure$1.evaluate(TestRuleMarkFailure.java:48)
	at com.carrotsearch.randomizedtesting.RandomizedRunner.runSingleTest(RandomizedRunner.java:821)
	at com.carrotsearch.randomizedtesting.RandomizedRunner.access$700(RandomizedRunner.java:132)
	at com.carrotsearch.randomizedtesting.RandomizedRunner$3$1.run(RandomizedRunner.java:669)
	at com.carrotsearch.randomizedtesting.RandomizedRunner$3.evaluate(RandomizedRunner.java:695)
	at com.carrotsearch.randomizedtesting.RandomizedRunner$4.evaluate(RandomizedRunner.java:734)
	at com.carrotsearch.randomizedtesting.RandomizedRunner$5.evaluate(RandomizedRunner.java:745)
	at com.carrotsearch.randomizedtesting.rules.SystemPropertiesRestoreRule$1.evaluate(SystemPropertiesRestoreRule.java:53)
	at org.apache.lucene.util.AbstractBeforeAfterRule$1.evaluate(AbstractBeforeAfterRule.java:45)
	at org.apache.lucene.util.TestRuleReportUncaughtExceptions$1.evaluate(TestRuleReportUncaughtExceptions.java:68)
	at org.apache.lucene.util.TestRuleStoreClassName$1.evaluate(TestRuleStoreClassName.java:38)
	at org.apache.lucene.util.TestRuleIcuHack$1.evaluate(TestRuleIcuHack.java:51)
	at com.carrotsearch.randomizedtesting.rules.SystemPropertiesInvariantRule$1.evaluate(SystemPropertiesInvariantRule.java:55)
	at org.apache.lucene.util.TestRuleNoInstanceHooksOverrides$1.evaluate(TestRuleNoInstanceHooksOverrides.java:53)
	at org.apache.lucene.util.TestRuleNoStaticHooksShadowing$1.evaluate(TestRuleNoStaticHooksShadowing.java:52)
	at org.apache.lucene.util.TestRuleAssertionsRequired$1.evaluate(TestRuleAssertionsRequired.java:36)
	at org.apache.lucene.util.TestRuleMarkFailure$1.evaluate(TestRuleMarkFailure.java:48)
	at org.apache.lucene.util.TestRuleIgnoreAfterMaxFailures$1.evaluate(TestRuleIgnoreAfterMaxFailures.java:70)
	at org.apache.lucene.util.TestRuleIgnoreTestSuites$1.evaluate(TestRuleIgnoreTestSuites.java:55)
	at com.carrotsearch.randomizedtesting.RandomizedRunner.runSuite(RandomizedRunner.java:605)
	at com.carrotsearch.randomizedtesting.RandomizedRunner.access$400(RandomizedRunner.java:132)
	at com.carrotsearch.randomizedtesting.RandomizedRunner$2.run(RandomizedRunner.java:551)
Caused by: org.apache.lucene.store.AlreadyClosedException: this IndexWriter is closed
	at org.apache.lucene.index.IndexWriter.ensureOpen(IndexWriter.java:553)
	at org.apache.lucene.index.IndexWriter.ensureOpen(IndexWriter.java:558)
	at org.apache.lucene.index.IndexWriter.deleteAll(IndexWriter.java:1882)
	at org.apache.solr.update.DirectUpdateHandler2.deleteAll(DirectUpdateHandler2.java:138)
	at org.apache.solr.update.DirectUpdateHandler2.deleteByQuery(DirectUpdateHandler2.java:290)
	at org.apache.solr.update.processor.RunUpdateProcessor.processDelete(RunUpdateProcessorFactory.java:67)
	at org.apache.solr.update.processor.UpdateRequestProcessor.processDelete(UpdateRequestProcessor.java:55)
	at org.apache.solr.update.processor.DistributedUpdateProcessor.doDeleteByQuery(DistributedUpdateProcessor.java:719)
	at org.apache.solr.update.processor.DistributedUpdateProcessor.processDelete(DistributedUpdateProcessor.java:592)
	at org.apache.solr.update.processor.UpdateRequestProcessor.processDelete(UpdateRequestProcessor.java:55)
	at org.apache.solr.handler.dataimport.AbstractDataImportHandlerTestCase$TestUpdateRequestProcessor.processDelete(AbstractDataImportHandlerTestCase.java:364)
	at org.apache.solr.handler.loader.XMLLoader.processDelete(XMLLoader.java:330)
	at org.apache.solr.handler.loader.XMLLoader.processUpdate(XMLLoader.java:261)
	at org.apache.solr.handler.loader.XMLLoader.load(XMLLoader.java:157)
	at org.apache.solr.handler.UpdateRequestHandler$1.load(UpdateRequestHandler.java:92)
	at org.apache.solr.handler.ContentStreamHandlerBase.handleRequestBody(ContentStreamHandlerBase.java:74)
	at org.apache.solr.handler.RequestHandlerBase.handleRequest(RequestHandlerBase.java:129)
	at org.apache.solr.core.SolrCore.execute(SolrCore.java:1599)
	at org.apache.solr.servlet.DirectSolrConnection.request(DirectSolrConnection.java:131)
	at org.apache.solr.util.TestHarness.update(TestHarness.java:229)
	... 45 more




Build Log:
[...truncated 9321 lines...]
   [junit4] Suite: org.apache.solr.handler.dataimport.TestSqlEntityProcessorDeltaPrefixedPk
   [junit4]    > (@BeforeClass output)
   [junit4]   2> 0 T91 oas.SolrTestCaseJ4.initCore ####initCore
   [junit4]   2> Creating dataDir: /mnt/ssd/jenkins/workspace/Lucene-Solr-4.x-Linux-Java6-64/checkout/solr/build/contrib/solr-dataimporthandler/test/J0/./solrtest-TestSqlEntityProcessorDeltaPrefixedPk-1341227510744
   [junit4]   2> 1 T91 oasc.SolrResourceLoader.<init> new SolrResourceLoader for directory: '/mnt/ssd/jenkins/workspace/Lucene-Solr-4.x-Linux-Java6-64/checkout/solr/build/contrib/solr-dataimporthandler/test-files/dih/solr/collection1/'
   [junit4]   2> 42 T91 oasc.SolrConfig.<init> Using Lucene MatchVersion: LUCENE_40
   [junit4]   2> 80 T91 oasc.SolrConfig.<init> Loaded SolrConfig: dataimport-solrconfig.xml
   [junit4]   2> 80 T91 oass.IndexSchema.readSchema Reading Solr Schema
   [junit4]   2> 86 T91 oass.IndexSchema.readSchema Schema name=dih_test
   [junit4]   2> 133 T91 oass.IndexSchema.readSchema default search field in schema is desc
   [junit4]   2> 134 T91 oass.IndexSchema.readSchema query parser default operator is OR
   [junit4]   2> 136 T91 oass.IndexSchema.readSchema unique key field: id
   [junit4]   2> 137 T91 oasc.SolrResourceLoader.locateSolrHome JNDI not configured for solr (NoInitialContextEx)
   [junit4]   2> 137 T91 oasc.SolrResourceLoader.locateSolrHome using system property solr.solr.home: /mnt/ssd/jenkins/workspace/Lucene-Solr-4.x-Linux-Java6-64/checkout/solr/build/contrib/solr-dataimporthandler/test-files/dih/solr
   [junit4]   2> 137 T91 oasc.SolrResourceLoader.<init> new SolrResourceLoader for directory: '/mnt/ssd/jenkins/workspace/Lucene-Solr-4.x-Linux-Java6-64/checkout/solr/build/contrib/solr-dataimporthandler/test-files/dih/solr/'
   [junit4]   2> 137 T91 oasc.CoreContainer.<init> New CoreContainer 786093240
   [junit4]   2> 138 T91 oasc.SolrCore.<init> [collection1] Opening new SolrCore at /mnt/ssd/jenkins/workspace/Lucene-Solr-4.x-Linux-Java6-64/checkout/solr/build/contrib/solr-dataimporthandler/test-files/dih/solr/collection1/, dataDir=/mnt/ssd/jenkins/workspace/Lucene-Solr-4.x-Linux-Java6-64/checkout/solr/build/contrib/solr-dataimporthandler/test/J0/./solrtest-TestSqlEntityProcessorDeltaPrefixedPk-1341227510744/
   [junit4]   2> 138 T91 oasc.SolrCore.<init> JMX monitoring not detected for core: collection1
   [junit4]   2> 138 T91 oasc.SolrCore.initListeners [collection1] Added SolrEventListener for newSearcher: org.apache.solr.core.QuerySenderListener{queries=[{q=solr,start=0,rows=10}, {q=rocks,start=0,rows=10}, {q=static newSearcher warming query from solrconfig.xml}]}
   [junit4]   2> 139 T91 oasc.SolrCore.initListeners [collection1] Added SolrEventListener for firstSearcher: org.apache.solr.core.QuerySenderListener{queries=[]}
   [junit4]   2> 139 T91 oasc.SolrCore.getNewIndexDir WARNING New index directory detected: old=null new=/mnt/ssd/jenkins/workspace/Lucene-Solr-4.x-Linux-Java6-64/checkout/solr/build/contrib/solr-dataimporthandler/test/J0/./solrtest-TestSqlEntityProcessorDeltaPrefixedPk-1341227510744/index/
   [junit4]   2> 140 T91 oasc.SolrCore.initIndex WARNING [collection1] Solr index directory '/mnt/ssd/jenkins/workspace/Lucene-Solr-4.x-Linux-Java6-64/checkout/solr/build/contrib/solr-dataimporthandler/test/J0/./solrtest-TestSqlEntityProcessorDeltaPrefixedPk-1341227510744/index' doesn't exist. Creating new index...
   [junit4]   2> 142 T91 oasc.SolrDeletionPolicy.onCommit SolrDeletionPolicy.onCommit: commits:num=1
   [junit4]   2> 		commit{dir=MockDirWrapper(org.apache.lucene.store.RAMDirectory@52039826 lockFactory=org.apache.lucene.store.NativeFSLockFactory@20688e91),segFN=segments_1,generation=1,filenames=[segments_1]
   [junit4]   2> 142 T91 oasc.SolrDeletionPolicy.updateCommits newest commit = 1
   [junit4]   2> 143 T91 oasup.UpdateRequestProcessorChain.init inserting DistributedUpdateProcessorFactory into updateRequestProcessorChain "" (default)
   [junit4]   2> 143 T91 oasc.RequestHandlers.initHandlersFromConfig created standard: solr.StandardRequestHandler
   [junit4]   2> 143 T91 oasc.RequestHandlers.initHandlersFromConfig created /dataimport: org.apache.solr.handler.dataimport.DataImportHandler
   [junit4]   2> 144 T91 oasc.RequestHandlers.initHandlersFromConfig created /search: org.apache.solr.handler.component.SearchHandler
   [junit4]   2> 144 T91 oasc.RequestHandlers.initHandlersFromConfig created /update: solr.UpdateRequestHandler
   [junit4]   2> 144 T91 oashl.XMLLoader.init xsltCacheLifetimeSeconds=60
   [junit4]   2> 147 T91 oass.SolrIndexSearcher.<init> Opening Searcher@1f4b52aa main
   [junit4]   2> 147 T91 oass.SolrIndexSearcher.<init> WARNING WARNING: Directory impl does not support setting indexDir: org.apache.lucene.store.MockDirectoryWrapper
   [junit4]   2> 148 T91 oasu.CommitTracker.<init> Hard AutoCommit: disabled
   [junit4]   2> 148 T91 oasu.CommitTracker.<init> Soft AutoCommit: disabled
   [junit4]   2> 148 T91 oashc.HttpShardHandlerFactory.getParameter Setting socketTimeout to: 0
   [junit4]   2> 149 T91 oashc.HttpShardHandlerFactory.getParameter Setting urlScheme to: http://
   [junit4]   2> 149 T91 oashc.HttpShardHandlerFactory.getParameter Setting connTimeout to: 0
   [junit4]   2> 149 T91 oashc.HttpShardHandlerFactory.getParameter Setting maxConnectionsPerHost to: 20
   [junit4]   2> 149 T91 oashc.HttpShardHandlerFactory.getParameter Setting corePoolSize to: 0
   [junit4]   2> 150 T91 oashc.HttpShardHandlerFactory.getParameter Setting maximumPoolSize to: 2147483647
   [junit4]   2> 150 T91 oashc.HttpShardHandlerFactory.getParameter Setting maxThreadIdleTime to: 5
   [junit4]   2> 150 T91 oashc.HttpShardHandlerFactory.getParameter Setting sizeOfQueue to: -1
   [junit4]   2> 150 T91 oashc.HttpShardHandlerFactory.getParameter Setting fairnessPolicy to: false
   [junit4]   2> 151 T91 oascsi.HttpClientUtil.createClient Creating new http client, config:maxConnectionsPerHost=20&maxConnections=10000&socketTimeout=0&connTimeout=0&retry=false
   [junit4]   2> 154 T92 oasc.QuerySenderListener.newSearcher QuerySenderListener sending requests to Searcher@1f4b52aa main{StandardDirectoryReader(segments_1:1)}
   [junit4]   2> 154 T91 oasc.CoreContainer.register registering core: collection1
   [junit4]   2> 154 T92 oasc.QuerySenderListener.newSearcher QuerySenderListener done.
   [junit4]   2> 154 T92 oasc.SolrCore.registerSearcher [collection1] Registered new searcher Searcher@1f4b52aa main{StandardDirectoryReader(segments_1:1)}
   [junit4]   2> 154 T91 oas.SolrTestCaseJ4.initCore ####initCore end
   [junit4]   2> 
   [junit4] ERROR   0.10s J0 | TestSqlEntityProcessorDeltaPrefixedPk.testDeltaImport_replace_resolvesUnprefixedPk
   [junit4]    > Throwable #1: java.lang.RuntimeException: Exception during query
   [junit4]    > 	at __randomizedtesting.SeedInfo.seed([82D4BE3DF1479E1A:8013CE9423D29096]:0)
   [junit4]    > 	at org.apache.solr.SolrTestCaseJ4.assertQ(SolrTestCaseJ4.java:461)
   [junit4]    > 	at org.apache.solr.SolrTestCaseJ4.assertQ(SolrTestCaseJ4.java:428)
   [junit4]    > 	at org.apache.solr.handler.dataimport.TestSqlEntityProcessorDeltaPrefixedPk.testDeltaImport_replace_resolvesUnprefixedPk(TestSqlEntityProcessorDeltaPrefixedPk.java:118)
   [junit4]    > 	at sun.reflect.NativeMethodAccessorImpl.invoke0(Native Method)
   [junit4]    > 	at sun.reflect.NativeMethodAccessorImpl.invoke(NativeMethodAccessorImpl.java:39)
   [junit4]    > 	at sun.reflect.DelegatingMethodAccessorImpl.invoke(DelegatingMethodAccessorImpl.java:25)
   [junit4]    > 	at java.lang.reflect.Method.invoke(Method.java:597)
   [junit4]    > 	at com.carrotsearch.randomizedtesting.RandomizedRunner.invoke(RandomizedRunner.java:1969)
   [junit4]    > 	at com.carrotsearch.randomizedtesting.RandomizedRunner.access$1100(RandomizedRunner.java:132)
   [junit4]    > 	at com.carrotsearch.randomizedtesting.RandomizedRunner$6.evaluate(RandomizedRunner.java:814)
   [junit4]    > 	at com.carrotsearch.randomizedtesting.RandomizedRunner$7.evaluate(RandomizedRunner.java:875)
   [junit4]    > 	at com.carrotsearch.randomizedtesting.RandomizedRunner$8.evaluate(RandomizedRunner.java:889)
   [junit4]    > 	at com.carrotsearch.randomizedtesting.rules.SystemPropertiesRestoreRule$1.evaluate(SystemPropertiesRestoreRule.java:53)
   [junit4]    > 	at org.apache.lucene.util.TestRuleSetupTeardownChained$1.evaluate(TestRuleSetupTeardownChained.java:50)
   [junit4]    > 	at org.apache.lucene.util.TestRuleFieldCacheSanity$1.evaluate(TestRuleFieldCacheSanity.java:32)
   [junit4]    > 	at org.apache.lucene.util.AbstractBeforeAfterRule$1.evaluate(AbstractBeforeAfterRule.java:45)
   [junit4]    > 	at com.carrotsearch.randomizedtesting.rules.SystemPropertiesInvariantRule$1.evaluate(SystemPropertiesInvariantRule.java:55)
   [junit4]    > 	at org.apache.lucene.util.TestRuleReportUncaughtExceptions$1.evaluate(TestRuleReportUncaughtExceptions.java:68)
   [junit4]    > 	at org.apache.lucene.util.TestRuleThreadAndTestName$1.evaluate(TestRuleThreadAndTestName.java:48)
   [junit4]    > 	at org.apache.lucene.util.TestRuleIgnoreAfterMaxFailures$1.evaluate(TestRuleIgnoreAfterMaxFailures.java:70)
   [junit4]    > 	at org.apache.lucene.util.TestRuleMarkFailure$1.evaluate(TestRuleMarkFailure.java:48)
   [junit4]    > 	at com.carrotsearch.randomizedtesting.RandomizedRunner.runSingleTest(RandomizedRunner.java:821)
   [junit4]    > 	at com.carrotsearch.randomizedtesting.RandomizedRunner.access$700(RandomizedRunner.java:132)
   [junit4]    > 	at com.carrotsearch.randomizedtesting.RandomizedRunner$3$1.run(RandomizedRunner.java:669)
   [junit4]    > 	at com.carrotsearch.randomizedtesting.RandomizedRunner$3.evaluate(RandomizedRunner.java:695)
   [junit4]    > 	at com.carrotsearch.randomizedtesting.RandomizedRunner$4.evaluate(RandomizedRunner.java:734)
   [junit4]    > 	at com.carrotsearch.randomizedtesting.RandomizedRunner$5.evaluate(RandomizedRunner.java:745)
   [junit4]    > 	at com.carrotsearch.randomizedtesting.rules.SystemPropertiesRestoreRule$1.evaluate(SystemPropertiesRestoreRule.java:53)
   [junit4]    > 	at org.apache.lucene.util.AbstractBeforeAfterRule$1.evaluate(AbstractBeforeAfterRule.java:45)
   [junit4]    > 	at org.apache.lucene.util.TestRuleReportUncaughtExceptions$1.evaluate(TestRuleReportUncaughtExceptions.java:68)
   [junit4]    > 	at org.apache.lucene.util.TestRuleStoreClassName$1.evaluate(TestRuleStoreClassName.java:38)
   [junit4]    > 	at org.apache.lucene.util.TestRuleIcuHack$1.evaluate(TestRuleIcuHack.java:51)
   [junit4]    > 	at com.carrotsearch.randomizedtesting.rules.SystemPropertiesInvariantRule$1.evaluate(SystemPropertiesInvariantRule.java:55)
   [junit4]    > 	at org.apache.lucene.util.TestRuleNoInstanceHooksOverrides$1.evaluate(TestRuleNoInstanceHooksOverrides.java:53)
   [junit4]    > 	at org.apache.lucene.util.TestRuleNoStaticHooksShadowing$1.evaluate(TestRuleNoStaticHooksShadowing.java:52)
   [junit4]    > 	at org.apache.lucene.util.TestRuleAssertionsRequired$1.evaluate(TestRuleAssertionsRequired.java:36)
   [junit4]    > 	at org.apache.lucene.util.TestRuleMarkFailure$1.evaluate(TestRuleMarkFailure.java:48)
   [junit4]    > 	at org.apache.lucene.util.TestRuleIgnoreAfterMaxFailures$1.evaluate(TestRuleIgnoreAfterMaxFailures.java:70)
   [junit4]    > 	at org.apache.lucene.util.TestRuleIgnoreTestSuites$1.evaluate(TestRuleIgnoreTestSuites.java:55)
   [junit4]    > 	at com.carrotsearch.randomizedtesting.RandomizedRunner.runSuite(RandomizedRunner.java:605)
   [junit4]    > 	at com.carrotsearch.randomizedtesting.RandomizedRunner.access$400(RandomizedRunner.java:132)
   [junit4]    > 	at com.carrotsearch.randomizedtesting.RandomizedRunner$2.run(RandomizedRunner.java:551)
   [junit4]    > Caused by: java.lang.RuntimeException: REQUEST FAILED: xpath=//*[@numFound='0']
   [junit4]    > 	xml response was: <?xml version="1.0" encoding="UTF-8"?>
   [junit4]    > <response>
   [junit4]    > <lst name="responseHeader"><int name="status">0</int><int name="QTime">0</int><lst name="params"><str name="start">0</str><str name="q">desc:bar</str><str name="qt">standard</str><str name="rows">20</str><str name="version">2.2</str></lst></lst><result name="response" numFound="1" start="0"><doc><str name="id">1</str><arr name="desc"><str>bar</str></arr><date name="timestamp">2012-07-02T11:11:50.92Z</date></doc></result>
   [junit4]    > </response>
   [junit4]    > 
   [junit4]    > 	request was:start=0&q=desc:bar&qt=standard&rows=20&version=2.2
   [junit4]    > 	at org.apache.solr.SolrTestCaseJ4.assertQ(SolrTestCaseJ4.java:454)
   [junit4]    > 	... 41 more
   [junit4]    > 
   [junit4]   2> 157 T91 oas.SolrTestCaseJ4.setUp ###Starting testDeltaImport_replace_resolvesUnprefixedPk
   [junit4]   2> ASYNC  NEW_CORE C13 name=collection1 org.apache.solr.core.SolrCore@2c91e143
   [junit4]   2> 161 T91 C13 oasu.DirectUpdateHandler2.deleteAll [collection1] REMOVING ALL DOCUMENTS FROM INDEX
   [junit4]   2> 163 T91 C13 oasc.SolrDeletionPolicy.onInit SolrDeletionPolicy.onInit: commits:num=1
   [junit4]   2> 		commit{dir=MockDirWrapper(org.apache.lucene.store.RAMDirectory@52039826 lockFactory=org.apache.lucene.store.NativeFSLockFactory@20688e91),segFN=segments_1,generation=1,filenames=[segments_1]
   [junit4]   2> 164 T91 C13 oasc.SolrDeletionPolicy.updateCommits newest commit = 1
   [junit4]   2> 164 T91 C13 UPDATE [collection1] webapp=null path=null params={} {deleteByQuery=*:*} 0 3
   [junit4]   2> 170 T91 C13 oasu.DirectUpdateHandler2.commit start commit{flags=0,version=0,optimize=false,openSearcher=true,waitSearcher=true,expungeDeletes=false,softCommit=false}
   [junit4]   2> 171 T91 C13 oasc.SolrDeletionPolicy.onCommit SolrDeletionPolicy.onCommit: commits:num=2
   [junit4]   2> 		commit{dir=MockDirWrapper(org.apache.lucene.store.RAMDirectory@52039826 lockFactory=org.apache.lucene.store.NativeFSLockFactory@20688e91),segFN=segments_1,generation=1,filenames=[segments_1]
   [junit4]   2> 		commit{dir=MockDirWrapper(org.apache.lucene.store.RAMDirectory@52039826 lockFactory=org.apache.lucene.store.NativeFSLockFactory@20688e91),segFN=segments_2,generation=2,filenames=[segments_2]
   [junit4]   2> 171 T91 C13 oasc.SolrDeletionPolicy.updateCommits newest commit = 2
   [junit4]   2> 172 T91 C13 oass.SolrIndexSearcher.<init> Opening Searcher@76d5f9b9 main
   [junit4]   2> 172 T91 C13 oass.SolrIndexSearcher.<init> WARNING WARNING: Directory impl does not support setting indexDir: org.apache.lucene.store.MockDirectoryWrapper
   [junit4]   2> 172 T91 C13 oasu.DirectUpdateHandler2.commit end_commit_flush
   [junit4]   2> 173 T92 oasc.QuerySenderListener.newSearcher QuerySenderListener sending requests to Searcher@76d5f9b9 main{StandardDirectoryReader(segments_2:2)}
   [junit4]   2> 173 T92 C13 REQ [collection1] webapp=null path=null params={start=0&event=newSearcher&q=solr&distrib=false&rows=10} hits=0 status=0 QTime=0 
   [junit4]   2> 174 T92 C13 REQ [collection1] webapp=null path=null params={start=0&event=newSearcher&q=rocks&distrib=false&rows=10} hits=0 status=0 QTime=1 
   [junit4]   2> 174 T92 C13 REQ [collection1] webapp=null path=null params={event=newSearcher&q=static+newSearcher+warming+query+from+solrconfig.xml&distrib=false} hits=0 status=0 QTime=0 
   [junit4]   2> 174 T92 oasc.QuerySenderListener.newSearcher QuerySenderListener done.
   [junit4]   2> 175 T92 oasc.SolrCore.registerSearcher [collection1] Registered new searcher Searcher@76d5f9b9 main{StandardDirectoryReader(segments_2:2)}
   [junit4]   2> 175 T91 C13 UPDATE [collection1] webapp=null path=null params={} {commit=} 0 5
   [junit4]   2> 177 T91 C13 oashd.DataImportHandler.processConfiguration No configuration specified in solrconfig.xml for DataImportHandler
   [junit4]   2> 179 T91 C13 oashd.DataImporter.loadDataConfig Data Configuration loaded successfully
   [junit4]   2> 179 T91 C13 oashd.DataImporter.doFullImport Starting Full Import
   [junit4]   2> 180 T91 C13 oashd.SimplePropertiesWriter.readIndexerProperties Read dataimport.properties
   [junit4]   2> 180 T91 C13 oasu.DirectUpdateHandler2.deleteAll [collection1] REMOVING ALL DOCUMENTS FROM INDEX
   [junit4]   2> 186 T91 C13 oashd.DocBuilder.finish Import completed successfully
   [junit4]   2> 186 T91 C13 oasu.DirectUpdateHandler2.commit start commit{flags=0,version=0,optimize=false,openSearcher=true,waitSearcher=true,expungeDeletes=false,softCommit=false}
   [junit4]   2> 188 T91 C13 oasc.SolrDeletionPolicy.onCommit SolrDeletionPolicy.onCommit: commits:num=2
   [junit4]   2> 		commit{dir=MockDirWrapper(org.apache.lucene.store.RAMDirectory@52039826 lockFactory=org.apache.lucene.store.NativeFSLockFactory@20688e91),segFN=segments_2,generation=2,filenames=[segments_2]
   [junit4]   2> 		commit{dir=MockDirWrapper(org.apache.lucene.store.RAMDirectory@52039826 lockFactory=org.apache.lucene.store.NativeFSLockFactory@20688e91),segFN=segments_3,generation=3,filenames=[_0_Lucene40_0.tim, _0.fnm, _0_Lucene40_0.frq, _0.fdx, _0.si, _0.fdt, segments_3, _0_Lucene40_0.tip]
   [junit4]   2> 189 T91 C13 oasc.SolrDeletionPolicy.updateCommits newest commit = 3
   [junit4]   2> 190 T91 C13 oass.SolrIndexSearcher.<init> Opening Searcher@34baf4ae main
   [junit4]   2> 191 T91 C13 oass.SolrIndexSearcher.<init> WARNING WARNING: Directory impl does not support setting indexDir: org.apache.lucene.store.MockDirectoryWrapper
   [junit4]   2> 191 T91 C13 oasu.DirectUpdateHandler2.commit end_commit_flush
   [junit4]   2> 192 T92 oasc.QuerySenderListener.newSearcher QuerySenderListener sending requests to Searcher@34baf4ae main{StandardDirectoryReader(segments_3:5 _0(4.0):C1)}
   [junit4]   2> 193 T92 C13 REQ [collection1] webapp=null path=null params={start=0&event=newSearcher&q=solr&distrib=false&rows=10} hits=0 status=0 QTime=1 
   [junit4]   2> 193 T92 C13 REQ [collection1] webapp=null path=null params={start=0&event=newSearcher&q=rocks&distrib=false&rows=10} hits=0 status=0 QTime=0 
   [junit4]   2> 193 T92 C13 REQ [collection1] webapp=null path=null params={event=newSearcher&q=static+newSearcher+warming+query+from+solrconfig.xml&distrib=false} hits=0 status=0 QTime=0 
   [junit4]   2> 194 T92 oasc.QuerySenderListener.newSearcher QuerySenderListener done.
   [junit4]   2> 194 T92 oasc.SolrCore.registerSearcher [collection1] Registered new searcher Searcher@34baf4ae main{StandardDirectoryReader(segments_3:5 _0(4.0):C1)}
   [junit4]   2> 194 T91 C13 oashd.SimplePropertiesWriter.readIndexerProperties Read dataimport.properties
   [junit4]   2> 195 T91 C13 oashd.SimplePropertiesWriter.persist Wrote last indexed time to dataimport.properties
   [junit4]   2> 195 T91 C13 oashd.DocBuilder.execute Time taken = 0:0:0.15
   [junit4]   2> 196 T91 C13 UPDATE [collection1] webapp=null path=null params={clean=true&dataConfig=<dataConfig>++<dataSource++type%3D"MockDataSource"/>%0a++<document>%0a++++<entity+name%3D"x"+transformer%3D"TemplateTransformer"+pk%3D"x.id"++++++++++++query%3D"select+*+from+x"++++++++++++deletedPkQuery%3D"select+id+from+x+where+last_modified+>+NOW+AND+deleted%3D'true'"++++++++++++deltaImportQuery%3D"select+*+from+x+where+id%3D'${dih.delta.id}'"++++++++++++deltaQuery%3D"select+id+from+x+where+last_modified+>+NOW">%0a++++++<field+column%3D"id"+name%3D"id"/>%0a++++++<field+column%3D"desc"+name%3D"desc"/>%0a++++</entity>%0a++</document>%0a</dataConfig>%0a&commit=true&command=full-import&debug=on} {deleteByQuery=*:*,add=[1],commit=} 0 19
   [junit4]   2> 197 T91 C13 REQ [collection1] webapp=null path=null params={start=0&q=*:*+OR+add1document&qt=standard&rows=20&version=2.2} hits=1 status=0 QTime=1 
   [junit4]   2> 199 T91 C13 REQ [collection1] webapp=null path=null params={start=0&q=id:1&qt=standard&rows=20&version=2.2} hits=1 status=0 QTime=0 
   [junit4]   2> 202 T91 C13 REQ [collection1] webapp=null path=null params={start=0&q=desc:bar&qt=standard&rows=20&version=2.2} hits=1 status=0 QTime=0 
   [junit4]   2> 205 T91 C13 oashd.DataImportHandler.processConfiguration No configuration specified in solrconfig.xml for DataImportHandler
   [junit4]   2> 207 T91 C13 oashd.DataImporter.loadDataConfig Data Configuration loaded successfully
   [junit4]   2> 207 T91 C13 oashd.DataImporter.doDeltaImport Starting Delta Import
   [junit4]   2> 207 T91 C13 oashd.SimplePropertiesWriter.readIndexerProperties Read dataimport.properties
   [junit4]   2> 208 T91 C13 oashd.DataImporter.doDeltaImport SEVERE Delta Import Failed org.apache.solr.handler.dataimport.DataImportHandlerException: Properties is not writable. Delta imports are supported by data config but will not work. Processing Document # 1
   [junit4]   2> 	at org.apache.solr.handler.dataimport.DataImporter.checkWritablePersistFile(DataImporter.java:350)
   [junit4]   2> 	at org.apache.solr.handler.dataimport.DataImporter.doDeltaImport(DataImporter.java:362)
   [junit4]   2> 	at org.apache.solr.handler.dataimport.DataImporter.runCmd(DataImporter.java:401)
   [junit4]   2> 	at org.apache.solr.handler.dataimport.DataImportHandler.handleRequestBody(DataImportHandler.java:205)
   [junit4]   2> 	at org.apache.solr.handler.RequestHandlerBase.handleRequest(RequestHandlerBase.java:129)
   [junit4]   2> 	at org.apache.solr.core.SolrCore.execute(SolrCore.java:1599)
   [junit4]   2> 	at org.apache.solr.util.TestHarness.query(TestHarness.java:330)
   [junit4]   2> 	at org.apache.solr.handler.dataimport.AbstractDataImportHandlerTestCase.runDeltaImport(AbstractDataImportHandlerTestCase.java:103)
   [junit4]   2> 	at org.apache.solr.handler.dataimport.TestSqlEntityProcessorDeltaPrefixedPk.testDeltaImport_replace_resolvesUnprefixedPk(TestSqlEntityProcessorDeltaPrefixedPk.java:114)
   [junit4]   2> 	at sun.reflect.NativeMethodAccessorImpl.invoke0(Native Method)
   [junit4]   2> 	at sun.reflect.NativeMethodAccessorImpl.invoke(NativeMethodAccessorImpl.java:39)
   [junit4]   2> 	at sun.reflect.DelegatingMethodAccessorImpl.invoke(DelegatingMethodAccessorImpl.java:25)
   [junit4]   2> 	at java.lang.reflect.Method.invoke(Method.java:597)
   [junit4]   2> 	at com.carrotsearch.randomizedtesting.RandomizedRunner.invoke(RandomizedRunner.java:1969)
   [junit4]   2> 	at com.carrotsearch.randomizedtesting.RandomizedRunner.access$1100(RandomizedRunner.java:132)
   [junit4]   2> 	at com.carrotsearch.randomizedtesting.RandomizedRunner$6.evaluate(RandomizedRunner.java:814)
   [junit4]   2> 	at com.carrotsearch.randomizedtesting.RandomizedRunner$7.evaluate(RandomizedRunner.java:875)
   [junit4]   2> 	at com.carrotsearch.randomizedtesting.RandomizedRunner$8.evaluate(RandomizedRunner.java:889)
   [junit4]   2> 	at com.carrotsearch.randomizedtesting.rules.SystemPropertiesRestoreRule$1.evaluate(SystemPropertiesRestoreRule.java:53)
   [junit4]   2> 	at org.apache.lucene.util.TestRuleSetupTeardownChained$1.evaluate(TestRuleSetupTeardownChained.java:50)
   [junit4]   2> 	at org.apache.lucene.util.TestRuleFieldCacheSanity$1.evaluate(TestRuleFieldCacheSanity.java:32)
   [junit4]   2> 	at org.apache.lucene.util.AbstractBeforeAfterRule$1.evaluate(AbstractBeforeAfterRule.java:45)
   [junit4]   2> 	at com.carrotsearch.randomizedtesting.rules.SystemPropertiesInvariantRule$1.evaluate(SystemPropertiesInvariantRule.java:55)
   [junit4]   2> 	at org.apache.lucene.util.TestRuleReportUncaughtExceptions$1.evaluate(TestRuleReportUncaughtExceptions.java:68)
   [junit4]   2> 	at org.apache.lucene.util.TestRuleThreadAndTestName$1.evaluate(TestRuleThreadAndTestName.java:48)
   [junit4]   2> 	at org.apache.lucene.util.TestRuleIgnoreAfterMaxFailures$1.evaluate(TestRuleIgnoreAfterMaxFailures.java:70)
   [junit4]   2> 	at org.apache.lucene.util.TestRuleMarkFailure$1.evaluate(TestRuleMarkFailure.java:48)
   [junit4]   2> 	at com.carrotsearch.randomizedtesting.RandomizedRunner.runSingleTest(RandomizedRunner.java:821)
   [junit4]   2> 	at com.carrotsearch.randomizedtesting.RandomizedRunner.access$700(RandomizedRunner.java:132)
   [junit4]   2> 	at com.carrotsearch.randomizedtesting.RandomizedRunner$3$1.run(RandomizedRunner.java:669)
   [junit4]   2> 	at com.carrotsearch.randomizedtesting.RandomizedRunner$3.evaluate(RandomizedRunner.java:695)
   [junit4]   2> 	at com.carrotsearch.randomizedtesting.RandomizedRunner$4.evaluate(RandomizedRunner.java:734)
   [junit4]   2> 	at com.carrotsearch.randomizedtesting.RandomizedRunner$5.evaluate(RandomizedRunner.java:745)
   [junit4]   2> 	at com.carrotsearch.randomizedtesting.rules.SystemPropertiesRestoreRule$1.evaluate(SystemPropertiesRestoreRule.java:53)
   [junit4]   2> 	at org.apache.lucene.util.AbstractBeforeAfterRule$1.evaluate(AbstractBeforeAfterRule.java:45)
   [junit4]   2> 	at org.apache.lucene.util.TestRuleReportUncaughtExceptions$1.evaluate(TestRuleReportUncaughtExceptions.java:68)
   [junit4]   2> 	at org.apache.lucene.util.TestRuleStoreClassName$1.evaluate(TestRuleStoreClassName.java:38)
   [junit4]   2> 	at org.apache.lucene.util.TestRuleIcuHack$1.evaluate(TestRuleIcuHack.java:51)
   [junit4]   2> 	at com.carrotsearch.randomizedtesting.rules.SystemPropertiesInvariantRule$1.evaluate(SystemPropertiesInvariantRule.java:55)
   [junit4]   2> 	at org.apache.lucene.util.TestRuleNoInstanceHooksOverrides$1.evaluate(TestRuleNoInstanceHooksOverrides.java:53)
   [junit4]   2> 	at org.apache.lucene.util.TestRuleNoStaticHooksShadowing$1.evaluate(TestRuleNoStaticHooksShadowing.java:52)
   [junit4]   2> 	at org.apache.lucene.util.TestRuleAssertionsRequired$1.evaluate(TestRuleAssertionsRequired.java:36)
   [junit4]   2> 	at org.apache.lucene.util.TestRuleMarkFailure$1.evaluate(TestRuleMarkFailure.java:48)
   [junit4]   2> 	at org.apache.lucene.util.TestRuleIgnoreAfterMaxFailures$1.evaluate(TestRuleIgnoreAfterMaxFailures.java:70)
   [junit4]   2> 	at org.apache.lucene.util.TestRuleIgnoreTestSuites$1.evaluate(TestRuleIgnoreTestSuites.java:55)
   [junit4]   2> 	at com.carrotsearch.randomizedtesting.RandomizedRunner.runSuite(RandomizedRunner.java:605)
   [junit4]   2> 	at com.carrotsearch.randomizedtesting.RandomizedRunner.access$400(RandomizedRunner.java:132)
   [junit4]   2> 	at com.carrotsearch.randomizedtesting.RandomizedRunner$2.run(RandomizedRunner.java:551)
   [junit4]   2> 
   [junit4]   2> 209 T91 C13 oasu.DirectUpdateHandler2.rollback start rollback{flags=0,version=0}
   [junit4]   2> 210 T91 C13 oashd.SolrWriter.rollback SEVERE Exception while solr rollback. org.apache.lucene.index.IndexNotFoundException: no segments* file found in MockDirWrapper(org.apache.lucene.store.RAMDirectory@6b6a3075 lockFactory=org.apache.lucene.store.NativeFSLockFactory@de12d33): files: []
   [junit4]   2> 	at org.apache.lucene.index.SegmentInfos$FindSegmentsFile.run(SegmentInfos.java:710)
   [junit4]   2> 	at org.apache.lucene.index.SegmentInfos$FindSegmentsFile.run(SegmentInfos.java:600)
   [junit4]   2> 	at org.apache.lucene.index.SegmentInfos.read(SegmentInfos.java:326)
   [junit4]   2> 	at org.apache.lucene.index.IndexWriter.<init>(IndexWriter.java:634)
   [junit4]   2> 	at org.apache.solr.update.SolrIndexWriter.<init>(SolrIndexWriter.java:58)
   [junit4]   2> 	at org.apache.solr.update.DefaultSolrCoreState.createMainIndexWriter(DefaultSolrCoreState.java:111)
   [junit4]   2> 	at org.apache.solr.update.DefaultSolrCoreState.newIndexWriter(DefaultSolrCoreState.java:61)
   [junit4]   2> 	at org.apache.solr.update.DefaultSolrCoreState.rollbackIndexWriter(DefaultSolrCoreState.java:106)
   [junit4]   2> 	at org.apache.solr.update.DirectUpdateHandler2.rollbackWriter(DirectUpdateHandler2.java:143)
   [junit4]   2> 	at org.apache.solr.update.DirectUpdateHandler2.rollback(DirectUpdateHandler2.java:503)
   [junit4]   2> 	at org.apache.solr.update.processor.RunUpdateProcessor.processRollback(RunUpdateProcessorFactory.java:93)
   [junit4]   2> 	at org.apache.solr.update.processor.UpdateRequestProcessor.processRollback(UpdateRequestProcessor.java:72)
   [junit4]   2> 	at org.apache.solr.update.processor.UpdateRequestProcessor.processRollback(UpdateRequestProcessor.java:72)
   [junit4]   2> 	at org.apache.solr.handler.dataimport.AbstractDataImportHandlerTestCase$TestUpdateRequestProcessor.processRollback(AbstractDataImportHandlerTestCase.java:376)
   [junit4]   2> 	at org.apache.solr.handler.dataimport.SolrWriter.rollback(SolrWriter.java:117)
   [junit4]   2> 	at org.apache.solr.handler.dataimport.DocBuilder.rollback(DocBuilder.java:319)
   [junit4]   2> 	at org.apache.solr.handler.dataimport.DataImporter.doDeltaImport(DataImporter.java:368)
   [junit4]   2> 	at org.apache.solr.handler.dataimport.DataImporter.runCmd(DataImporter.java:401)
   [junit4]   2> 	at org.apache.solr.handler.dataimport.DataImportHandler.handleRequestBody(DataImportHandler.java:205)
   [junit4]   2> 	at org.apache.solr.handler.RequestHandlerBase.handleRequest(RequestHandlerBase.java:129)
   [junit4]   2> 	at org.apache.solr.core.SolrCore.execute(SolrCore.java:1599)
   [junit4]   2> 	at org.apache.solr.util.TestHarness.query(TestHarness.java:330)
   [junit4]   2> 	at org.apache.solr.handler.dataimport.AbstractDataImportHandlerTestCase.runDeltaImport(AbstractDataImportHandlerTestCase.java:103)
   [junit4]   2> 	at org.apache.solr.handler.dataimport.TestSqlEntityProcessorDeltaPrefixedPk.testDeltaImport_replace_resolvesUnprefixedPk(TestSqlEntityProcessorDeltaPrefixedPk.java:114)
   [junit4]   2> 	at sun.reflect.NativeMethodAccessorImpl.invoke0(Native Method)
   [junit4]   2> 	at sun.reflect.NativeMethodAccessorImpl.invoke(NativeMethodAccessorImpl.java:39)
   [junit4]   2> 	at sun.reflect.DelegatingMethodAccessorImpl.invoke(DelegatingMethodAccessorImpl.java:25)
   [junit4]   2> 	at java.lang.reflect.Method.invoke(Method.java:597)
   [junit4]   2> 	at com.carrotsearch.randomizedtesting.RandomizedRunner.invoke(RandomizedRunner.java:1969)
   [junit4]   2> 	at com.carrotsearch.randomizedtesting.RandomizedRunner.access$1100(RandomizedRunner.java:132)
   [junit4]   2> 	at com.carrotsearch.randomizedtesting.RandomizedRunner$6.evaluate(RandomizedRunner.java:814)
   [junit4]   2> 	at com.carrotsearch.randomizedtesting.RandomizedRunner$7.evaluate(RandomizedRunner.java:875)
   [junit4]   2> 	at com.carrotsearch.randomizedtesting.RandomizedRunner$8.evaluate(RandomizedRunner.java:889)
   [junit4]   2> 	at com.carrotsearch.randomizedtesting.rules.SystemPropertiesRestoreRule$1.evaluate(SystemPropertiesRestoreRule.java:53)
   [junit4]   2> 	at org.apache.lucene.util.TestRuleSetupTeardownChained$1.evaluate(TestRuleSetupTeardownChained.java:50)
   [junit4]   2> 	at org.apache.lucene.util.TestRuleFieldCacheSanity$1.evaluate(TestRuleFieldCacheSanity.java:32)
   [junit4]   2> 	at org.apache.lucene.util.AbstractBeforeAfterRule$1.evaluate(AbstractBeforeAfterRule.java:45)
   [junit4]   2> 	at com.carrotsearch.randomizedtesting.rules.SystemPropertiesInvariantRule$1.evaluate(SystemPropertiesInvariantRule.java:55)
   [junit4]   2> 	at org.apache.lucene.util.TestRuleReportUncaughtExceptions$1.evaluate(TestRuleReportUncaughtExceptions.java:68)
   [junit4]   2> 	at org.apache.lucene.util.TestRuleThreadAndTestName$1.evaluate(TestRuleThreadAndTestName.java:48)
   [junit4]   2> 	at org.apache.lucene.util.TestRuleIgnoreAfterMaxFailures$1.evaluate(TestRuleIgnoreAfterMaxFailures.java:70)
   [junit4]   2> 	at org.apache.lucene.util.TestRuleMarkFailure$1.evaluate(TestRuleMarkFailure.java:48)
   [junit4]   2> 	at com.carrotsearch.randomizedtesting.RandomizedRunner.runSingleTest(RandomizedRunner.java:821)
   [junit4]   2> 	at com.carrotsearch.randomizedtesting.RandomizedRunner.access$700(RandomizedRunner.java:132)
   [junit4]   2> 	at com.carrotsearch.randomizedtesting.RandomizedRunner$3$1.run(RandomizedRunner.java:669)
   [junit4]   2> 	at com.carrotsearch.randomizedtesting.RandomizedRunner$3.evaluate(RandomizedRunner.java:695)
   [junit4]   2> 	at com.carrotsearch.randomizedtesting.RandomizedRunner$4.evaluate(RandomizedRunner.java:734)
   [junit4]   2> 	at com.carrotsearch.randomizedtesting.RandomizedRunner$5.evaluate(RandomizedRunner.java:745)
   [junit4]   2> 	at com.carrotsearch.randomizedtesting.rules.SystemPropertiesRestoreRule$1.evaluate(SystemPropertiesRestoreRule.java:53)
   [junit4]   2> 	at org.apache.lucene.util.AbstractBeforeAfterRule$1.evaluate(AbstractBeforeAfterRule.java:45)
   [junit4]   2> 	at org.apache.lucene.util.TestRuleReportUncaughtExceptions$1.evaluate(TestRuleReportUncaughtExceptions.java:68)
   [junit4]   2> 	at org.apache.lucene.util.TestRuleStoreClassName$1.evaluate(TestRuleStoreClassName.java:38)
   [junit4]   2> 	at org.apache.lucene.util.TestRuleIcuHack$1.evaluate(TestRuleIcuHack.java:51)
   [junit4]   2> 	at com.carrotsearch.randomizedtesting.rules.SystemPropertiesInvariantRule$1.evaluate(SystemPropertiesInvariantRule.java:55)
   [junit4]   2> 	at org.apache.lucene.util.TestRuleNoInstanceHooksOverrides$1.evaluate(TestRuleNoInstanceHooksOverrides.java:53)
   [junit4]   2> 	at org.apache.lucene.util.TestRuleNoStaticHooksShadowing$1.evaluate(TestRuleNoStaticHooksShadowing.java:52)
   [junit4]   2> 	at org.apache.lucene.util.TestRuleAssertionsRequired$1.evaluate(TestRuleAssertionsRequired.java:36)
   [junit4]   2> 	at org.apache.lucene.util.TestRuleMarkFailure$1.evaluate(TestRuleMarkFailure.java:48)
   [junit4]   2> 	at org.apache.lucene.util.TestRuleIgnoreAfterMaxFailures$1.evaluate(TestRuleIgnoreAfterMaxFailures.java:70)
   [junit4]   2> 	at org.apache.lucene.util.TestRuleIgnoreTestSuites$1.evaluate(TestRuleIgnoreTestSuites.java:55)
   [junit4]   2> 	at com.carrotsearch.randomizedtesting.RandomizedRunner.runSuite(RandomizedRunner.java:605)
   [junit4]   2> 	at com.carrotsearch.randomizedtesting.RandomizedRunner.access$400(RandomizedRunner.java:132)
   [junit4]   2> 	at com.carrotsearch.randomizedtesting.RandomizedRunner$2.run(RandomizedRunner.java:551)
   [junit4]   2> 
   [junit4]   2> 211 T91 C13 REQ [collection1] webapp=null path=null params={clean=false&dataConfig=<dataConfig>++<dataSource++type%3D"MockDataSource"/>%0a++<document>%0a++++<entity+name%3D"x"+transformer%3D"TemplateTransformer"+pk%3D"x.id"++++++++++++query%3D"select+*+from+x"++++++++++++deletedPkQuery%3D"select+id+from+x+where+last_modified+>+NOW+AND+deleted%3D'true'"++++++++++++deltaImportQuery%3D"select+*+from+x+where+id%3D'${dih.delta.id}'"++++++++++++deltaQuery%3D"select+id+from+x+where+last_modified+>+NOW">%0a++++++<field+column%3D"id"+name%3D"id"/>%0a++++++<field+column%3D"desc"+name%3D"desc"/>%0a++++</entity>%0a++</document>%0a</dataConfig>%0a&commit=true&command=delta-import&debug=on} status=0 QTime=6 
   [junit4]   2> 212 T91 C13 REQ [collection1] webapp=null path=null params={start=0&q=*:*+OR+testDeltaImport_replace_resolvesUnprefixedPk&qt=standard&rows=20&version=2.2} hits=1 status=0 QTime=0 
   [junit4]   2> 215 T91 C13 REQ [collection1] webapp=null path=null params={start=0&q=id:1&qt=standard&rows=20&version=2.2} hits=1 status=0 QTime=0 
   [junit4]   2> 217 T91 C13 REQ [collection1] webapp=null path=null params={start=0&q=desc:bar&qt=standard&rows=20&version=2.2} hits=1 status=0 QTime=0 
   [junit4]   2> 220 T91 oas.SolrTestCaseJ4.assertQ SEVERE REQUEST FAILED: xpath=//*[@numFound='0']
   [junit4]   2> 		xml response was: <?xml version="1.0" encoding="UTF-8"?>
   [junit4]   2> 	<response>
   [junit4]   2> 	<lst name="responseHeader"><int name="status">0</int><int name="QTime">0</int><lst name="params"><str name="start">0</str><str name="q">desc:bar</str><str name="qt">standard</str><str name="rows">20</str><str name="version">2.2</str></lst></lst><result name="response" numFound="1" start="0"><doc><str name="id">1</str><arr name="desc"><str>bar</str></arr><date name="timestamp">2012-07-02T11:11:50.92Z</date></doc></result>
   [junit4]   2> 	</response>
   [junit4]   2> 	
   [junit4]   2> 		request was:start=0&q=desc:bar&qt=standard&rows=20&version=2.2
   [junit4]   2> 220 T91 oasc.SolrException.log SEVERE REQUEST FAILED: start=0&q=desc:bar&qt=standard&rows=20&version=2.2:java.lang.RuntimeException: REQUEST FAILED: xpath=//*[@numFound='0']
   [junit4]   2> 		xml response was: <?xml version="1.0" encoding="UTF-8"?>
   [junit4]   2> 	<response>
   [junit4]   2> 	<lst name="responseHeader"><int name="status">0</int><int name="QTime">0</int><lst name="params"><str name="start">0</str><str name="q">desc:bar</str><str name="qt">standard</str><str name="rows">20</str><str name="version">2.2</str></lst></lst><result name="response" numFound="1" start="0"><doc><str name="id">1</str><arr name="desc"><str>bar</str></arr><date name="timestamp">2012-07-02T11:11:50.92Z</date></doc></result>
   [junit4]   2> 	</response>
   [junit4]   2> 	
   [junit4]   2> 		request was:start=0&q=desc:bar&qt=standard&rows=20&version=2.2
   [junit4]   2> 		at org.apache.solr.SolrTestCaseJ4.assertQ(SolrTestCaseJ4.java:454)
   [junit4]   2> 		at org.apache.solr.SolrTestCaseJ4.assertQ(SolrTestCaseJ4.java:428)
   [junit4]   2> 		at org.apache.solr.handler.dataimport.TestSqlEntityProcessorDeltaPrefixedPk.testDeltaImport_replace_resolvesUnprefixedPk(TestSqlEntityProcessorDeltaPrefixedPk.java:118)
   [junit4]   2> 		at sun.reflect.NativeMethodAccessorImpl.invoke0(Native Method)
   [junit4]   2> 		at sun.reflect.NativeMethodAccessorImpl.invoke(NativeMethodAccessorImpl.java:39)
   [junit4]   2> 		at sun.reflect.DelegatingMethodAccessorImpl.invoke(DelegatingMethodAccessorImpl.java:25)
   [junit4]   2> 		at java.lang.reflect.Method.invoke(Method.java:597)
   [junit4]   2> 		at com.carrotsearch.randomizedtesting.RandomizedRunner.invoke(RandomizedRunner.java:1969)
   [junit4]   2> 		at com.carrotsearch.randomizedtesting.RandomizedRunner.access$1100(RandomizedRunner.java:132)
   [junit4]   2> 		at com.carrotsearch.randomizedtesting.RandomizedRunner$6.evaluate(RandomizedRunner.java:814)
   [junit4]   2> 		at com.carrotsearch.randomizedtesting.RandomizedRunner$7.evaluate(RandomizedRunner.java:875)
   [junit4]   2> 		at com.carrotsearch.randomizedtesting.RandomizedRunner$8.evaluate(RandomizedRunner.java:889)
   [junit4]   2> 		at com.carrotsearch.randomizedtesting.rules.SystemPropertiesRestoreRule$1.evaluate(SystemPropertiesRestoreRule.java:53)
   [junit4]   2> 		at org.apache.lucene.util.TestRuleSetupTeardownChained$1.evaluate(TestRuleSetupTeardownChained.java:50)
   [junit4]   2> 		at org.apache.lucene.util.TestRuleFieldCacheSanity$1.evaluate(TestRuleFieldCacheSanity.java:32)
   [junit4]   2> 		at org.apache.lucene.util.AbstractBeforeAfterRule$1.evaluate(AbstractBeforeAfterRule.java:45)
   [junit4]   2> 		at com.carrotsearch.randomizedtesting.rules.SystemPropertiesInvariantRule$1.evaluate(SystemPropertiesInvariantRule.java:55)
   [junit4]   2> 		at org.apache.lucene.util.TestRuleReportUncaughtExceptions$1.evaluate(TestRuleReportUncaughtExceptions.java:68)
   [junit4]   2> 		at org.apache.lucene.util.TestRuleThreadAndTestName$1.evaluate(TestRuleThreadAndTestName.java:48)
   [junit4]   2> 		at org.apache.lucene.util.TestRuleIgnoreAfterMaxFailures$1.evaluate(TestRuleIgnoreAfterMaxFailures.java:70)
   [junit4]   2> 		at org.apache.lucene.util.TestRuleMarkFailure$1.evaluate(TestRuleMarkFailure.java:48)
   [junit4]   2> 		at com.carrotsearch.randomizedtesting.RandomizedRunner.runSingleTest(RandomizedRunner.java:821)
   [junit4]   2> 		at com.carrotsearch.randomizedtesting.RandomizedRunner.access$700(RandomizedRunner.java:132)
   [junit4]   2> 		at com.carrotsearch.randomizedtesting.RandomizedRunner$3$1.run(RandomizedRunner.java:669)
   [junit4]   2> 		at com.carrotsearch.randomizedtesting.RandomizedRunner$3.evaluate(RandomizedRunner.java:695)
   [junit4]   2> 		at com.carrotsearch.randomizedtesting.RandomizedRunner$4.evaluate(RandomizedRunner.java:734)
   [junit4]   2> 		at com.carrotsearch.randomizedtesting.RandomizedRunner$5.evaluate(RandomizedRunner.java:745)
   [junit4]   2> 		at com.carrotsearch.randomizedtesting.rules.SystemPropertiesRestoreRule$1.evaluate(SystemPropertiesRestoreRule.java:53)
   [junit4]   2> 		at org.apache.lucene.util.AbstractBeforeAfterRule$1.evaluate(AbstractBeforeAfterRule.java:45)
   [junit4]   2> 		at org.apache.lucene.util.TestRuleReportUncaughtExceptions$1.evaluate(TestRuleReportUncaughtExceptions.java:68)
   [junit4]   2> 		at org.apache.lucene.util.TestRuleStoreClassName$1.evaluate(TestRuleStoreClassName.java:38)
   [junit4]   2> 		at org.apache.lucene.util.TestRuleIcuHack$1.evaluate(TestRuleIcuHack.java:51)
   [junit4]   2> 		at com.carrotsearch.randomizedtesting.rules.SystemPropertiesInvariantRule$1.evaluate(SystemPropertiesInvariantRule.java:55)
   [junit4]   2> 		at org.apache.lucene.util.TestRuleNoInstanceHooksOverrides$1.evaluate(TestRuleNoInstanceHooksOverrides.java:53)
   [junit4]   2> 		at org.apache.lucene.util.TestRuleNoStaticHooksShadowing$1.evaluate(TestRuleNoStaticHooksShadowing.java:52)
   [junit4]   2> 		at org.apache.lucene.util.TestRuleAssertionsRequired$1.evaluate(TestRuleAssertionsRequired.java:36)
   [junit4]   2> 		at org.apache.lucene.util.TestRuleMarkFailure$1.evaluate(TestRuleMarkFailure.java:48)
   [junit4]   2> 		at org.apache.lucene.util.TestRuleIgnoreAfterMaxFailures$1.evaluate(TestRuleIgnoreAfterMaxFailures.java:70)
   [junit4]   2> 		at org.apache.lucene.util.TestRuleIgnoreTestSuites$1.evaluate(TestRuleIgnoreTestSuites.java:55)
   [junit4]   2> 		at com.carrotsearch.randomizedtesting.RandomizedRunner.runSuite(RandomizedRunner.java:605)
   [junit4]   2> 		at com.carrotsearch.randomizedtesting.RandomizedRunner.access$400(RandomizedRunner.java:132)
   [junit4]   2> 		at com.carrotsearch.randomizedtesting.RandomizedRunner$2.run(RandomizedRunner.java:551)
   [junit4]   2> 	
   [junit4]   2> 221 T91 oashd.AbstractDataImportHandlerTestCase.tearDown Looking for dataimport.properties at: /mnt/ssd/jenkins/workspace/Lucene-Solr-4.x-Linux-Java6-64/checkout/solr/build/contrib/solr-dataimporthandler/test/J0/solr/collection1/conf/dataimport.properties
   [junit4]   2> 221 T91 oas.SolrTestCaseJ4.tearDown ###Ending testDeltaImport_replace_resolvesUnprefixedPk
   [junit4]   2> NOTE: reproduce with: ant test  -Dtestcase=TestSqlEntityProcessorDeltaPrefixedPk -Dtests.method=testDeltaImport_replace_resolvesUnprefixedPk -Dtests.seed=82D4BE3DF1479E1A -Dtests.multiplier=3 -Dtests.slow=true -Dtests.locale=mk_MK -Dtests.timezone=CTT -Dargs="-Dfile.encoding=UTF-8"
   [junit4]   2>
   [junit4] ERROR   0.03s J0 | TestSqlEntityProcessorDeltaPrefixedPk.testDeltaImport_deleteResolvesUnprefixedPk
   [junit4]    > Throwable #1: org.apache.solr.common.SolrException: org.apache.lucene.store.AlreadyClosedException: this IndexWriter is closed
   [junit4]    > 	at __randomizedtesting.SeedInfo.seed([82D4BE3DF1479E1A:1AA92A75F01E45F9]:0)
   [junit4]    > 	at org.apache.solr.util.TestHarness.update(TestHarness.java:233)
   [junit4]    > 	at org.apache.solr.util.TestHarness.checkUpdateStatus(TestHarness.java:277)
   [junit4]    > 	at org.apache.solr.util.TestHarness.validateUpdate(TestHarness.java:247)
   [junit4]    > 	at org.apache.solr.SolrTestCaseJ4.checkUpdateU(SolrTestCaseJ4.java:415)
   [junit4]    > 	at org.apache.solr.SolrTestCaseJ4.assertU(SolrTestCaseJ4.java:394)
   [junit4]    > 	at org.apache.solr.SolrTestCaseJ4.assertU(SolrTestCaseJ4.java:388)
   [junit4]    > 	at org.apache.solr.SolrTestCaseJ4.clearIndex(SolrTestCaseJ4.java:760)
   [junit4]    > 	at org.apache.solr.handler.dataimport.TestSqlEntityProcessorDeltaPrefixedPk.setUp(TestSqlEntityProcessorDeltaPrefixedPk.java:69)
   [junit4]    > 	at sun.reflect.NativeMethodAccessorImpl.invoke0(Native Method)
   [junit4]    > 	at sun.reflect.NativeMethodAccessorImpl.invoke(NativeMethodAccessorImpl.java:39)
   [junit4]    > 	at sun.reflect.DelegatingMethodAccessorImpl.invoke(DelegatingMethodAccessorImpl.java:25)
   [junit4]    > 	at java.lang.reflect.Method.invoke(Method.java:597)
   [junit4]    > 	at com.carrotsearch.randomizedtesting.RandomizedRunner.invoke(RandomizedRunner.java:1969)
   [junit4]    > 	at com.carrotsearch.randomizedtesting.RandomizedRunner.access$1100(RandomizedRunner.java:132)
   [junit4]    > 	at com.carrotsearch.randomizedtesting.RandomizedRunner$7.evaluate(RandomizedRunner.java:873)
   [junit4]    > 	at com.carrotsearch.randomizedtesting.RandomizedRunner$8.evaluate(RandomizedRunner.java:889)
   [junit4]    > 	at com.carrotsearch.randomizedtesting.rules.SystemPropertiesRestoreRule$1.evaluate(SystemPropertiesRestoreRule.java:53)
   [junit4]    > 	at org.apache.lucene.util.TestRuleSetupTeardownChained$1.evaluate(TestRuleSetupTeardownChained.java:50)
   [junit4]    > 	at org.apache.lucene.util.TestRuleFieldCacheSanity$1.evaluate(TestRuleFieldCacheSanity.java:32)
   [junit4]    > 	at org.apache.lucene.util.AbstractBeforeAfterRule$1.evaluate(AbstractBeforeAfterRule.java:45)
   [junit4]    > 	at com.carrotsearch.randomizedtesting.rules.SystemPropertiesInvariantRule$1.evaluate(SystemPropertiesInvariantRule.java:55)
   [junit4]    > 	at org.apache.lucene.util.TestRuleReportUncaughtExceptions$1.evaluate(TestRuleReportUncaughtExceptions.java:68)
   [junit4]    > 	at org.apache.lucene.util.TestRuleThreadAndTestName$1.evaluate(TestRuleThreadAndTestName.java:48)
   [junit4]    > 	at org.apache.lucene.util.TestRuleIgnoreAfterMaxFailures$1.evaluate(TestRuleIgnoreAfterMaxFailures.java:70)
   [junit4]    > 	at org.apache.lucene.util.TestRuleMarkFailure$1.evaluate(TestRuleMarkFailure.java:48)
   [junit4]    > 	at com.carrotsearch.randomizedtesting.RandomizedRunner.runSingleTest(RandomizedRunner.java:821)
   [junit4]    > 	at com.carrotsearch.randomizedtesting.RandomizedRunner.access$700(RandomizedRunner.java:132)
   [junit4]    > 	at com.carrotsearch.randomizedtesting.RandomizedRunner$3$1.run(RandomizedRunner.java:669)
   [junit4]    > 	at com.carrotsearch.randomizedtesting.RandomizedRunner$3.evaluate(RandomizedRunner.java:695)
   [junit4]    > 	at com.carrotsearch.randomizedtesting.RandomizedRunner$4.evaluate(RandomizedRunner.java:734)
   [junit4]    > 	at com.carrotsearch.randomizedtesting.RandomizedRunner$5.evaluate(RandomizedRunner.java:745)
   [junit4]    > 	at com.carrotsearch.randomizedtesting.rules.SystemPropertiesRestoreRule$1.evaluate(SystemPropertiesRestoreRule.java:53)
   [junit4]    > 	at org.apache.lucene.util.AbstractBeforeAfterRule$1.evaluate(AbstractBeforeAfterRule.java:45)
   [junit4]    > 	at org.apache.lucene.util.TestRuleReportUncaughtExceptions$1.evaluate(TestRuleReportUncaughtExceptions.java:68)
   [junit4]    > 	at org.apache.lucene.util.TestRuleStoreClassName$1.evaluate(TestRuleStoreClassName.java:38)
   [junit4]    > 	at org.apache.lucene.util.TestRuleIcuHack$1.evaluate(TestRuleIcuHack.java:51)
   [junit4]    > 	at com.carrotsearch.randomizedtesting.rules.SystemPropertiesInvariantRule$1.evaluate(SystemPropertiesInvariantRule.java:55)
   [junit4]    > 	at org.apache.lucene.util.TestRuleNoInstanceHooksOverrides$1.evaluate(TestRuleNoInstanceHooksOverrides.java:53)
   [junit4]    > 	at org.apache.lucene.util.TestRuleNoStaticHooksShadowing$1.evaluate(TestRuleNoStaticHooksShadowing.java:52)
   [junit4]    > 	at org.apache.lucene.util.TestRuleAssertionsRequired$1.evaluate(TestRuleAssertionsRequired.java:36)
   [junit4]    > 	at org.apache.lucene.util.TestRuleMarkFailure$1.evaluate(TestRuleMarkFailure.java:48)
   [junit4]    > 	at org.apache.lucene.util.TestRuleIgnoreAfterMaxFailures$1.evaluate(TestRuleIgnoreAfterMaxFailures.java:70)
   [junit4]    > 	at org.apache.lucene.util.TestRuleIgnoreTestSuites$1.evaluate(TestRuleIgnoreTestSuites.java:55)
   [junit4]    > 	at com.carrotsearch.randomizedtesting.RandomizedRunner.runSuite(RandomizedRunner.java:605)
   [junit4]    > 	at com.carrotsearch.randomizedtesting.RandomizedRunner.access$400(RandomizedRunner.java:132)
   [junit4]    > 	at com.carrotsearch.randomizedtesting.RandomizedRunner$2.run(RandomizedRunner.java:551)
   [junit4]    > Caused by: org.apache.lucene.store.AlreadyClosedException: this IndexWriter is closed
   [junit4]    > 	at org.apache.lucene.index.IndexWriter.ensureOpen(IndexWriter.java:553)
   [junit4]    > 	at org.apache.lucene.index.IndexWriter.ensureOpen(IndexWriter.java:558)
   [junit4]    > 	at org.apache.lucene.index.IndexWriter.deleteAll(IndexWriter.java:1882)
   [junit4]    > 	at org.apache.solr.update.DirectUpdateHandler2.deleteAll(DirectUpdateHandler2.java:138)
   [junit4]    > 	at org.apache.solr.update.DirectUpdateHandler2.deleteByQuery(DirectUpdateHandler2.java:290)
   [junit4]    > 	at org.apache.solr.update.processor.RunUpdateProcessor.processDelete(RunUpdateProcessorFactory.java:67)
   [junit4]    > 	at org.apache.solr.update.processor.UpdateRequestProcessor.processDelete(UpdateRequestProcessor.java:55)
   [junit4]    > 	at org.apache.solr.update.processor.DistributedUpdateProcessor.doDeleteByQuery(DistributedUpdateProcessor.java:719)
   [junit4]    > 	at org.apache.solr.update.processor.DistributedUpdateProcessor.processDelete(DistributedUpdateProcessor.java:592)
   [junit4]    > 	at org.apache.solr.update.processor.UpdateRequestProcessor.processDelete(UpdateRequestProcessor.java:55)
   [junit4]    > 	at org.apache.solr.handler.dataimport.AbstractDataImportHandlerTestCase$TestUpdateRequestProcessor.processDelete(AbstractDataImportHandlerTestCase.java:364)
   [junit4]    > 	at org.apache.solr.handler.loader.XMLLoader.processDelete(XMLLoader.java:330)
   [junit4]    > 	at org.apache.solr.handler.loader.XMLLoader.processUpdate(XMLLoader.java:261)
   [junit4]    > 	at org.apache.solr.handler.loader.XMLLoader.load(XMLLoader.java:157)
   [junit4]    > 	at org.apache.solr.handler.UpdateRequestHandler$1.load(UpdateRequestHandler.java:92)
   [junit4]    > 	at org.apache.solr.handler.ContentStreamHandlerBase.handleRequestBody(ContentStreamHandlerBase.java:74)
   [junit4]    > 	at org.apache.solr.handler.RequestHandlerBase.handleRequest(RequestHandlerBase.java:129)
   [junit4]    > 	at org.apache.solr.core.SolrCore.execute(SolrCore.java:1599)
   [junit4]    > 	at org.apache.solr.servlet.DirectSolrConnection.request(DirectSolrConnection.java:131)
   [junit4]    > 	at org.apache.solr.util.TestHarness.update(TestHarness.java:229)
   [junit4]    > 	... 45 more
   [junit4]    > 
   [junit4]   2> 254 T91 oas.SolrTestCaseJ4.setUp ###Starting testDeltaImport_deleteResolvesUnprefixedPk
   [junit4]   2> 259 T91 C13 oasu.DirectUpdateHandler2.deleteAll [collection1] REMOVING ALL DOCUMENTS FROM INDEX
   [junit4]   2> 260 T91 C13 UPDATE [collection1] webapp=null path=null params={} {} 0 1
   [junit4]   2> 261 T91 C13 oasc.SolrException.log SEVERE org.apache.lucene.store.AlreadyClosedException: this IndexWriter is closed
   [junit4]   2> 		at org.apache.lucene.index.IndexWriter.ensureOpen(IndexWriter.java:553)
   [junit4]   2> 		at org.apache.lucene.index.IndexWriter.ensureOpen(IndexWriter.java:558)
   [junit4]   2> 		at org.apache.lucene.index.IndexWriter.deleteAll(IndexWriter.java:1882)
   [junit4]   2> 		at org.apache.solr.update.DirectUpdateHandler2.deleteAll(DirectUpdateHandler2.java:138)
   [junit4]   2> 		at org.apache.solr.update.DirectUpdateHandler2.deleteByQuery(DirectUpdateHandler2.java:290)
   [junit4]   2> 		at org.apache.solr.update.processor.RunUpdateProcessor.processDelete(RunUpdateProcessorFactory.java:67)
   [junit4]   2> 		at org.apache.solr.update.processor.UpdateRequestProcessor.processDelete(UpdateRequestProcessor.java:55)
   [junit4]   2> 		at org.apache.solr.update.processor.DistributedUpdateProcessor.doDeleteByQuery(DistributedUpdateProcessor.java:719)
   [junit4]   2> 		at org.apache.solr.update.processor.DistributedUpdateProcessor.processDelete(DistributedUpdateProcessor.java:592)
   [junit4]   2> 		at org.apache.solr.update.processor.UpdateRequestProcessor.processDelete(UpdateRequestProcessor.java:55)
   [junit4]   2> 		at org.apache.solr.handler.dataimport.AbstractDataImportHandlerTestCase$TestUpdateRequestProcessor.processDelete(AbstractDataImportHandlerTestCase.java:364)
   [junit4]   2> 		at org.apache.solr.handler.loader.XMLLoader.processDelete(XMLLoader.java:330)
   [junit4]   2> 		at org.apache.solr.handler.loader.XMLLoader.processUpdate(XMLLoader.java:261)
   [junit4]   2> 		at org.apache.solr.handler.loader.XMLLoader.load(XMLLoader.java:157)
   [junit4]   2> 		at org.apache.solr.handler.UpdateRequestHandler$1.load(UpdateRequestHandler.java:92)
   [junit4]   2> 		at org.apache.solr.handler.ContentStreamHandlerBase.handleRequestBody(ContentStreamHandlerBase.java:74)
   [junit4]   2> 		at org.apache.solr.handler.RequestHandlerBase.handleRequest(RequestHandlerBase.java:129)
   [junit4]   2> 		at org.apache.solr.core.SolrCore.execute(SolrCore.java:1599)
   [junit4]   2> 		at org.apache.solr.servlet.DirectSolrConnection.request(DirectSolrConnection.java:131)
   [junit4]   2> 		at org.apache.solr.util.TestHarness.update(TestHarness.java:229)
   [junit4]   2> 		at org.apache.solr.util.TestHarness.checkUpdateStatus(TestHarness.java:277)
   [junit4]   2> 		at org.apache.solr.util.TestHarness.validateUpdate(TestHarness.java:247)
   [junit4]   2> 		at org.apache.solr.SolrTestCaseJ4.checkUpdateU(SolrTestCaseJ4.java:415)
   [junit4]   2> 		at org.apache.solr.SolrTestCaseJ4.assertU(SolrTestCaseJ4.java:394)
   [junit4]   2> 		at org.apache.solr.SolrTestCaseJ4.assertU(SolrTestCaseJ4.java:388)
   [junit4]   2> 		at org.apache.solr.SolrTestCaseJ4.clearIndex(SolrTestCaseJ4.java:760)
   [junit4]   2> 		at org.apache.solr.handler.dataimport.TestSqlEntityProcessorDeltaPrefixedPk.setUp(TestSqlEntityProcessorDeltaPrefixedPk.java:69)
   [junit4]   2> 		at sun.reflect.NativeMethodAccessorImpl.invoke0(Native Method)
   [junit4]   2> 		at sun.reflect.NativeMethodAccessorImpl.invoke(NativeMethodAccessorImpl.java:39)
   [junit4]   2> 		at sun.reflect.DelegatingMethodAccessorImpl.invoke(DelegatingMethodAccessorImpl.java:25)
   [junit4]   2> 		at java.lang.reflect.Method.invoke(Method.java:597)
   [junit4]   2> 		at com.carrotsearch.randomizedtesting.RandomizedRunner.invoke(RandomizedRunner.java:1969)
   [junit4]   2> 		at com.carrotsearch.randomizedtesting.RandomizedRunner.access$1100(RandomizedRunner.java:132)
   [junit4]   2> 		at com.carrotsearch.randomizedtesting.RandomizedRunner$7.evaluate(RandomizedRunner.java:873)
   [junit4]   2> 		at com.carrotsearch.randomizedtesting.RandomizedRunner$8.evaluate(RandomizedRunner.java:889)
   [junit4]   2> 		at com.carrotsearch.randomizedtesting.rules.SystemPropertiesRestoreRule$1.evaluate(SystemPropertiesRestoreRule.java:53)
   [junit4]   2> 		at org.apache.lucene.util.TestRuleSetupTeardownChained$1.evaluate(TestRuleSetupTeardownChained.java:50)
   [junit4]   2> 		at org.apache.lucene.util.TestRuleFieldCacheSanity$1.evaluate(TestRuleFieldCacheSanity.java:32)
   [junit4]   2> 		at org.apache.lucene.util.AbstractBeforeAfterRule$1.evaluate(AbstractBeforeAfterRule.java:45)
   [junit4]   2> 		at com.carrotsearch.randomizedtesting.rules.SystemPropertiesInvariantRule$1.evaluate(SystemPropertiesInvariantRule.java:55)
   [junit4]   2> 		at org.apache.lucene.util.TestRuleReportUncaughtExceptions$1.evaluate(TestRuleReportUncaughtExceptions.java:68)
   [junit4]   2> 		at org.apache.lucene.util.TestRuleThreadAndTestName$1.evaluate(TestRuleThreadAndTestName.java:48)
   [junit4]   2> 		at org.apache.lucene.util.TestRuleIgnoreAfterMaxFailures$1.evaluate(TestRuleIgnoreAfterMaxFailures.java:70)
   [junit4]   2> 		at org.apache.lucene.util.TestRuleMarkFailure$1.evaluate(TestRuleMarkFailure.java:48)
   [junit4]   2> 		at com.carrotsearch.randomizedtesting.RandomizedRunner.runSingleTest(RandomizedRunner.java:821)
   [junit4]   2> 		at com.carrotsearch.randomizedtesting.RandomizedRunner.access$700(RandomizedRunner.java:132)
   [junit4]   2> 		at com.carrotsearch.randomizedtesting.RandomizedRunner$3$1.run(RandomizedRunner.java:669)
   [junit4]   2> 		at com.carrotsearch.randomizedtesting.RandomizedRunner$3.evaluate(RandomizedRunner.java:695)
   [junit4]   2> 		at com.carrotsearch.randomizedtesting.RandomizedRunner$4.evaluate(RandomizedRunner.java:734)
   [junit4]   2> 		at com.carrotsearch.randomizedtesting.RandomizedRunner$5.evaluate(RandomizedRunner.java:745)
   [junit4]   2> 		at com.carrotsearch.randomizedtesting.rules.SystemPropertiesRestoreRule$1.evaluate(SystemPropertiesRestoreRule.java:53)
   [junit4]   2> 		at org.apache.lucene.util.AbstractBeforeAfterRule$1.evaluate(AbstractBeforeAfterRule.java:45)
   [junit4]   2> 		at org.apache.lucene.util.TestRuleReportUncaughtExceptions$1.evaluate(TestRuleReportUncaughtExceptions.java:68)
   [junit4]   2> 		at org.apache.lucene.util.TestRuleStoreClassName$1.evaluate(TestRuleStoreClassName.java:38)
   [junit4]   2> 		at org.apache.lucene.util.TestRuleIcuHack$1.evaluate(TestRuleIcuHack.java:51)
   [junit4]   2> 		at com.carrotsearch.randomizedtesting.rules.SystemPropertiesInvariantRule$1.evaluate(SystemPropertiesInvariantRule.java:55)
   [junit4]   2> 		at org.apache.lucene.util.TestRuleNoInstanceHooksOverrides$1.evaluate(TestRuleNoInstanceHooksOverrides.java:53)
   [junit4]   2> 		at org.apache.lucene.util.TestRuleNoStaticHooksShadowing$1.evaluate(TestRuleNoStaticHooksShadowing.java:52)
   [junit4]   2> 		at org.apache.lucene.util.TestRuleAssertionsRequired$1.evaluate(TestRuleAssertionsRequired.java:36)
   [junit4]   2> 		at org.apache.lucene.util.TestRuleMarkFailure$1.evaluate(TestRuleMarkFailure.java:48)
   [junit4]   2> 		at org.apache.lucene.util.TestRuleIgnoreAfterMaxFailures$1.evaluate(TestRuleIgnoreAfterMaxFailures.java:70)
   [junit4]   2> 		at org.apache.lucene.util.TestRuleIgnoreTestSuites$1.evaluate(TestRuleIgnoreTestSuites.java:55)
   [junit4]   2> 		at com.carrotsearch.randomizedtesting.RandomizedRunner.runSuite(RandomizedRunner.java:605)
   [junit4]   2> 		at com.carrotsearch.randomizedtesting.RandomizedRunner.access$400(RandomizedRunner.java:132)
   [junit4]   2> 		at com.carrotsearch.randomizedtesting.RandomizedRunner$2.run(RandomizedRunner.java:551)
   [junit4]   2> 	
   [junit4]   2> 262 T91 oashd.AbstractDataImportHandlerTestCase.tearDown Looking for dataimport.properties at: /mnt/ssd/jenkins/workspace/Lucene-Solr-4.x-Linux-Java6-64/checkout/solr/build/contrib/solr-dataimporthandler/test/J0/solr/collection1/conf/dataimport.properties
   [junit4]   2> 262 T91 oas.SolrTestCaseJ4.tearDown ###Ending testDeltaImport_deleteResolvesUnprefixedPk
   [junit4]   2> NOTE: reproduce with: ant test  -Dtestcase=TestSqlEntityProcessorDeltaPrefixedPk -Dtests.method=testDeltaImport_deleteResolvesUnprefixedPk -Dtests.seed=82D4BE3DF1479E1A -Dtests.multiplier=3 -Dtests.slow=true -Dtests.locale=mk_MK -Dtests.timezone=CTT -Dargs="-Dfile.encoding=UTF-8"
   [junit4]   2>
   [junit4] ERROR   0.02s J0 | TestSqlEntityProcessorDeltaPrefixedPk.testDeltaImport_addResolvesUnprefixedPk
   [junit4]    > Throwable #1: org.apache.solr.common.SolrException: org.apache.lucene.store.AlreadyClosedException: this IndexWriter is closed
   [junit4]    > 	at __randomizedtesting.SeedInfo.seed([82D4BE3DF1479E1A:6AB7BC36990B52B2]:0)
   [junit4]    > 	at org.apache.solr.util.TestHarness.update(TestHarness.java:233)
   [junit4]    > 	at org.apache.solr.util.TestHarness.checkUpdateStatus(TestHarness.java:277)
   [junit4]    > 	at org.apache.solr.util.TestHarness.validateUpdate(TestHarness.java:247)
   [junit4]    > 	at org.apache.solr.SolrTestCaseJ4.checkUpdateU(SolrTestCaseJ4.java:415)
   [junit4]    > 	at org.apache.solr.SolrTestCaseJ4.assertU(SolrTestCaseJ4.java:394)
   [junit4]    > 	at org.apache.solr.SolrTestCaseJ4.assertU(SolrTestCaseJ4.java:388)
   [junit4]    > 	at org.apache.solr.SolrTestCaseJ4.clearIndex(SolrTestCaseJ4.java:760)
   [junit4]    > 	at org.apache.solr.handler.dataimport.TestSqlEntityProcessorDeltaPrefixedPk.setUp(TestSqlEntityProcessorDeltaPrefixedPk.java:69)
   [junit4]    > 	at sun.reflect.NativeMethodAccessorImpl.invoke0(Native Method)
   [junit4]    > 	at sun.reflect.NativeMethodAccessorImpl.invoke(NativeMethodAccessorImpl.java:39)
   [junit4]    > 	at sun.reflect.DelegatingMethodAccessorImpl.invoke(DelegatingMethodAccessorImpl.java:25)
   [junit4]    > 	at java.lang.reflect.Method.invoke(Method.java:597)
   [junit4]    > 	at com.carrotsearch.randomizedtesting.RandomizedRunner.invoke(RandomizedRunner.java:1969)
   [junit4]    > 	at com.carrotsearch.randomizedtesting.RandomizedRunner.access$1100(RandomizedRunner.java:132)
   [junit4]    > 	at com.carrotsearch.randomizedtesting.RandomizedRunner$7.evaluate(RandomizedRunner.java:873)
   [junit4]    > 	at com.carrotsearch.randomizedtesting.RandomizedRunner$8.evaluate(RandomizedRunner.java:889)
   [junit4]    > 	at com.carrotsearch.randomizedtesting.rules.SystemPropertiesRestoreRule$1.evaluate(SystemPropertiesRestoreRule.java:53)
   [junit4]    > 	at org.apache.lucene.util.TestRuleSetupTeardownChained$1.evaluate(TestRuleSetupTeardownChained.java:50)
   [junit4]    > 	at org.apache.lucene.util.TestRuleFieldCacheSanity$1.evaluate(TestRuleFieldCacheSanity.java:32)
   [junit4]    > 	at org.apache.lucene.util.AbstractBeforeAfterRule$1.evaluate(AbstractBeforeAfterRule.java:45)
   [junit4]    > 	at com.carrotsearch.randomizedtesting.rules.SystemPropertiesInvariantRule$1.evaluate(SystemPropertiesInvariantRule.java:55)
   [junit4]    > 	at org.apache.lucene.util.TestRuleReportUncaughtExceptions$1.evaluate(TestRuleReportUncaughtExceptions.java:68)
   [junit4]    > 	at org.apache.lucene.util.TestRuleThreadAndTestName$1.evaluate(TestRuleThreadAndTestName.java:48)
   [junit4]    > 	at org.apache.lucene.util.TestRuleIgnoreAfterMaxFailures$1.evaluate(TestRuleIgnoreAfterMaxFailures.java:70)
   [junit4]    > 	at org.apache.lucene.util.TestRuleMarkFailure$1.evaluate(TestRuleMarkFailure.java:48)
   [junit4]    > 	at com.carrotsearch.randomizedtesting.RandomizedRunner.runSingleTest(RandomizedRunner.java:821)
   [junit4]    > 	at com.carrotsearch.randomizedtesting.RandomizedRunner.access$700(RandomizedRunner.java:132)
   [junit4]    > 	at com.carrotsearch.randomizedtesting.RandomizedRunner$3$1.run(RandomizedRunner.java:669)
   [junit4]    > 	at com.carrotsearch.randomizedtesting.RandomizedRunner$3.evaluate(RandomizedRunner.java:695)
   [junit4]    > 	at com.carrotsearch.randomizedtesting.RandomizedRunner$4.evaluate(RandomizedRunner.java:734)
   [junit4]    > 	at com.carrotsearch.randomizedtesting.RandomizedRunner$5.evaluate(RandomizedRunner.java:745)
   [junit4]    > 	at com.carrotsearch.randomizedtesting.rules.SystemPropertiesRestoreRule$1.evaluate(SystemPropertiesRestoreRule.java:53)
   [junit4]    > 	at org.apache.lucene.util.AbstractBeforeAfterRule$1.evaluate(AbstractBeforeAfterRule.java:45)
   [junit4]    > 	at org.apache.lucene.util.TestRuleReportUncaughtExceptions$1.evaluate(TestRuleReportUncaughtExceptions.java:68)
   [junit4]    > 	at org.apache.lucene.util.TestRuleStoreClassName$1.evaluate(TestRuleStoreClassName.java:38)
   [junit4]    > 	at org.apache.lucene.util.TestRuleIcuHack$1.evaluate(TestRuleIcuHack.java:51)
   [junit4]    > 	at com.carrotsearch.randomizedtesting.rules.SystemPropertiesInvariantRule$1.evaluate(SystemPropertiesInvariantRule.java:55)
   [junit4]    > 	at org.apache.lucene.util.TestRuleNoInstanceHooksOverrides$1.evaluate(TestRuleNoInstanceHooksOverrides.java:53)
   [junit4]    > 	at org.apache.lucene.util.TestRuleNoStaticHooksShadowing$1.evaluate(TestRuleNoStaticHooksShadowing.java:52)
   [junit4]    > 	at org.apache.lucene.util.TestRuleAssertionsRequired$1.evaluate(TestRuleAssertionsRequired.java:36)
   [junit4]    > 	at org.apache.lucene.util.TestRuleMarkFailure$1.evaluate(TestRuleMarkFailure.java:48)
   [junit4]    > 	at org.apache.lucene.util.TestRuleIgnoreAfterMaxFailures$1.evaluate(TestRuleIgnoreAfterMaxFailures.java:70)
   [junit4]    > 	at org.apache.lucene.util.TestRuleIgnoreTestSuites$1.evaluate(TestRuleIgnoreTestSuites.java:55)
   [junit4]    > 	at com.carrotsearch.randomizedtesting.RandomizedRunner.runSuite(RandomizedRunner.java:605)
   [junit4]    > 	at com.carrotsearch.randomizedtesting.RandomizedRunner.access$400(RandomizedRunner.java:132)
   [junit4]    > 	at com.carrotsearch.randomizedtesting.RandomizedRunner$2.run(RandomizedRunner.java:551)
   [junit4]    > Caused by: org.apache.lucene.store.AlreadyClosedException: this IndexWriter is closed
   [junit4]    > 	at org.apache.lucene.index.IndexWriter.ensureOpen(IndexWriter.java:553)
   [junit4]    > 	at org.apache.lucene.index.IndexWriter.ensureOpen(IndexWriter.java:558)
   [junit4]    > 	at org.apache.lucene.index.IndexWriter.deleteAll(IndexWriter.java:1882)
   [junit4]    > 	at org.apache.solr.update.DirectUpdateHandler2.deleteAll(DirectUpdateHandler2.java:138)
   [junit4]    > 	at org.apache.solr.update.DirectUpdateHandler2.deleteByQuery(DirectUpdateHandler2.java:290)
   [junit4]    > 	at org.apache.solr.update.processor.RunUpdateProcessor.processDelete(RunUpdateProcessorFactory.java:67)
   [junit4]    > 	at org.apache.solr.update.processor.UpdateRequestProcessor.processDelete(UpdateRequestProcessor.java:55)
   [junit4]    > 	at org.apache.solr.update.processor.DistributedUpdateProcessor.doDeleteByQuery(DistributedUpdateProcessor.java:719)
   [junit4]    > 	at org.apache.solr.update.processor.DistributedUpdateProcessor.processDelete(DistributedUpdateProcessor.java:592)
   [junit4]    > 	at org.apache.solr.update.processor.UpdateRequestProcessor.processDelete(UpdateRequestProcessor.java:55)
   [junit4]    > 	at org.apache.solr.handler.dataimport.AbstractDataImportHandlerTestCase$TestUpdateRequestProcessor.processDelete(AbstractDataImportHandlerTestCase.java:364)
   [junit4]    > 	at org.apache.solr.handler.loader.XMLLoader.processDelete(XMLLoader.java:330)
   [junit4]    > 	at org.apache.solr.handler.loader.XMLLoader.processUpdate(XMLLoader.java:261)
   [junit4]    > 	at org.apache.solr.handler.loader.XMLLoader.load(XMLLoader.java:157)
   [junit4]    > 	at org.apache.solr.handler.UpdateRequestHandler$1.load(UpdateRequestHandler.java:92)
   [junit4]    > 	at org.apache.solr.handler.ContentStreamHandlerBase.handleRequestBody(ContentStreamHandlerBase.java:74)
   [junit4]    > 	at org.apache.solr.handler.RequestHandlerBase.handleRequest(RequestHandlerBase.java:129)
   [junit4]    > 	at org.apache.solr.core.SolrCore.execute(SolrCore.java:1599)
   [junit4]    > 	at org.apache.solr.servlet.DirectSolrConnection.request(DirectSolrConnection.java:131)
   [junit4]    > 	at org.apache.solr.util.TestHarness.update(TestHarness.java:229)
   [junit4]    > 	... 45 more
   [junit4]    > 
   [junit4]   2> 280 T91 oas.SolrTestCaseJ4.setUp ###Starting testDeltaImport_addResolvesUnprefixedPk
   [junit4]   2> 285 T91 C13 oasu.DirectUpdateHandler2.deleteAll [collection1] REMOVING ALL DOCUMENTS FROM INDEX
   [junit4]   2> 286 T91 C13 UPDATE [collection1] webapp=null path=null params={} {} 0 1
   [junit4]   2> 287 T91 C13 oasc.SolrException.log SEVERE org.apache.lucene.store.AlreadyClosedException: this IndexWriter is closed
   [junit4]   2> 		at org.apache.lucene.index.IndexWriter.ensureOpen(IndexWriter.java:553)
   [junit4]   2> 		at org.apache.lucene.index.IndexWriter.ensureOpen(IndexWriter.java:558)
   [junit4]   2> 		at org.apache.lucene.index.IndexWriter.deleteAll(IndexWriter.java:1882)
   [junit4]   2> 		at org.apache.solr.update.DirectUpdateHandler2.deleteAll(DirectUpdateHandler2.java:138)
   [junit4]   2> 		at org.apache.solr.update.DirectUpdateHandler2.deleteByQuery(DirectUpdateHandler2.java:290)
   [junit4]   2> 		at org.apache.solr.update.processor.RunUpdateProcessor.processDelete(RunUpdateProcessorFactory.java:67)
   [junit4]   2> 		at org.apache.solr.update.processor.UpdateRequestProcessor.processDelete(UpdateRequestProcessor.java:55)
   [junit4]   2> 		at org.apache.solr.update.processor.DistributedUpdateProcessor.doDeleteByQuery(DistributedUpdateProcessor.java:719)
   [junit4]   2> 		at org.apache.solr.update.processor.DistributedUpdateProcessor.processDelete(DistributedUpdateProcessor.java:592)
   [junit4]   2> 		at org.apache.solr.update.processor.UpdateRequestProcessor.processDelete(UpdateRequestProcessor.java:55)
   [junit4]   2> 		at org.apache.solr.handler.dataimport.AbstractDataImportHandlerTestCase$TestUpdateRequestProcessor.processDelete(AbstractDataImportHandlerTestCase.java:364)
   [junit4]   2> 		at org.apache.solr.handler.loader.XMLLoader.processDelete(XMLLoader.java:330)
   [junit4]   2> 		at org.apache.solr.handler.loader.XMLLoader.processUpdate(XMLLoader.java:261)
   [junit4]   2> 		at org.apache.solr.handler.loader.XMLLoader.load(XMLLoader.java:157)
   [junit4]   2> 		at org.apache.solr.handler.UpdateRequestHandler$1.load(UpdateRequestHandler.java:92)
   [junit4]   2> 		at org.apache.solr.handler.ContentStreamHandlerBase.handleRequestBody(ContentStreamHandlerBase.java:74)
   [junit4]   2> 		at org.apache.solr.handler.RequestHandlerBase.handleRequest(RequestHandlerBase.java:129)
   [junit4]   2> 		at org.apache.solr.core.SolrCore.execute(SolrCore.java:1599)
   [junit4]   2> 		at org.apache.solr.servlet.DirectSolrConnection.request(DirectSolrConnection.java:131)
   [junit4]   2> 		at org.apache.solr.util.TestHarness.update(TestHarness.java:229)
   [junit4]   2> 		at org.apache.solr.util.TestHarness.checkUpdateStatus(TestHarness.java:277)
   [junit4]   2> 		at org.apache.solr.util.TestHarness.validateUpdate(TestHarness.java:247)
   [junit4]   2> 		at org.apache.solr.SolrTestCaseJ4.checkUpdateU(SolrTestCaseJ4.java:415)
   [junit4]   2> 		at org.apache.solr.SolrTestCaseJ4.assertU(SolrTestCaseJ4.java:394)
   [junit4]   2> 		at org.apache.solr.SolrTestCaseJ4.assertU(SolrTestCaseJ4.java:388)
   [junit4]   2> 		at org.apache.solr.SolrTestCaseJ4.clearIndex(SolrTestCaseJ4.java:760)
   [junit4]   2> 		at org.apache.solr.handler.dataimport.TestSqlEntityProcessorDeltaPrefixedPk.setUp(TestSqlEntityProcessorDeltaPrefixedPk.java:69)
   [junit4]   2> 		at sun.reflect.NativeMethodAccessorImpl.invoke0(Native Method)
   [junit4]   2> 		at sun.reflect.NativeMethodAccessorImpl.invoke(NativeMethodAccessorImpl.java:39)
   [junit4]   2> 		at sun.reflect.DelegatingMethodAccessorImpl.invoke(DelegatingMethodAccessorImpl.java:25)
   [junit4]   2> 		at java.lang.reflect.Method.invoke(Method.java:597)
   [junit4]   2> 		at com.carrotsearch.randomizedtesting.RandomizedRunner.invoke(RandomizedRunner.java:1969)
   [junit4]   2> 		at com.carrotsearch.randomizedtesting.RandomizedRunner.access$1100(RandomizedRunner.java:132)
   [junit4]   2> 		at com.carrotsearch.randomizedtesting.RandomizedRunner$7.evaluate(RandomizedRunner.java:873)
   [junit4]   2> 		at com.carrotsearch.randomizedtesting.RandomizedRunner$8.evaluate(RandomizedRunner.java:889)
   [junit4]   2> 		at com.carrotsearch.randomizedtesting.rules.SystemPropertiesRestoreRule$1.evaluate(SystemPropertiesRestoreRule.java:53)
   [junit4]   2> 		at org.apache.lucene.util.TestRuleSetupTeardownChained$1.evaluate(TestRuleSetupTeardownChained.java:50)
   [junit4]   2> 		at org.apache.lucene.util.TestRuleFieldCacheSanity$1.evaluate(TestRuleFieldCacheSanity.java:32)
   [junit4]   2> 		at org.apache.lucene.util.AbstractBeforeAfterRule$1.evaluate(AbstractBeforeAfterRule.java:45)
   [junit4]   2> 		at com.carrotsearch.randomizedtesting.rules.SystemPropertiesInvariantRule$1.evaluate(SystemPropertiesInvariantRule.java:55)
   [junit4]   2> 		at org.apache.lucene.util.TestRuleReportUncaughtExceptions$1.evaluate(TestRuleReportUncaughtExceptions.java:68)
   [junit4]   2> 		at org.apache.lucene.util.TestRuleThreadAndTestName$1.evaluate(TestRuleThreadAndTestName.java:48)
   [junit4]   2> 		at org.apache.lucene.util.TestRuleIgnoreAfterMaxFailures$1.evaluate(TestRuleIgnoreAfterMaxFailures.java:70)
   [junit4]   2> 		at org.apache.lucene.util.TestRuleMarkFailure$1.evaluate(TestRuleMarkFailure.java:48)
   [junit4]   2> 		at com.carrotsearch.randomizedtesting.RandomizedRunner.runSingleTest(RandomizedRunner.java:821)
   [junit4]   2> 		at com.carrotsearch.randomizedtesting.RandomizedRunner.access$700(RandomizedRunner.java:132)
   [junit4]   2> 		at com.carrotsearch.randomizedtesting.RandomizedRunner$3$1.run(RandomizedRunner.java:669)
   [junit4]   2> 		at com.carrotsearch.randomizedtesting.RandomizedRunner$3.evaluate(RandomizedRunner.java:695)
   [junit4]   2> 		at com.carrotsearch.randomizedtesting.RandomizedRunner$4.evaluate(RandomizedRunner.java:734)
   [junit4]   2> 		at com.carrotsearch.randomizedtesting.RandomizedRunner$5.evaluate(RandomizedRunner.java:745)
   [junit4]   2> 		at com.carrotsearch.randomizedtesting.rules.SystemPropertiesRestoreRule$1.evaluate(SystemPropertiesRestoreRule.java:53)
   [junit4]   2> 		at org.apache.lucene.util.AbstractBeforeAfterRule$1.evaluate(AbstractBeforeAfterRule.java:45)
   [junit4]   2> 		at org.apache.lucene.util.TestRuleReportUncaughtExceptions$1.evaluate(TestRuleReportUncaughtExceptions.java:68)
   [junit4]   2> 		at org.apache.lucene.util.TestRuleStoreClassName$1.evaluate(TestRuleStoreClassName.java:38)
   [junit4]   2> 		at org.apache.lucene.util.TestRuleIcuHack$1.evaluate(TestRuleIcuHack.java:51)
   [junit4]   2> 		at com.carrotsearch.randomizedtesting.rules.SystemPropertiesInvariantRule$1.evaluate(SystemPropertiesInvariantRule.java:55)
   [junit4]   2> 		at org.apache.lucene.util.TestRuleNoInstanceHooksOverrides$1.evaluate(TestRuleNoInstanceHooksOverrides.java:53)
   [junit4]   2> 		at org.apache.lucene.util.TestRuleNoStaticHooksShadowing$1.evaluate(TestRuleNoStaticHooksShadowing.java:52)
   [junit4]   2> 		at org.apache.lucene.util.TestRuleAssertionsRequired$1.evaluate(TestRuleAssertionsRequired.java:36)
   [junit4]   2> 		at org.apache.lucene.util.TestRuleMarkFailure$1.evaluate(TestRuleMarkFailure.java:48)
   [junit4]   2> 		at org.apache.lucene.util.TestRuleIgnoreAfterMaxFailures$1.evaluate(TestRuleIgnoreAfterMaxFailures.java:70)
   [junit4]   2> 		at org.apache.lucene.util.TestRuleIgnoreTestSuites$1.evaluate(TestRuleIgnoreTestSuites.java:55)
   [junit4]   2> 		at com.carrotsearch.randomizedtesting.RandomizedRunner.runSuite(RandomizedRunner.java:605)
   [junit4]   2> 		at com.carrotsearch.randomizedtesting.RandomizedRunner.access$400(RandomizedRunner.java:132)
   [junit4]   2> 		at com.carrotsearch.randomizedtesting.RandomizedRunner$2.run(RandomizedRunner.java:551)
   [junit4]   2> 	
   [junit4]   2> 288 T91 oashd.AbstractDataImportHandlerTestCase.tearDown Looking for dataimport.properties at: /mnt/ssd/jenkins/workspace/Lucene-Solr-4.x-Linux-Java6-64/checkout/solr/build/contrib/solr-dataimporthandler/test/J0/solr/collection1/conf/dataimport.properties
   [junit4]   2> 288 T91 oas.SolrTestCaseJ4.tearDown ###Ending testDeltaImport_addResolvesUnprefixedPk
   [junit4]   2> NOTE: reproduce with: ant test  -Dtestcase=TestSqlEntityProcessorDeltaPrefixedPk -Dtests.method=testDeltaImport_addResolvesUnprefixedPk -Dtests.seed=82D4BE3DF1479E1A -Dtests.multiplier=3 -Dtests.slow=true -Dtests.locale=mk_MK -Dtests.timezone=CTT -Dargs="-Dfile.encoding=UTF-8"
   [junit4]   2>
   [junit4]    > (@AfterClass output)
   [junit4]   2> 297 T91 oas.SolrTestCaseJ4.deleteCore ###deleteCore
   [junit4]   2> 298 T91 oasc.CoreContainer.shutdown Shutting down CoreContainer instance=786093240
   [junit4]   2> 298 T91 oasc.SolrCore.close [collection1]  CLOSING SolrCore org.apache.solr.core.SolrCore@2c91e143
   [junit4]   2> 298 T91 oasc.SolrCore.closeSearcher [collection1] Closing main searcher on request.
   [junit4]   2> 302 T91 oasu.DirectUpdateHandler2.close closing DirectUpdateHandler2{commits=2,autocommits=0,soft autocommits=0,optimizes=0,rollbacks=1,expungeDeletes=0,docsPending=0,adds=0,deletesById=0,deletesByQuery=2,errors=3,cumulative_adds=1,cumulative_deletesById=0,cumulative_deletesByQuery=4,cumulative_errors=2}
   [junit4]   2> 302 T91 oasu.DefaultSolrCoreState.decref SEVERE Error during shutdown of writer. java.lang.IllegalArgumentException: Unknown directory: MockDirWrapper(org.apache.lucene.store.RAMDirectory@52039826 lockFactory=org.apache.lucene.store.NativeFSLockFactory@20688e91) {MockDirWrapper(org.apache.lucene.store.RAMDirectory@6b6a3075 lockFactory=org.apache.lucene.store.NativeFSLockFactory@de12d33)=org.apache.solr.core.CachingDirectoryFactory$CacheValue@209403a3}
   [junit4]   2> 	at org.apache.solr.core.CachingDirectoryFactory.close(CachingDirectoryFactory.java:77)
   [junit4]   2> 	at org.apache.solr.core.CachingDirectoryFactory.release(CachingDirectoryFactory.java:184)
   [junit4]   2> 	at org.apache.solr.update.SolrIndexWriter.close(SolrIndexWriter.java:131)
   [junit4]   2> 	at org.apache.solr.update.DirectUpdateHandler2.closeWriter(DirectUpdateHandler2.java:611)
   [junit4]   2> 	at org.apache.solr.update.DefaultSolrCoreState.decref(DefaultSolrCoreState.java:72)
   [junit4]   2> 	at org.apache.solr.update.DirectUpdateHandler2.close(DirectUpdateHandler2.java:540)
   [junit4]   2> 	at org.apache.solr.core.SolrCore.close(SolrCore.java:823)
   [junit4]   2> 	at org.apache.solr.core.CoreContainer.shutdown(CoreContainer.java:563)
   [junit4]   2> 	at org.apache.solr.util.TestHarness.close(TestHarness.java:407)
   [junit4]   2> 	at org.apache.solr.SolrTestCaseJ4.deleteCore(SolrTestCaseJ4.java:361)
   [junit4]   2> 	at org.apache.solr.SolrTestCaseJ4.afterClass(SolrTestCaseJ4.java:80)
   [junit4]   2> 	at sun.reflect.NativeMethodAccessorImpl.invoke0(Native Method)
   [junit4]   2> 	at sun.reflect.NativeMethodAccessorImpl.invoke(NativeMethodAccessorImpl.java:39)
   [junit4]   2> 	at sun.reflect.DelegatingMethodAccessorImpl.invoke(DelegatingMethodAccessorImpl.java:25)
   [junit4]   2> 	at java.lang.reflect.Method.invoke(Method.java:597)
   [junit4]   2> 	at com.carrotsearch.randomizedtesting.RandomizedRunner.invoke(RandomizedRunner.java:1969)
   [junit4]   2> 	at com.carrotsearch.randomizedtesting.RandomizedRunner.access$1100(RandomizedRunner.java:132)
   [junit4]   2> 	at com.carrotsearch.randomizedtesting.RandomizedRunner$5.evaluate(RandomizedRunner.java:752)
   [junit4]   2> 	at com.carrotsearch.randomizedtesting.rules.SystemPropertiesRestoreRule$1.evaluate(SystemPropertiesRestoreRule.java:53)
   [junit4]   2> 	at org.apache.lucene.util.AbstractBeforeAfterRule$1.evaluate(AbstractBeforeAfterRule.java:45)
   [junit4]   2> 	at org.apache.lucene.util.TestRuleReportUncaughtExceptions$1.evaluate(TestRuleReportUncaughtExceptions.java:68)
   [junit4]   2> 	at org.apache.lucene.util.TestRuleStoreClassName$1.evaluate(TestRuleStoreClassName.java:38)
   [junit4]   2> 	at org.apache.lucene.util.TestRuleIcuHack$1.evaluate(TestRuleIcuHack.java:51)
   [junit4]   2> 	at com.carrotsearch.randomizedtesting.rules.SystemPropertiesInvariantRule$1.evaluate(SystemPropertiesInvariantRule.java:55)
   [junit4]   2> 	at org.apache.lucene.util.TestRuleNoInstanceHooksOverrides$1.evaluate(TestRuleNoInstanceHooksOverrides.java:53)
   [junit4]   2> 	at org.apache.lucene.util.TestRuleNoStaticHooksShadowing$1.evaluate(TestRuleNoStaticHooksShadowing.java:52)
   [junit4]   2> 	at org.apache.lucene.util.TestRuleAssertionsRequired$1.evaluate(TestRuleAssertionsRequired.java:36)
   [junit4]   2> 	at org.apache.lucene.util.TestRuleMarkFailure$1.evaluate(TestRuleMarkFailure.java:48)
   [junit4]   2> 	at org.apache.lucene.util.TestRuleIgnoreAfterMaxFailures$1.evaluate(TestRuleIgnoreAfterMaxFailures.java:70)
   [junit4]   2> 	at org.apache.lucene.util.TestRuleIgnoreTestSuites$1.evaluate(TestRuleIgnoreTestSuites.java:55)
   [junit4]   2> 	at com.carrotsearch.randomizedtesting.RandomizedRunner.runSuite(RandomizedRunner.java:605)
   [junit4]   2> 	at com.carrotsearch.randomizedtesting.RandomizedRunner.access$400(RandomizedRunner.java:132)
   [junit4]   2> 	at com.carrotsearch.randomizedtesting.RandomizedRunner$2.run(RandomizedRunner.java:551)
   [junit4]   2> 
   [junit4]   2> NOTE: test params are: codec=Lucene40: {}, sim=DefaultSimilarity, locale=mk_MK, timezone=CTT
   [junit4]   2> NOTE: Linux 2.6.32-41-server amd64/Sun Microsystems Inc. 1.6.0_32 (64-bit)/cpus=8,threads=1,free=211987656,total=222101504
   [junit4]   2> NOTE: All tests run in this JVM: [TestDocBuilder, TestScriptTransformer, TestURLDataSource, TestPlainTextEntityProcessor, TestSolrEntityProcessorEndToEnd, TestSqlEntityProcessor, TestLineEntityProcessor, TestEphemeralCache, TestRegexTransformer, TestClobTransformer, TestVariableResolver, TestSqlEntityProcessorDelta3, TestSqlEntityProcessorDeltaPrefixedPk]
   [junit4]   2> 
   [junit4] Completed on J0 in 0.32s, 3 tests, 3 errors <<< FAILURES!

[...truncated 56 lines...]
BUILD FAILED
/mnt/ssd/jenkins/workspace/Lucene-Solr-4.x-Linux-Java6-64/checkout/build.xml:29: The following error occurred while executing this line:
/mnt/ssd/jenkins/workspace/Lucene-Solr-4.x-Linux-Java6-64/checkout/solr/build.xml:163: The following error occurred while executing this line:
/mnt/ssd/jenkins/workspace/Lucene-Solr-4.x-Linux-Java6-64/checkout/solr/common-build.xml:358: The following error occurred while executing this line:
/mnt/ssd/jenkins/workspace/Lucene-Solr-4.x-Linux-Java6-64/checkout/lucene/module-build.xml:62: The following error occurred while executing this line:
/mnt/ssd/jenkins/workspace/Lucene-Solr-4.x-Linux-Java6-64/checkout/lucene/common-build.xml:1046: The following error occurred while executing this line:
/mnt/ssd/jenkins/workspace/Lucene-Solr-4.x-Linux-Java6-64/checkout/lucene/common-build.xml:759: There were test failures: 36 suites, 167 tests, 3 errors, 5 ignored

Total time: 22 minutes 44 seconds
Build step 'Execute shell' marked build as failure
Archiving artifacts
Recording test results
Email was triggered for: Failure
Sending email for trigger: Failure




Mime
View raw message