lucene-dev mailing list archives

Site index · List index
Message view « Date » · « Thread »
Top « Date » · « Thread »
From Policeman Jenkins Server <jenk...@sd-datasolutions.de>
Subject [JENKINS] Lucene-Solr-trunk-Linux-Java8-64 - Build # 11 - Still Failing!
Date Mon, 09 Jul 2012 21:01:43 GMT
Build: http://jenkins.sd-datasolutions.de/job/Lucene-Solr-trunk-Linux-Java8-64/11/

1 tests failed.
FAILED:  org.apache.solr.handler.component.DistributedQueryElevationComponentTest.testDistribSearch

Error Message:
.responseHeader.params.size()==9,9skipped=4,5

Stack Trace:
junit.framework.AssertionFailedError: .responseHeader.params.size()==9,9skipped=4,5
	at __randomizedtesting.SeedInfo.seed([262A05D3367AF0EA:A7CC8BCB412590D6]:0)
	at junit.framework.Assert.fail(Assert.java:50)
	at org.apache.solr.BaseDistributedSearchTestCase.compareResponses(BaseDistributedSearchTestCase.java:670)
	at org.apache.solr.BaseDistributedSearchTestCase.query(BaseDistributedSearchTestCase.java:392)
	at org.apache.solr.handler.component.DistributedQueryElevationComponentTest.doTest(DistributedQueryElevationComponentTest.java:81)
	at org.apache.solr.BaseDistributedSearchTestCase.testDistribSearch(BaseDistributedSearchTestCase.java:679)
	at sun.reflect.NativeMethodAccessorImpl.invoke0(Native Method)
	at sun.reflect.NativeMethodAccessorImpl.invoke(NativeMethodAccessorImpl.java:57)
	at sun.reflect.DelegatingMethodAccessorImpl.invoke(DelegatingMethodAccessorImpl.java:43)
	at java.lang.reflect.Method.invoke(Method.java:474)
	at com.carrotsearch.randomizedtesting.RandomizedRunner.invoke(RandomizedRunner.java:1995)
	at com.carrotsearch.randomizedtesting.RandomizedRunner.access$1100(RandomizedRunner.java:132)
	at com.carrotsearch.randomizedtesting.RandomizedRunner$6.evaluate(RandomizedRunner.java:818)
	at com.carrotsearch.randomizedtesting.RandomizedRunner$7.evaluate(RandomizedRunner.java:877)
	at com.carrotsearch.randomizedtesting.RandomizedRunner$8.evaluate(RandomizedRunner.java:891)
	at com.carrotsearch.randomizedtesting.rules.SystemPropertiesRestoreRule$1.evaluate(SystemPropertiesRestoreRule.java:53)
	at org.apache.lucene.util.TestRuleSetupTeardownChained$1.evaluate(TestRuleSetupTeardownChained.java:50)
	at org.apache.lucene.util.TestRuleFieldCacheSanity$1.evaluate(TestRuleFieldCacheSanity.java:32)
	at org.apache.lucene.util.AbstractBeforeAfterRule$1.evaluate(AbstractBeforeAfterRule.java:45)
	at com.carrotsearch.randomizedtesting.rules.SystemPropertiesInvariantRule$1.evaluate(SystemPropertiesInvariantRule.java:55)
	at org.apache.lucene.util.TestRuleReportUncaughtExceptions$1.evaluate(TestRuleReportUncaughtExceptions.java:68)
	at org.apache.lucene.util.TestRuleThreadAndTestName$1.evaluate(TestRuleThreadAndTestName.java:48)
	at org.apache.lucene.util.TestRuleIgnoreAfterMaxFailures$1.evaluate(TestRuleIgnoreAfterMaxFailures.java:70)
	at org.apache.lucene.util.TestRuleMarkFailure$1.evaluate(TestRuleMarkFailure.java:48)
	at com.carrotsearch.randomizedtesting.RandomizedRunner.runSingleTest(RandomizedRunner.java:825)
	at com.carrotsearch.randomizedtesting.RandomizedRunner.access$700(RandomizedRunner.java:132)
	at com.carrotsearch.randomizedtesting.RandomizedRunner$3$1.run(RandomizedRunner.java:671)
	at com.carrotsearch.randomizedtesting.RandomizedRunner$3.evaluate(RandomizedRunner.java:697)
	at com.carrotsearch.randomizedtesting.RandomizedRunner$4.evaluate(RandomizedRunner.java:736)
	at com.carrotsearch.randomizedtesting.RandomizedRunner$5.evaluate(RandomizedRunner.java:747)
	at com.carrotsearch.randomizedtesting.rules.SystemPropertiesRestoreRule$1.evaluate(SystemPropertiesRestoreRule.java:53)
	at org.apache.lucene.util.AbstractBeforeAfterRule$1.evaluate(AbstractBeforeAfterRule.java:45)
	at org.apache.lucene.util.TestRuleReportUncaughtExceptions$1.evaluate(TestRuleReportUncaughtExceptions.java:68)
	at org.apache.lucene.util.TestRuleStoreClassName$1.evaluate(TestRuleStoreClassName.java:38)
	at org.apache.lucene.util.TestRuleIcuHack$1.evaluate(TestRuleIcuHack.java:51)
	at com.carrotsearch.randomizedtesting.rules.SystemPropertiesInvariantRule$1.evaluate(SystemPropertiesInvariantRule.java:55)
	at org.apache.lucene.util.TestRuleNoInstanceHooksOverrides$1.evaluate(TestRuleNoInstanceHooksOverrides.java:53)
	at org.apache.lucene.util.TestRuleNoStaticHooksShadowing$1.evaluate(TestRuleNoStaticHooksShadowing.java:52)
	at org.apache.lucene.util.TestRuleAssertionsRequired$1.evaluate(TestRuleAssertionsRequired.java:36)
	at org.apache.lucene.util.TestRuleMarkFailure$1.evaluate(TestRuleMarkFailure.java:48)
	at org.apache.lucene.util.TestRuleIgnoreAfterMaxFailures$1.evaluate(TestRuleIgnoreAfterMaxFailures.java:70)
	at org.apache.lucene.util.TestRuleIgnoreTestSuites$1.evaluate(TestRuleIgnoreTestSuites.java:55)
	at com.carrotsearch.randomizedtesting.RandomizedRunner.runSuite(RandomizedRunner.java:605)
	at com.carrotsearch.randomizedtesting.RandomizedRunner.access$400(RandomizedRunner.java:132)
	at com.carrotsearch.randomizedtesting.RandomizedRunner$2.run(RandomizedRunner.java:551)




Build Log:
[...truncated 11324 lines...]
[junit4:junit4] Suite: org.apache.solr.handler.component.DistributedQueryElevationComponentTest
[junit4:junit4] FAILURE 1.14s J1 | DistributedQueryElevationComponentTest.testDistribSearch
[junit4:junit4]    > Throwable #1: junit.framework.AssertionFailedError: .responseHeader.params.size()==9,9skipped=4,5
[junit4:junit4]    > 	at __randomizedtesting.SeedInfo.seed([262A05D3367AF0EA:A7CC8BCB412590D6]:0)
[junit4:junit4]    > 	at junit.framework.Assert.fail(Assert.java:50)
[junit4:junit4]    > 	at org.apache.solr.BaseDistributedSearchTestCase.compareResponses(BaseDistributedSearchTestCase.java:670)
[junit4:junit4]    > 	at org.apache.solr.BaseDistributedSearchTestCase.query(BaseDistributedSearchTestCase.java:392)
[junit4:junit4]    > 	at org.apache.solr.handler.component.DistributedQueryElevationComponentTest.doTest(DistributedQueryElevationComponentTest.java:81)
[junit4:junit4]    > 	at org.apache.solr.BaseDistributedSearchTestCase.testDistribSearch(BaseDistributedSearchTestCase.java:679)
[junit4:junit4]    > 	at sun.reflect.NativeMethodAccessorImpl.invoke0(Native Method)
[junit4:junit4]    > 	at sun.reflect.NativeMethodAccessorImpl.invoke(NativeMethodAccessorImpl.java:57)
[junit4:junit4]    > 	at sun.reflect.DelegatingMethodAccessorImpl.invoke(DelegatingMethodAccessorImpl.java:43)
[junit4:junit4]    > 	at java.lang.reflect.Method.invoke(Method.java:474)
[junit4:junit4]    > 	at com.carrotsearch.randomizedtesting.RandomizedRunner.invoke(RandomizedRunner.java:1995)
[junit4:junit4]    > 	at com.carrotsearch.randomizedtesting.RandomizedRunner.access$1100(RandomizedRunner.java:132)
[junit4:junit4]    > 	at com.carrotsearch.randomizedtesting.RandomizedRunner$6.evaluate(RandomizedRunner.java:818)
[junit4:junit4]    > 	at com.carrotsearch.randomizedtesting.RandomizedRunner$7.evaluate(RandomizedRunner.java:877)
[junit4:junit4]    > 	at com.carrotsearch.randomizedtesting.RandomizedRunner$8.evaluate(RandomizedRunner.java:891)
[junit4:junit4]    > 	at com.carrotsearch.randomizedtesting.rules.SystemPropertiesRestoreRule$1.evaluate(SystemPropertiesRestoreRule.java:53)
[junit4:junit4]    > 	at org.apache.lucene.util.TestRuleSetupTeardownChained$1.evaluate(TestRuleSetupTeardownChained.java:50)
[junit4:junit4]    > 	at org.apache.lucene.util.TestRuleFieldCacheSanity$1.evaluate(TestRuleFieldCacheSanity.java:32)
[junit4:junit4]    > 	at org.apache.lucene.util.AbstractBeforeAfterRule$1.evaluate(AbstractBeforeAfterRule.java:45)
[junit4:junit4]    > 	at com.carrotsearch.randomizedtesting.rules.SystemPropertiesInvariantRule$1.evaluate(SystemPropertiesInvariantRule.java:55)
[junit4:junit4]    > 	at org.apache.lucene.util.TestRuleReportUncaughtExceptions$1.evaluate(TestRuleReportUncaughtExceptions.java:68)
[junit4:junit4]    > 	at org.apache.lucene.util.TestRuleThreadAndTestName$1.evaluate(TestRuleThreadAndTestName.java:48)
[junit4:junit4]    > 	at org.apache.lucene.util.TestRuleIgnoreAfterMaxFailures$1.evaluate(TestRuleIgnoreAfterMaxFailures.java:70)
[junit4:junit4]    > 	at org.apache.lucene.util.TestRuleMarkFailure$1.evaluate(TestRuleMarkFailure.java:48)
[junit4:junit4]    > 	at com.carrotsearch.randomizedtesting.RandomizedRunner.runSingleTest(RandomizedRunner.java:825)
[junit4:junit4]    > 	at com.carrotsearch.randomizedtesting.RandomizedRunner.access$700(RandomizedRunner.java:132)
[junit4:junit4]    > 	at com.carrotsearch.randomizedtesting.RandomizedRunner$3$1.run(RandomizedRunner.java:671)
[junit4:junit4]    > 	at com.carrotsearch.randomizedtesting.RandomizedRunner$3.evaluate(RandomizedRunner.java:697)
[junit4:junit4]    > 	at com.carrotsearch.randomizedtesting.RandomizedRunner$4.evaluate(RandomizedRunner.java:736)
[junit4:junit4]    > 	at com.carrotsearch.randomizedtesting.RandomizedRunner$5.evaluate(RandomizedRunner.java:747)
[junit4:junit4]    > 	at com.carrotsearch.randomizedtesting.rules.SystemPropertiesRestoreRule$1.evaluate(SystemPropertiesRestoreRule.java:53)
[junit4:junit4]    > 	at org.apache.lucene.util.AbstractBeforeAfterRule$1.evaluate(AbstractBeforeAfterRule.java:45)
[junit4:junit4]    > 	at org.apache.lucene.util.TestRuleReportUncaughtExceptions$1.evaluate(TestRuleReportUncaughtExceptions.java:68)
[junit4:junit4]    > 	at org.apache.lucene.util.TestRuleStoreClassName$1.evaluate(TestRuleStoreClassName.java:38)
[junit4:junit4]    > 	at org.apache.lucene.util.TestRuleIcuHack$1.evaluate(TestRuleIcuHack.java:51)
[junit4:junit4]    > 	at com.carrotsearch.randomizedtesting.rules.SystemPropertiesInvariantRule$1.evaluate(SystemPropertiesInvariantRule.java:55)
[junit4:junit4]    > 	at org.apache.lucene.util.TestRuleNoInstanceHooksOverrides$1.evaluate(TestRuleNoInstanceHooksOverrides.java:53)
[junit4:junit4]    > 	at org.apache.lucene.util.TestRuleNoStaticHooksShadowing$1.evaluate(TestRuleNoStaticHooksShadowing.java:52)
[junit4:junit4]    > 	at org.apache.lucene.util.TestRuleAssertionsRequired$1.evaluate(TestRuleAssertionsRequired.java:36)
[junit4:junit4]    > 	at org.apache.lucene.util.TestRuleMarkFailure$1.evaluate(TestRuleMarkFailure.java:48)
[junit4:junit4]    > 	at org.apache.lucene.util.TestRuleIgnoreAfterMaxFailures$1.evaluate(TestRuleIgnoreAfterMaxFailures.java:70)
[junit4:junit4]    > 	at org.apache.lucene.util.TestRuleIgnoreTestSuites$1.evaluate(TestRuleIgnoreTestSuites.java:55)
[junit4:junit4]    > 	at com.carrotsearch.randomizedtesting.RandomizedRunner.runSuite(RandomizedRunner.java:605)
[junit4:junit4]    > 	at com.carrotsearch.randomizedtesting.RandomizedRunner.access$400(RandomizedRunner.java:132)
[junit4:junit4]    > 	at com.carrotsearch.randomizedtesting.RandomizedRunner$2.run(RandomizedRunner.java:551)
[junit4:junit4]    > 
[junit4:junit4]   2> 1 T2078 oas.SolrTestCaseJ4.setUp ###Starting testDistribSearch
[junit4:junit4]   2> 2 T2078 oejs.Server.doStart jetty-8.1.2.v20120308
[junit4:junit4]   2> 5 T2078 oejs.AbstractConnector.doStart Started SocketConnector@0.0.0.0:45645
[junit4:junit4]   2> 5 T2078 oasc.SolrResourceLoader.locateSolrHome JNDI not configured for solr (NoInitialContextEx)
[junit4:junit4]   2> 6 T2078 oasc.SolrResourceLoader.locateSolrHome using system property solr.solr.home: /mnt/ssd/jenkins/workspace/Lucene-Solr-trunk-Linux-Java8-64/checkout/solr/build/solr-core/test-files/solr
[junit4:junit4]   2> 6 T2078 oasc.SolrResourceLoader.<init> new SolrResourceLoader for deduced Solr Home: '/mnt/ssd/jenkins/workspace/Lucene-Solr-trunk-Linux-Java8-64/checkout/solr/build/solr-core/test-files/solr/'
[junit4:junit4]   2> 8 T2078 oass.SolrDispatchFilter.init SolrDispatchFilter.init()
[junit4:junit4]   2> 8 T2078 oasc.SolrResourceLoader.locateSolrHome JNDI not configured for solr (NoInitialContextEx)
[junit4:junit4]   2> 9 T2078 oasc.SolrResourceLoader.locateSolrHome using system property solr.solr.home: /mnt/ssd/jenkins/workspace/Lucene-Solr-trunk-Linux-Java8-64/checkout/solr/build/solr-core/test-files/solr
[junit4:junit4]   2> 9 T2078 oasc.CoreContainer$Initializer.initialize looking for solr.xml: /mnt/ssd/jenkins/workspace/Lucene-Solr-trunk-Linux-Java8-64/checkout/solr/build/solr-core/test-files/solr/solr.xml
[junit4:junit4]   2> 9 T2078 oasc.CoreContainer.<init> New CoreContainer 919321224
[junit4:junit4]   2> 9 T2078 oasc.CoreContainer.load Loading CoreContainer using Solr Home: '/mnt/ssd/jenkins/workspace/Lucene-Solr-trunk-Linux-Java8-64/checkout/solr/build/solr-core/test-files/solr/'
[junit4:junit4]   2> 9 T2078 oasc.SolrResourceLoader.<init> new SolrResourceLoader for directory: '/mnt/ssd/jenkins/workspace/Lucene-Solr-trunk-Linux-Java8-64/checkout/solr/build/solr-core/test-files/solr/'
[junit4:junit4]   2> 13 T2078 oasc.CoreContainer.load Registering Log Listener
[junit4:junit4]   2> 20 T2078 oashc.HttpShardHandlerFactory.getParameter Setting socketTimeout to: 0
[junit4:junit4]   2> 20 T2078 oashc.HttpShardHandlerFactory.getParameter Setting urlScheme to: http://
[junit4:junit4]   2> 20 T2078 oashc.HttpShardHandlerFactory.getParameter Setting connTimeout to: 0
[junit4:junit4]   2> 21 T2078 oashc.HttpShardHandlerFactory.getParameter Setting maxConnectionsPerHost to: 20
[junit4:junit4]   2> 21 T2078 oashc.HttpShardHandlerFactory.getParameter Setting corePoolSize to: 0
[junit4:junit4]   2> 21 T2078 oashc.HttpShardHandlerFactory.getParameter Setting maximumPoolSize to: 2147483647
[junit4:junit4]   2> 21 T2078 oashc.HttpShardHandlerFactory.getParameter Setting maxThreadIdleTime to: 5
[junit4:junit4]   2> 21 T2078 oashc.HttpShardHandlerFactory.getParameter Setting sizeOfQueue to: -1
[junit4:junit4]   2> 21 T2078 oashc.HttpShardHandlerFactory.getParameter Setting fairnessPolicy to: false
[junit4:junit4]   2> 22 T2078 oascsi.HttpClientUtil.createClient Creating new http client, config:maxConnectionsPerHost=20&maxConnections=10000&socketTimeout=0&connTimeout=0&retry=false
[junit4:junit4]   2> 25 T2078 oasc.CoreContainer.create Creating SolrCore 'collection1' using instanceDir: /mnt/ssd/jenkins/workspace/Lucene-Solr-trunk-Linux-Java8-64/checkout/solr/build/solr-core/test-files/solr/collection1
[junit4:junit4]   2> 26 T2078 oasc.SolrResourceLoader.<init> new SolrResourceLoader for directory: '/mnt/ssd/jenkins/workspace/Lucene-Solr-trunk-Linux-Java8-64/checkout/solr/build/solr-core/test-files/solr/collection1/'
[junit4:junit4]   2> 26 T2078 oasc.SolrResourceLoader.replaceClassLoader Adding 'file:/mnt/ssd/jenkins/workspace/Lucene-Solr-trunk-Linux-Java8-64/checkout/solr/build/solr-core/test-files/solr/collection1/lib/README' to classloader
[junit4:junit4]   2> 26 T2078 oasc.SolrResourceLoader.replaceClassLoader Adding 'file:/mnt/ssd/jenkins/workspace/Lucene-Solr-trunk-Linux-Java8-64/checkout/solr/build/solr-core/test-files/solr/collection1/lib/classes/' to classloader
[junit4:junit4]   2> 39 T2078 oasc.SolrConfig.<init> Using Lucene MatchVersion: LUCENE_50
[junit4:junit4]   2> 64 T2078 oasc.SolrConfig.<init> Loaded SolrConfig: solrconfig-elevate.xml
[junit4:junit4]   2> 65 T2078 oass.IndexSchema.readSchema Reading Solr Schema
[junit4:junit4]   2> 67 T2078 oass.IndexSchema.readSchema Schema name=example
[junit4:junit4]   2> 169 T2078 oass.IndexSchema.readSchema default search field in schema is text
[junit4:junit4]   2> 170 T2078 oass.IndexSchema.readSchema unique key field: id
[junit4:junit4]   2> 172 T2078 oasc.SolrCore.<init> [collection1] Opening new SolrCore at /mnt/ssd/jenkins/workspace/Lucene-Solr-trunk-Linux-Java8-64/checkout/solr/build/solr-core/test-files/solr/collection1/, dataDir=./org.apache.solr.handler.component.DistributedQueryElevationComponentTest-1341867673208/control/data/
[junit4:junit4]   2> 172 T2078 oasc.JmxMonitoredMap.<init> JMX monitoring is enabled. Adding Solr mbeans to JMX Server: com.sun.jmx.mbeanserver.JmxMBeanServer@16442f86
[junit4:junit4]   2> 173 T2078 oasc.SolrCore.getNewIndexDir WARNING New index directory detected: old=null new=./org.apache.solr.handler.component.DistributedQueryElevationComponentTest-1341867673208/control/data/index/
[junit4:junit4]   2> 173 T2078 oasc.SolrCore.initIndex WARNING [collection1] Solr index directory './org.apache.solr.handler.component.DistributedQueryElevationComponentTest-1341867673208/control/data/index' doesn't exist. Creating new index...
[junit4:junit4]   2> 174 T2078 oasc.SolrDeletionPolicy.onCommit SolrDeletionPolicy.onCommit: commits:num=1
[junit4:junit4]   2> 		commit{dir=MockDirWrapper(org.apache.lucene.store.RAMDirectory@388cc906 lockFactory=org.apache.lucene.store.SingleInstanceLockFactory@1488d931),segFN=segments_1,generation=1,filenames=[segments_1]
[junit4:junit4]   2> 174 T2078 oasc.SolrDeletionPolicy.updateCommits newest commit = 1
[junit4:junit4]   2> 178 T2078 oasc.RequestHandlers.initHandlersFromConfig created /update: solr.UpdateRequestHandler
[junit4:junit4]   2> 178 T2078 oasc.RequestHandlers.initHandlersFromConfig created /elevate: org.apache.solr.handler.component.SearchHandler
[junit4:junit4]   2> 178 T2078 oasc.RequestHandlers.initHandlersFromConfig created /dataElevate: org.apache.solr.handler.component.SearchHandler
[junit4:junit4]   2> 179 T2078 oashl.XMLLoader.init xsltCacheLifetimeSeconds=60
[junit4:junit4]   2> 179 T2078 oasc.RequestHandlers.initHandlersFromConfig WARNING no default request handler is registered (either '/select' or 'standard')
[junit4:junit4]   2> 180 T2078 oasc.SolrCore.initDeprecatedSupport WARNING solrconfig.xml uses deprecated <admin/gettableFiles>, Please update your config to use the ShowFileRequestHandler.
[junit4:junit4]   2> 180 T2078 oasc.SolrCore.initDeprecatedSupport WARNING adding ShowFileRequestHandler with hidden files: [SCHEMA-FOLDING.XML, SCHEMA-TFIDF.XML, BAD_SOLRCONFIG.XML, BAD-SCHEMA-NOT-INDEXED-BUT-POS.XML, SCHEMA-NUMERIC.XML, BAD-SCHEMA-OMIT-TF-BUT-NOT-POS.XML, BAD-SCHEMA-UNIQUEKEY-USES-DEFAULT.XML, SOLRCONFIG-PROPINJECT-INDEXDEFAULT.XML, SOLRCONFIG-MASTER1.XML, SOLRCONFIG-NOCACHE.XML, SCHEMA-BINARYFIELD.XML, BAD-SCHEMA-NOT-INDEXED-BUT-TF.XML, MAPPING-ISOLATIN1ACCENT.TXT, SOLRCONFIG-PROPINJECT.XML, SCHEMA-COPYFIELD-TEST.XML, SOLRCONFIG-CACHING.XML, BAD-SCHEMA-SIM-GLOBAL-VS-FT-MISMATCH.XML, SOLRCONFIG-ALTDIRECTORY.XML, BAD-SCHEMA-DUP-FIELD.XML, SOLRCONFIG_CODEC.XML, SOLRCONFIG-REQHANDLER.INCL, SCHEMA-STOP-KEEP.XML, SCHEMA-REPLICATION2.XML, BAD-SCHEMA-NOT-INDEXED-BUT-NORMS.XML, KEEP-2.TXT, SCHEMA-IB.XML, STOPWITHBOM.TXT, ELEVATE.XML, SOLRCONFIG-MASTER3.XML, SOLRCONFIG-SLAVE1.XML, SCHEMA-REQUIRED-FIELDS.XML, SCHEMA-LUCENEMATCHVERSION.XML, SCHEMASURROUND.XML, SOLRCONFIG-FUNCTIONQUERY.XML, SOLRCONFIG-MASTER.XML, SOLRCONFIG-QUERYSENDER.XML, SCHEMA-REPLICATION1.XML, SCHEMA_CODEC.XML, SOLRCONFIG-ELEVATE.XML, SCHEMA11.XML, SOLRCONFIG-QUERYSENDER-NOQUERY.XML, SOLRCONFIG-UPDATE-PROCESSOR-CHAINS.XML, COMPOUNDDICTIONARY.TXT, BAD-SCHEMA-NONTEXT-ANALYZER.XML, SOLRCONFIG-DELPOLICY1.XML, PHRASESUGGEST.TXT, KEEP-1.TXT, SOLRCONFIG-SIMPLELOCK.XML, SOLRCONFIG-SPELLCHECKCOMPONENT.XML, BAD-SCHEMA-EXTERNAL-FILEFIELD.XML, SOLRCONFIG-NATIVELOCK.XML, SOLRCONFIG-MASTER1-KEEPONEBACKUP.XML, OLD_SYNONYMS.TXT, SOLRCONFIG_PERF.XML, XSLT, CURRENCY.XML, DA_COMPOUNDDICTIONARY.TXT, STOPWORDS.TXT, OPEN-EXCHANGE-RATES.JSON, SCHEMA-SIM.XML, STOPTYPES-1.TXT, SOLRCONFIG-TLOG.XML, HYPHENATION.DTD, SCHEMA-PHRASESUGGEST.XML, STOP-1.TXT, SCHEMA-CHARFILTERS.XML, SCHEMA-DFR.XML, BAD-SCHEMA-UNIQUEKEY-IS-COPYFIELD-DEST.XML, SCHEMA-TRIE.XML, SCHEMA12.XML, PROTWORDS.TXT, SOLRCONFIG-TRANSFORMERS.XML, SOLRCONFIG-PHRASESUGGEST.XML, SCHEMA-SPELLCHECKER.XML, SOLRCONFIG-ENABLEPLUGIN.XML, SOLRCONFIG-DELPOLICY2.XML, HUNSPELL-TEST.AFF, SCHEMA.XML, SOLRCONFIG-MASTER2.XML, SCHEMA15.XML, SOLRCONFIG-REPEATER.XML, SOLRCONFIG-TERMINDEX.XML, SOLRCONFIG-SOLR-749.XML, SYNONYMS.TXT, SCHEMA-REVERSED.XML, SOLRCONFIG-SOLCOREPROPERTIES.XML, BAD-SCHEMA-DUP-FIELDTYPE.XML, STOPWORDSWRONGENCODING.TXT, SOLRCONFIG-SLAVE.XML, SCHEMA-COLLATE.XML, SCHEMA-MINIMAL.XML, SCHEMA-LMJELINEKMERCER.XML, WDFTYPES.TXT, STOP-2.TXT, SCHEMA-NOT-REQUIRED-UNIQUE-KEY.XML, SOLRCONFIG-HIGHLIGHT.XML, BAD-MP-SOLRCONFIG.XML, SCHEMA-LMDIRICHLET.XML, HUNSPELL-TEST.DIC, FRENCHARTICLES.TXT, STOPTYPES-2.TXT, STEMDICT.TXT, BAD-SCHEMA-DUP-DYNAMICFIELD.XML, SOLRCONFIG-SPELLCHECKER.XML, SOLRCONFIG-MERGEPOLICY.XML, DA_UTF8.XML, SCHEMA-BM25.XML, SOLRCONFIG-BASIC.XML, SOLRCONFIG-XINCLUDE.XML, SOLRCONFIG-LAZYWRITER.XML, STOP-SNOWBALL.TXT]
[junit4:junit4]   2> 182 T2078 oass.SolrIndexSearcher.<init> Opening Searcher@2ab244f7 main
[junit4:junit4]   2> 182 T2078 oass.SolrIndexSearcher.getIndexDir WARNING WARNING: Directory impl does not support setting indexDir: org.apache.lucene.store.MockDirectoryWrapper
[junit4:junit4]   2> 182 T2078 oasu.CommitTracker.<init> Hard AutoCommit: disabled
[junit4:junit4]   2> 183 T2078 oasu.CommitTracker.<init> Soft AutoCommit: disabled
[junit4:junit4]   2> 184 T2078 oashc.QueryElevationComponent.inform Loading QueryElevation from: /mnt/ssd/jenkins/workspace/Lucene-Solr-trunk-Linux-Java8-64/checkout/solr/build/solr-core/test-files/solr/collection1/conf/elevate.xml
[junit4:junit4]   2> 190 T2078 oashc.QueryElevationComponent.inform Loading QueryElevation from: /mnt/ssd/jenkins/workspace/Lucene-Solr-trunk-Linux-Java8-64/checkout/solr/build/solr-core/test-files/solr/collection1/conf/elevate.xml
[junit4:junit4]   2> 195 T2088 oasc.SolrCore.registerSearcher [collection1] Registered new searcher Searcher@2ab244f7 main{StandardDirectoryReader(segments_1:1)}
[junit4:junit4]   2> 195 T2078 oasc.CoreContainer.register registering core: collection1
[junit4:junit4]   2> 196 T2078 oass.SolrDispatchFilter.init user.dir=/mnt/ssd/jenkins/workspace/Lucene-Solr-trunk-Linux-Java8-64/checkout/solr/build/solr-core/test/J1
[junit4:junit4]   2> 196 T2078 oass.SolrDispatchFilter.init SolrDispatchFilter.init() done
[junit4:junit4]   2> 196 T2078 oascsi.HttpClientUtil.createClient Creating new http client, config:maxConnections=128&maxConnectionsPerHost=32&followRedirects=false
[junit4:junit4]   2> 198 T2078 oejs.Server.doStart jetty-8.1.2.v20120308
[junit4:junit4]   2> 199 T2078 oejs.AbstractConnector.doStart Started SocketConnector@0.0.0.0:44819
[junit4:junit4]   2> 200 T2078 oasc.SolrResourceLoader.locateSolrHome JNDI not configured for solr (NoInitialContextEx)
[junit4:junit4]   2> 200 T2078 oasc.SolrResourceLoader.locateSolrHome using system property solr.solr.home: /mnt/ssd/jenkins/workspace/Lucene-Solr-trunk-Linux-Java8-64/checkout/solr/build/solr-core/test-files/solr
[junit4:junit4]   2> 200 T2078 oasc.SolrResourceLoader.<init> new SolrResourceLoader for deduced Solr Home: '/mnt/ssd/jenkins/workspace/Lucene-Solr-trunk-Linux-Java8-64/checkout/solr/build/solr-core/test-files/solr/'
[junit4:junit4]   2> 203 T2078 oass.SolrDispatchFilter.init SolrDispatchFilter.init()
[junit4:junit4]   2> 203 T2078 oasc.SolrResourceLoader.locateSolrHome JNDI not configured for solr (NoInitialContextEx)
[junit4:junit4]   2> 203 T2078 oasc.SolrResourceLoader.locateSolrHome using system property solr.solr.home: /mnt/ssd/jenkins/workspace/Lucene-Solr-trunk-Linux-Java8-64/checkout/solr/build/solr-core/test-files/solr
[junit4:junit4]   2> 203 T2078 oasc.CoreContainer$Initializer.initialize looking for solr.xml: /mnt/ssd/jenkins/workspace/Lucene-Solr-trunk-Linux-Java8-64/checkout/solr/build/solr-core/test-files/solr/solr.xml
[junit4:junit4]   2> 204 T2078 oasc.CoreContainer.<init> New CoreContainer 401191785
[junit4:junit4]   2> 204 T2078 oasc.CoreContainer.load Loading CoreContainer using Solr Home: '/mnt/ssd/jenkins/workspace/Lucene-Solr-trunk-Linux-Java8-64/checkout/solr/build/solr-core/test-files/solr/'
[junit4:junit4]   2> 204 T2078 oasc.SolrResourceLoader.<init> new SolrResourceLoader for directory: '/mnt/ssd/jenkins/workspace/Lucene-Solr-trunk-Linux-Java8-64/checkout/solr/build/solr-core/test-files/solr/'
[junit4:junit4]   2> 208 T2078 oasc.CoreContainer.load Registering Log Listener
[junit4:junit4]   2> 214 T2078 oashc.HttpShardHandlerFactory.getParameter Setting socketTimeout to: 0
[junit4:junit4]   2> 214 T2078 oashc.HttpShardHandlerFactory.getParameter Setting urlScheme to: http://
[junit4:junit4]   2> 214 T2078 oashc.HttpShardHandlerFactory.getParameter Setting connTimeout to: 0
[junit4:junit4]   2> 215 T2078 oashc.HttpShardHandlerFactory.getParameter Setting maxConnectionsPerHost to: 20
[junit4:junit4]   2> 215 T2078 oashc.HttpShardHandlerFactory.getParameter Setting corePoolSize to: 0
[junit4:junit4]   2> 215 T2078 oashc.HttpShardHandlerFactory.getParameter Setting maximumPoolSize to: 2147483647
[junit4:junit4]   2> 215 T2078 oashc.HttpShardHandlerFactory.getParameter Setting maxThreadIdleTime to: 5
[junit4:junit4]   2> 215 T2078 oashc.HttpShardHandlerFactory.getParameter Setting sizeOfQueue to: -1
[junit4:junit4]   2> 215 T2078 oashc.HttpShardHandlerFactory.getParameter Setting fairnessPolicy to: false
[junit4:junit4]   2> 216 T2078 oascsi.HttpClientUtil.createClient Creating new http client, config:maxConnectionsPerHost=20&maxConnections=10000&socketTimeout=0&connTimeout=0&retry=false
[junit4:junit4]   2> 219 T2078 oasc.CoreContainer.create Creating SolrCore 'collection1' using instanceDir: /mnt/ssd/jenkins/workspace/Lucene-Solr-trunk-Linux-Java8-64/checkout/solr/build/solr-core/test-files/solr/collection1
[junit4:junit4]   2> 219 T2078 oasc.SolrResourceLoader.<init> new SolrResourceLoader for directory: '/mnt/ssd/jenkins/workspace/Lucene-Solr-trunk-Linux-Java8-64/checkout/solr/build/solr-core/test-files/solr/collection1/'
[junit4:junit4]   2> 220 T2078 oasc.SolrResourceLoader.replaceClassLoader Adding 'file:/mnt/ssd/jenkins/workspace/Lucene-Solr-trunk-Linux-Java8-64/checkout/solr/build/solr-core/test-files/solr/collection1/lib/README' to classloader
[junit4:junit4]   2> 220 T2078 oasc.SolrResourceLoader.replaceClassLoader Adding 'file:/mnt/ssd/jenkins/workspace/Lucene-Solr-trunk-Linux-Java8-64/checkout/solr/build/solr-core/test-files/solr/collection1/lib/classes/' to classloader
[junit4:junit4]   2> 234 T2078 oasc.SolrConfig.<init> Using Lucene MatchVersion: LUCENE_50
[junit4:junit4]   2> 258 T2078 oasc.SolrConfig.<init> Loaded SolrConfig: solrconfig-elevate.xml
[junit4:junit4]   2> 258 T2078 oass.IndexSchema.readSchema Reading Solr Schema
[junit4:junit4]   2> 260 T2078 oass.IndexSchema.readSchema Schema name=example
[junit4:junit4]   2> 360 T2078 oass.IndexSchema.readSchema default search field in schema is text
[junit4:junit4]   2> 361 T2078 oass.IndexSchema.readSchema unique key field: id
[junit4:junit4]   2> 363 T2078 oasc.SolrCore.<init> [collection1] Opening new SolrCore at /mnt/ssd/jenkins/workspace/Lucene-Solr-trunk-Linux-Java8-64/checkout/solr/build/solr-core/test-files/solr/collection1/, dataDir=./org.apache.solr.handler.component.DistributedQueryElevationComponentTest-1341867673208/shard0/data/
[junit4:junit4]   2> 363 T2078 oasc.JmxMonitoredMap.<init> JMX monitoring is enabled. Adding Solr mbeans to JMX Server: com.sun.jmx.mbeanserver.JmxMBeanServer@16442f86
[junit4:junit4]   2> 363 T2078 oasc.SolrCore.getNewIndexDir WARNING New index directory detected: old=null new=./org.apache.solr.handler.component.DistributedQueryElevationComponentTest-1341867673208/shard0/data/index/
[junit4:junit4]   2> 364 T2078 oasc.SolrCore.initIndex WARNING [collection1] Solr index directory './org.apache.solr.handler.component.DistributedQueryElevationComponentTest-1341867673208/shard0/data/index' doesn't exist. Creating new index...
[junit4:junit4]   2> 365 T2078 oasc.SolrDeletionPolicy.onCommit SolrDeletionPolicy.onCommit: commits:num=1
[junit4:junit4]   2> 		commit{dir=MockDirWrapper(org.apache.lucene.store.RAMDirectory@46e09cd1 lockFactory=org.apache.lucene.store.SingleInstanceLockFactory@4d03ae84),segFN=segments_1,generation=1,filenames=[segments_1]
[junit4:junit4]   2> 365 T2078 oasc.SolrDeletionPolicy.updateCommits newest commit = 1
[junit4:junit4]   2> 366 T2078 oasc.RequestHandlers.initHandlersFromConfig created /update: solr.UpdateRequestHandler
[junit4:junit4]   2> 366 T2078 oasc.RequestHandlers.initHandlersFromConfig created /elevate: org.apache.solr.handler.component.SearchHandler
[junit4:junit4]   2> 366 T2078 oasc.RequestHandlers.initHandlersFromConfig created /dataElevate: org.apache.solr.handler.component.SearchHandler
[junit4:junit4]   2> 366 T2078 oashl.XMLLoader.init xsltCacheLifetimeSeconds=60
[junit4:junit4]   2> 367 T2078 oasc.RequestHandlers.initHandlersFromConfig WARNING no default request handler is registered (either '/select' or 'standard')
[junit4:junit4]   2> 367 T2078 oasc.SolrCore.initDeprecatedSupport WARNING solrconfig.xml uses deprecated <admin/gettableFiles>, Please update your config to use the ShowFileRequestHandler.
[junit4:junit4]   2> 368 T2078 oasc.SolrCore.initDeprecatedSupport WARNING adding ShowFileRequestHandler with hidden files: [SCHEMA-FOLDING.XML, SCHEMA-TFIDF.XML, BAD_SOLRCONFIG.XML, BAD-SCHEMA-NOT-INDEXED-BUT-POS.XML, SCHEMA-NUMERIC.XML, BAD-SCHEMA-OMIT-TF-BUT-NOT-POS.XML, BAD-SCHEMA-UNIQUEKEY-USES-DEFAULT.XML, SOLRCONFIG-PROPINJECT-INDEXDEFAULT.XML, SOLRCONFIG-MASTER1.XML, SOLRCONFIG-NOCACHE.XML, SCHEMA-BINARYFIELD.XML, BAD-SCHEMA-NOT-INDEXED-BUT-TF.XML, MAPPING-ISOLATIN1ACCENT.TXT, SOLRCONFIG-PROPINJECT.XML, SCHEMA-COPYFIELD-TEST.XML, SOLRCONFIG-CACHING.XML, BAD-SCHEMA-SIM-GLOBAL-VS-FT-MISMATCH.XML, SOLRCONFIG-ALTDIRECTORY.XML, BAD-SCHEMA-DUP-FIELD.XML, SOLRCONFIG_CODEC.XML, SOLRCONFIG-REQHANDLER.INCL, SCHEMA-STOP-KEEP.XML, SCHEMA-REPLICATION2.XML, BAD-SCHEMA-NOT-INDEXED-BUT-NORMS.XML, KEEP-2.TXT, SCHEMA-IB.XML, STOPWITHBOM.TXT, ELEVATE.XML, SOLRCONFIG-MASTER3.XML, SOLRCONFIG-SLAVE1.XML, SCHEMA-REQUIRED-FIELDS.XML, SCHEMA-LUCENEMATCHVERSION.XML, SCHEMASURROUND.XML, SOLRCONFIG-FUNCTIONQUERY.XML, SOLRCONFIG-MASTER.XML, SOLRCONFIG-QUERYSENDER.XML, SCHEMA-REPLICATION1.XML, SCHEMA_CODEC.XML, SOLRCONFIG-ELEVATE.XML, SCHEMA11.XML, SOLRCONFIG-QUERYSENDER-NOQUERY.XML, SOLRCONFIG-UPDATE-PROCESSOR-CHAINS.XML, COMPOUNDDICTIONARY.TXT, BAD-SCHEMA-NONTEXT-ANALYZER.XML, SOLRCONFIG-DELPOLICY1.XML, PHRASESUGGEST.TXT, KEEP-1.TXT, SOLRCONFIG-SIMPLELOCK.XML, SOLRCONFIG-SPELLCHECKCOMPONENT.XML, BAD-SCHEMA-EXTERNAL-FILEFIELD.XML, SOLRCONFIG-NATIVELOCK.XML, SOLRCONFIG-MASTER1-KEEPONEBACKUP.XML, OLD_SYNONYMS.TXT, SOLRCONFIG_PERF.XML, XSLT, CURRENCY.XML, DA_COMPOUNDDICTIONARY.TXT, STOPWORDS.TXT, OPEN-EXCHANGE-RATES.JSON, SCHEMA-SIM.XML, STOPTYPES-1.TXT, SOLRCONFIG-TLOG.XML, HYPHENATION.DTD, SCHEMA-PHRASESUGGEST.XML, STOP-1.TXT, SCHEMA-CHARFILTERS.XML, SCHEMA-DFR.XML, BAD-SCHEMA-UNIQUEKEY-IS-COPYFIELD-DEST.XML, SCHEMA-TRIE.XML, SCHEMA12.XML, PROTWORDS.TXT, SOLRCONFIG-TRANSFORMERS.XML, SOLRCONFIG-PHRASESUGGEST.XML, SCHEMA-SPELLCHECKER.XML, SOLRCONFIG-ENABLEPLUGIN.XML, SOLRCONFIG-DELPOLICY2.XML, HUNSPELL-TEST.AFF, SCHEMA.XML, SOLRCONFIG-MASTER2.XML, SCHEMA15.XML, SOLRCONFIG-REPEATER.XML, SOLRCONFIG-TERMINDEX.XML, SOLRCONFIG-SOLR-749.XML, SYNONYMS.TXT, SCHEMA-REVERSED.XML, SOLRCONFIG-SOLCOREPROPERTIES.XML, BAD-SCHEMA-DUP-FIELDTYPE.XML, STOPWORDSWRONGENCODING.TXT, SOLRCONFIG-SLAVE.XML, SCHEMA-COLLATE.XML, SCHEMA-MINIMAL.XML, SCHEMA-LMJELINEKMERCER.XML, WDFTYPES.TXT, STOP-2.TXT, SCHEMA-NOT-REQUIRED-UNIQUE-KEY.XML, SOLRCONFIG-HIGHLIGHT.XML, BAD-MP-SOLRCONFIG.XML, SCHEMA-LMDIRICHLET.XML, HUNSPELL-TEST.DIC, FRENCHARTICLES.TXT, STOPTYPES-2.TXT, STEMDICT.TXT, BAD-SCHEMA-DUP-DYNAMICFIELD.XML, SOLRCONFIG-SPELLCHECKER.XML, SOLRCONFIG-MERGEPOLICY.XML, DA_UTF8.XML, SCHEMA-BM25.XML, SOLRCONFIG-BASIC.XML, SOLRCONFIG-XINCLUDE.XML, SOLRCONFIG-LAZYWRITER.XML, STOP-SNOWBALL.TXT]
[junit4:junit4]   2> 369 T2078 oass.SolrIndexSearcher.<init> Opening Searcher@13125ea3 main
[junit4:junit4]   2> 370 T2078 oass.SolrIndexSearcher.getIndexDir WARNING WARNING: Directory impl does not support setting indexDir: org.apache.lucene.store.MockDirectoryWrapper
[junit4:junit4]   2> 370 T2078 oasu.CommitTracker.<init> Hard AutoCommit: disabled
[junit4:junit4]   2> 370 T2078 oasu.CommitTracker.<init> Soft AutoCommit: disabled
[junit4:junit4]   2> 370 T2078 oashc.QueryElevationComponent.inform Loading QueryElevation from: /mnt/ssd/jenkins/workspace/Lucene-Solr-trunk-Linux-Java8-64/checkout/solr/build/solr-core/test-files/solr/collection1/conf/elevate.xml
[junit4:junit4]   2> 375 T2078 oashc.QueryElevationComponent.inform Loading QueryElevation from: /mnt/ssd/jenkins/workspace/Lucene-Solr-trunk-Linux-Java8-64/checkout/solr/build/solr-core/test-files/solr/collection1/conf/elevate.xml
[junit4:junit4]   2> 381 T2098 oasc.SolrCore.registerSearcher [collection1] Registered new searcher Searcher@13125ea3 main{StandardDirectoryReader(segments_1:1)}
[junit4:junit4]   2> 380 T2078 oasc.CoreContainer.register registering core: collection1
[junit4:junit4]   2> 381 T2078 oass.SolrDispatchFilter.init user.dir=/mnt/ssd/jenkins/workspace/Lucene-Solr-trunk-Linux-Java8-64/checkout/solr/build/solr-core/test/J1
[junit4:junit4]   2> 381 T2078 oass.SolrDispatchFilter.init SolrDispatchFilter.init() done
[junit4:junit4]   2> 382 T2078 oascsi.HttpClientUtil.createClient Creating new http client, config:maxConnections=128&maxConnectionsPerHost=32&followRedirects=false
[junit4:junit4]   2> 383 T2078 oejs.Server.doStart jetty-8.1.2.v20120308
[junit4:junit4]   2> 384 T2078 oejs.AbstractConnector.doStart Started SocketConnector@0.0.0.0:40302
[junit4:junit4]   2> 385 T2078 oasc.SolrResourceLoader.locateSolrHome JNDI not configured for solr (NoInitialContextEx)
[junit4:junit4]   2> 385 T2078 oasc.SolrResourceLoader.locateSolrHome using system property solr.solr.home: /mnt/ssd/jenkins/workspace/Lucene-Solr-trunk-Linux-Java8-64/checkout/solr/build/solr-core/test-files/solr
[junit4:junit4]   2> 387 T2078 oasc.SolrResourceLoader.<init> new SolrResourceLoader for deduced Solr Home: '/mnt/ssd/jenkins/workspace/Lucene-Solr-trunk-Linux-Java8-64/checkout/solr/build/solr-core/test-files/solr/'
[junit4:junit4]   2> 389 T2078 oass.SolrDispatchFilter.init SolrDispatchFilter.init()
[junit4:junit4]   2> 389 T2078 oasc.SolrResourceLoader.locateSolrHome JNDI not configured for solr (NoInitialContextEx)
[junit4:junit4]   2> 390 T2078 oasc.SolrResourceLoader.locateSolrHome using system property solr.solr.home: /mnt/ssd/jenkins/workspace/Lucene-Solr-trunk-Linux-Java8-64/checkout/solr/build/solr-core/test-files/solr
[junit4:junit4]   2> 390 T2078 oasc.CoreContainer$Initializer.initialize looking for solr.xml: /mnt/ssd/jenkins/workspace/Lucene-Solr-trunk-Linux-Java8-64/checkout/solr/build/solr-core/test-files/solr/solr.xml
[junit4:junit4]   2> 390 T2078 oasc.CoreContainer.<init> New CoreContainer 277721809
[junit4:junit4]   2> 390 T2078 oasc.CoreContainer.load Loading CoreContainer using Solr Home: '/mnt/ssd/jenkins/workspace/Lucene-Solr-trunk-Linux-Java8-64/checkout/solr/build/solr-core/test-files/solr/'
[junit4:junit4]   2> 390 T2078 oasc.SolrResourceLoader.<init> new SolrResourceLoader for directory: '/mnt/ssd/jenkins/workspace/Lucene-Solr-trunk-Linux-Java8-64/checkout/solr/build/solr-core/test-files/solr/'
[junit4:junit4]   2> 395 T2078 oasc.CoreContainer.load Registering Log Listener
[junit4:junit4]   2> 401 T2078 oashc.HttpShardHandlerFactory.getParameter Setting socketTimeout to: 0
[junit4:junit4]   2> 402 T2078 oashc.HttpShardHandlerFactory.getParameter Setting urlScheme to: http://
[junit4:junit4]   2> 402 T2078 oashc.HttpShardHandlerFactory.getParameter Setting connTimeout to: 0
[junit4:junit4]   2> 402 T2078 oashc.HttpShardHandlerFactory.getParameter Setting maxConnectionsPerHost to: 20
[junit4:junit4]   2> 402 T2078 oashc.HttpShardHandlerFactory.getParameter Setting corePoolSize to: 0
[junit4:junit4]   2> 403 T2078 oashc.HttpShardHandlerFactory.getParameter Setting maximumPoolSize to: 2147483647
[junit4:junit4]   2> 403 T2078 oashc.HttpShardHandlerFactory.getParameter Setting maxThreadIdleTime to: 5
[junit4:junit4]   2> 403 T2078 oashc.HttpShardHandlerFactory.getParameter Setting sizeOfQueue to: -1
[junit4:junit4]   2> 403 T2078 oashc.HttpShardHandlerFactory.getParameter Setting fairnessPolicy to: false
[junit4:junit4]   2> 403 T2078 oascsi.HttpClientUtil.createClient Creating new http client, config:maxConnectionsPerHost=20&maxConnections=10000&socketTimeout=0&connTimeout=0&retry=false
[junit4:junit4]   2> 407 T2078 oasc.CoreContainer.create Creating SolrCore 'collection1' using instanceDir: /mnt/ssd/jenkins/workspace/Lucene-Solr-trunk-Linux-Java8-64/checkout/solr/build/solr-core/test-files/solr/collection1
[junit4:junit4]   2> 407 T2078 oasc.SolrResourceLoader.<init> new SolrResourceLoader for directory: '/mnt/ssd/jenkins/workspace/Lucene-Solr-trunk-Linux-Java8-64/checkout/solr/build/solr-core/test-files/solr/collection1/'
[junit4:junit4]   2> 408 T2078 oasc.SolrResourceLoader.replaceClassLoader Adding 'file:/mnt/ssd/jenkins/workspace/Lucene-Solr-trunk-Linux-Java8-64/checkout/solr/build/solr-core/test-files/solr/collection1/lib/README' to classloader
[junit4:junit4]   2> 408 T2078 oasc.SolrResourceLoader.replaceClassLoader Adding 'file:/mnt/ssd/jenkins/workspace/Lucene-Solr-trunk-Linux-Java8-64/checkout/solr/build/solr-core/test-files/solr/collection1/lib/classes/' to classloader
[junit4:junit4]   2> 421 T2078 oasc.SolrConfig.<init> Using Lucene MatchVersion: LUCENE_50
[junit4:junit4]   2> 446 T2078 oasc.SolrConfig.<init> Loaded SolrConfig: solrconfig-elevate.xml
[junit4:junit4]   2> 447 T2078 oass.IndexSchema.readSchema Reading Solr Schema
[junit4:junit4]   2> 449 T2078 oass.IndexSchema.readSchema Schema name=example
[junit4:junit4]   2> 550 T2078 oass.IndexSchema.readSchema default search field in schema is text
[junit4:junit4]   2> 552 T2078 oass.IndexSchema.readSchema unique key field: id
[junit4:junit4]   2> 553 T2078 oasc.SolrCore.<init> [collection1] Opening new SolrCore at /mnt/ssd/jenkins/workspace/Lucene-Solr-trunk-Linux-Java8-64/checkout/solr/build/solr-core/test-files/solr/collection1/, dataDir=./org.apache.solr.handler.component.DistributedQueryElevationComponentTest-1341867673208/shard1/data/
[junit4:junit4]   2> 553 T2078 oasc.JmxMonitoredMap.<init> JMX monitoring is enabled. Adding Solr mbeans to JMX Server: com.sun.jmx.mbeanserver.JmxMBeanServer@16442f86
[junit4:junit4]   2> 554 T2078 oasc.SolrCore.getNewIndexDir WARNING New index directory detected: old=null new=./org.apache.solr.handler.component.DistributedQueryElevationComponentTest-1341867673208/shard1/data/index/
[junit4:junit4]   2> 554 T2078 oasc.SolrCore.initIndex WARNING [collection1] Solr index directory './org.apache.solr.handler.component.DistributedQueryElevationComponentTest-1341867673208/shard1/data/index' doesn't exist. Creating new index...
[junit4:junit4]   2> 556 T2078 oasc.SolrDeletionPolicy.onCommit SolrDeletionPolicy.onCommit: commits:num=1
[junit4:junit4]   2> 		commit{dir=MockDirWrapper(org.apache.lucene.store.RAMDirectory@568bd2f5 lockFactory=org.apache.lucene.store.SingleInstanceLockFactory@5b9d6ea2),segFN=segments_1,generation=1,filenames=[segments_1]
[junit4:junit4]   2> 556 T2078 oasc.SolrDeletionPolicy.updateCommits newest commit = 1
[junit4:junit4]   2> 557 T2078 oasc.RequestHandlers.initHandlersFromConfig created /update: solr.UpdateRequestHandler
[junit4:junit4]   2> 557 T2078 oasc.RequestHandlers.initHandlersFromConfig created /elevate: org.apache.solr.handler.component.SearchHandler
[junit4:junit4]   2> 557 T2078 oasc.RequestHandlers.initHandlersFromConfig created /dataElevate: org.apache.solr.handler.component.SearchHandler
[junit4:junit4]   2> 558 T2078 oashl.XMLLoader.init xsltCacheLifetimeSeconds=60
[junit4:junit4]   2> 558 T2078 oasc.RequestHandlers.initHandlersFromConfig WARNING no default request handler is registered (either '/select' or 'standard')
[junit4:junit4]   2> 559 T2078 oasc.SolrCore.initDeprecatedSupport WARNING solrconfig.xml uses deprecated <admin/gettableFiles>, Please update your config to use the ShowFileRequestHandler.
[junit4:junit4]   2> 559 T2078 oasc.SolrCore.initDeprecatedSupport WARNING adding ShowFileRequestHandler with hidden files: [SCHEMA-FOLDING.XML, SCHEMA-TFIDF.XML, BAD_SOLRCONFIG.XML, BAD-SCHEMA-NOT-INDEXED-BUT-POS.XML, SCHEMA-NUMERIC.XML, BAD-SCHEMA-OMIT-TF-BUT-NOT-POS.XML, BAD-SCHEMA-UNIQUEKEY-USES-DEFAULT.XML, SOLRCONFIG-PROPINJECT-INDEXDEFAULT.XML, SOLRCONFIG-MASTER1.XML, SOLRCONFIG-NOCACHE.XML, SCHEMA-BINARYFIELD.XML, BAD-SCHEMA-NOT-INDEXED-BUT-TF.XML, MAPPING-ISOLATIN1ACCENT.TXT, SOLRCONFIG-PROPINJECT.XML, SCHEMA-COPYFIELD-TEST.XML, SOLRCONFIG-CACHING.XML, BAD-SCHEMA-SIM-GLOBAL-VS-FT-MISMATCH.XML, SOLRCONFIG-ALTDIRECTORY.XML, BAD-SCHEMA-DUP-FIELD.XML, SOLRCONFIG_CODEC.XML, SOLRCONFIG-REQHANDLER.INCL, SCHEMA-STOP-KEEP.XML, SCHEMA-REPLICATION2.XML, BAD-SCHEMA-NOT-INDEXED-BUT-NORMS.XML, KEEP-2.TXT, SCHEMA-IB.XML, STOPWITHBOM.TXT, ELEVATE.XML, SOLRCONFIG-MASTER3.XML, SOLRCONFIG-SLAVE1.XML, SCHEMA-REQUIRED-FIELDS.XML, SCHEMA-LUCENEMATCHVERSION.XML, SCHEMASURROUND.XML, SOLRCONFIG-FUNCTIONQUERY.XML, SOLRCONFIG-MASTER.XML, SOLRCONFIG-QUERYSENDER.XML, SCHEMA-REPLICATION1.XML, SCHEMA_CODEC.XML, SOLRCONFIG-ELEVATE.XML, SCHEMA11.XML, SOLRCONFIG-QUERYSENDER-NOQUERY.XML, SOLRCONFIG-UPDATE-PROCESSOR-CHAINS.XML, COMPOUNDDICTIONARY.TXT, BAD-SCHEMA-NONTEXT-ANALYZER.XML, SOLRCONFIG-DELPOLICY1.XML, PHRASESUGGEST.TXT, KEEP-1.TXT, SOLRCONFIG-SIMPLELOCK.XML, SOLRCONFIG-SPELLCHECKCOMPONENT.XML, BAD-SCHEMA-EXTERNAL-FILEFIELD.XML, SOLRCONFIG-NATIVELOCK.XML, SOLRCONFIG-MASTER1-KEEPONEBACKUP.XML, OLD_SYNONYMS.TXT, SOLRCONFIG_PERF.XML, XSLT, CURRENCY.XML, DA_COMPOUNDDICTIONARY.TXT, STOPWORDS.TXT, OPEN-EXCHANGE-RATES.JSON, SCHEMA-SIM.XML, STOPTYPES-1.TXT, SOLRCONFIG-TLOG.XML, HYPHENATION.DTD, SCHEMA-PHRASESUGGEST.XML, STOP-1.TXT, SCHEMA-CHARFILTERS.XML, SCHEMA-DFR.XML, BAD-SCHEMA-UNIQUEKEY-IS-COPYFIELD-DEST.XML, SCHEMA-TRIE.XML, SCHEMA12.XML, PROTWORDS.TXT, SOLRCONFIG-TRANSFORMERS.XML, SOLRCONFIG-PHRASESUGGEST.XML, SCHEMA-SPELLCHECKER.XML, SOLRCONFIG-ENABLEPLUGIN.XML, SOLRCONFIG-DELPOLICY2.XML, HUNSPELL-TEST.AFF, SCHEMA.XML, SOLRCONFIG-MASTER2.XML, SCHEMA15.XML, SOLRCONFIG-REPEATER.XML, SOLRCONFIG-TERMINDEX.XML, SOLRCONFIG-SOLR-749.XML, SYNONYMS.TXT, SCHEMA-REVERSED.XML, SOLRCONFIG-SOLCOREPROPERTIES.XML, BAD-SCHEMA-DUP-FIELDTYPE.XML, STOPWORDSWRONGENCODING.TXT, SOLRCONFIG-SLAVE.XML, SCHEMA-COLLATE.XML, SCHEMA-MINIMAL.XML, SCHEMA-LMJELINEKMERCER.XML, WDFTYPES.TXT, STOP-2.TXT, SCHEMA-NOT-REQUIRED-UNIQUE-KEY.XML, SOLRCONFIG-HIGHLIGHT.XML, BAD-MP-SOLRCONFIG.XML, SCHEMA-LMDIRICHLET.XML, HUNSPELL-TEST.DIC, FRENCHARTICLES.TXT, STOPTYPES-2.TXT, STEMDICT.TXT, BAD-SCHEMA-DUP-DYNAMICFIELD.XML, SOLRCONFIG-SPELLCHECKER.XML, SOLRCONFIG-MERGEPOLICY.XML, DA_UTF8.XML, SCHEMA-BM25.XML, SOLRCONFIG-BASIC.XML, SOLRCONFIG-XINCLUDE.XML, SOLRCONFIG-LAZYWRITER.XML, STOP-SNOWBALL.TXT]
[junit4:junit4]   2> 560 T2078 oass.SolrIndexSearcher.<init> Opening Searcher@69afc68a main
[junit4:junit4]   2> 561 T2078 oass.SolrIndexSearcher.getIndexDir WARNING WARNING: Directory impl does not support setting indexDir: org.apache.lucene.store.MockDirectoryWrapper
[junit4:junit4]   2> 561 T2078 oasu.CommitTracker.<init> Hard AutoCommit: disabled
[junit4:junit4]   2> 561 T2078 oasu.CommitTracker.<init> Soft AutoCommit: disabled
[junit4:junit4]   2> 561 T2078 oashc.QueryElevationComponent.inform Loading QueryElevation from: /mnt/ssd/jenkins/workspace/Lucene-Solr-trunk-Linux-Java8-64/checkout/solr/build/solr-core/test-files/solr/collection1/conf/elevate.xml
[junit4:junit4]   2> 566 T2078 oashc.QueryElevationComponent.inform Loading QueryElevation from: /mnt/ssd/jenkins/workspace/Lucene-Solr-trunk-Linux-Java8-64/checkout/solr/build/solr-core/test-files/solr/collection1/conf/elevate.xml
[junit4:junit4]   2> 573 T2108 oasc.SolrCore.registerSearcher [collection1] Registered new searcher Searcher@69afc68a main{StandardDirectoryReader(segments_1:1)}
[junit4:junit4]   2> 573 T2078 oasc.CoreContainer.register registering core: collection1
[junit4:junit4]   2> 574 T2078 oass.SolrDispatchFilter.init user.dir=/mnt/ssd/jenkins/workspace/Lucene-Solr-trunk-Linux-Java8-64/checkout/solr/build/solr-core/test/J1
[junit4:junit4]   2> 574 T2078 oass.SolrDispatchFilter.init SolrDispatchFilter.init() done
[junit4:junit4]   2> 574 T2078 oascsi.HttpClientUtil.createClient Creating new http client, config:maxConnections=128&maxConnectionsPerHost=32&followRedirects=false
[junit4:junit4]   2> 577 T2078 oejs.Server.doStart jetty-8.1.2.v20120308
[junit4:junit4]   2> 578 T2078 oejs.AbstractConnector.doStart Started SocketConnector@0.0.0.0:58655
[junit4:junit4]   2> 579 T2078 oasc.SolrResourceLoader.locateSolrHome JNDI not configured for solr (NoInitialContextEx)
[junit4:junit4]   2> 579 T2078 oasc.SolrResourceLoader.locateSolrHome using system property solr.solr.home: /mnt/ssd/jenkins/workspace/Lucene-Solr-trunk-Linux-Java8-64/checkout/solr/build/solr-core/test-files/solr
[junit4:junit4]   2> 579 T2078 oasc.SolrResourceLoader.<init> new SolrResourceLoader for deduced Solr Home: '/mnt/ssd/jenkins/workspace/Lucene-Solr-trunk-Linux-Java8-64/checkout/solr/build/solr-core/test-files/solr/'
[junit4:junit4]   2> 581 T2078 oass.SolrDispatchFilter.init SolrDispatchFilter.init()
[junit4:junit4]   2> 582 T2078 oasc.SolrResourceLoader.locateSolrHome JNDI not configured for solr (NoInitialContextEx)
[junit4:junit4]   2> 582 T2078 oasc.SolrResourceLoader.locateSolrHome using system property solr.solr.home: /mnt/ssd/jenkins/workspace/Lucene-Solr-trunk-Linux-Java8-64/checkout/solr/build/solr-core/test-files/solr
[junit4:junit4]   2> 582 T2078 oasc.CoreContainer$Initializer.initialize looking for solr.xml: /mnt/ssd/jenkins/workspace/Lucene-Solr-trunk-Linux-Java8-64/checkout/solr/build/solr-core/test-files/solr/solr.xml
[junit4:junit4]   2> 582 T2078 oasc.CoreContainer.<init> New CoreContainer 2137895968
[junit4:junit4]   2> 582 T2078 oasc.CoreContainer.load Loading CoreContainer using Solr Home: '/mnt/ssd/jenkins/workspace/Lucene-Solr-trunk-Linux-Java8-64/checkout/solr/build/solr-core/test-files/solr/'
[junit4:junit4]   2> 583 T2078 oasc.SolrResourceLoader.<init> new SolrResourceLoader for directory: '/mnt/ssd/jenkins/workspace/Lucene-Solr-trunk-Linux-Java8-64/checkout/solr/build/solr-core/test-files/solr/'
[junit4:junit4]   2> 586 T2078 oasc.CoreContainer.load Registering Log Listener
[junit4:junit4]   2> 592 T2078 oashc.HttpShardHandlerFactory.getParameter Setting socketTimeout to: 0
[junit4:junit4]   2> 592 T2078 oashc.HttpShardHandlerFactory.getParameter Setting urlScheme to: http://
[junit4:junit4]   2> 592 T2078 oashc.HttpShardHandlerFactory.getParameter Setting connTimeout to: 0
[junit4:junit4]   2> 592 T2078 oashc.HttpShardHandlerFactory.getParameter Setting maxConnectionsPerHost to: 20
[junit4:junit4]   2> 593 T2078 oashc.HttpShardHandlerFactory.getParameter Setting corePoolSize to: 0
[junit4:junit4]   2> 593 T2078 oashc.HttpShardHandlerFactory.getParameter Setting maximumPoolSize to: 2147483647
[junit4:junit4]   2> 593 T2078 oashc.HttpShardHandlerFactory.getParameter Setting maxThreadIdleTime to: 5
[junit4:junit4]   2> 593 T2078 oashc.HttpShardHandlerFactory.getParameter Setting sizeOfQueue to: -1
[junit4:junit4]   2> 593 T2078 oashc.HttpShardHandlerFactory.getParameter Setting fairnessPolicy to: false
[junit4:junit4]   2> 594 T2078 oascsi.HttpClientUtil.createClient Creating new http client, config:maxConnectionsPerHost=20&maxConnections=10000&socketTimeout=0&connTimeout=0&retry=false
[junit4:junit4]   2> 597 T2078 oasc.CoreContainer.create Creating SolrCore 'collection1' using instanceDir: /mnt/ssd/jenkins/workspace/Lucene-Solr-trunk-Linux-Java8-64/checkout/solr/build/solr-core/test-files/solr/collection1
[junit4:junit4]   2> 597 T2078 oasc.SolrResourceLoader.<init> new SolrResourceLoader for directory: '/mnt/ssd/jenkins/workspace/Lucene-Solr-trunk-Linux-Java8-64/checkout/solr/build/solr-core/test-files/solr/collection1/'
[junit4:junit4]   2> 598 T2078 oasc.SolrResourceLoader.replaceClassLoader Adding 'file:/mnt/ssd/jenkins/workspace/Lucene-Solr-trunk-Linux-Java8-64/checkout/solr/build/solr-core/test-files/solr/collection1/lib/README' to classloader
[junit4:junit4]   2> 598 T2078 oasc.SolrResourceLoader.replaceClassLoader Adding 'file:/mnt/ssd/jenkins/workspace/Lucene-Solr-trunk-Linux-Java8-64/checkout/solr/build/solr-core/test-files/solr/collection1/lib/classes/' to classloader
[junit4:junit4]   2> 610 T2078 oasc.SolrConfig.<init> Using Lucene MatchVersion: LUCENE_50
[junit4:junit4]   2> 633 T2078 oasc.SolrConfig.<init> Loaded SolrConfig: solrconfig-elevate.xml
[junit4:junit4]   2> 633 T2078 oass.IndexSchema.readSchema Reading Solr Schema
[junit4:junit4]   2> 635 T2078 oass.IndexSchema.readSchema Schema name=example
[junit4:junit4]   2> 753 T2078 oass.IndexSchema.readSchema default search field in schema is text
[junit4:junit4]   2> 755 T2078 oass.IndexSchema.readSchema unique key field: id
[junit4:junit4]   2> 756 T2078 oasc.SolrCore.<init> [collection1] Opening new SolrCore at /mnt/ssd/jenkins/workspace/Lucene-Solr-trunk-Linux-Java8-64/checkout/solr/build/solr-core/test-files/solr/collection1/, dataDir=./org.apache.solr.handler.component.DistributedQueryElevationComponentTest-1341867673208/shard2/data/
[junit4:junit4]   2> 757 T2078 oasc.JmxMonitoredMap.<init> JMX monitoring is enabled. Adding Solr mbeans to JMX Server: com.sun.jmx.mbeanserver.JmxMBeanServer@16442f86
[junit4:junit4]   2> 757 T2078 oasc.SolrCore.getNewIndexDir WARNING New index directory detected: old=null new=./org.apache.solr.handler.component.DistributedQueryElevationComponentTest-1341867673208/shard2/data/index/
[junit4:junit4]   2> 757 T2078 oasc.SolrCore.initIndex WARNING [collection1] Solr index directory './org.apache.solr.handler.component.DistributedQueryElevationComponentTest-1341867673208/shard2/data/index' doesn't exist. Creating new index...
[junit4:junit4]   2> 758 T2078 oasc.SolrDeletionPolicy.onCommit SolrDeletionPolicy.onCommit: commits:num=1
[junit4:junit4]   2> 		commit{dir=MockDirWrapper(org.apache.lucene.store.RAMDirectory@466af3ed lockFactory=org.apache.lucene.store.SingleInstanceLockFactory@47548dd7),segFN=segments_1,generation=1,filenames=[segments_1]
[junit4:junit4]   2> 758 T2078 oasc.SolrDeletionPolicy.updateCommits newest commit = 1
[junit4:junit4]   2> 759 T2078 oasc.RequestHandlers.initHandlersFromConfig created /update: solr.UpdateRequestHandler
[junit4:junit4]   2> 759 T2078 oasc.RequestHandlers.initHandlersFromConfig created /elevate: org.apache.solr.handler.component.SearchHandler
[junit4:junit4]   2> 760 T2078 oasc.RequestHandlers.initHandlersFromConfig created /dataElevate: org.apache.solr.handler.component.SearchHandler
[junit4:junit4]   2> 760 T2078 oashl.XMLLoader.init xsltCacheLifetimeSeconds=60
[junit4:junit4]   2> 760 T2078 oasc.RequestHandlers.initHandlersFromConfig WARNING no default request handler is registered (either '/select' or 'standard')
[junit4:junit4]   2> 761 T2078 oasc.SolrCore.initDeprecatedSupport WARNING solrconfig.xml uses deprecated <admin/gettableFiles>, Please update your config to use the ShowFileRequestHandler.
[junit4:junit4]   2> 762 T2078 oasc.SolrCore.initDeprecatedSupport WARNING adding ShowFileRequestHandler with hidden files: [SCHEMA-FOLDING.XML, SCHEMA-TFIDF.XML, BAD_SOLRCONFIG.XML, BAD-SCHEMA-NOT-INDEXED-BUT-POS.XML, SCHEMA-NUMERIC.XML, BAD-SCHEMA-OMIT-TF-BUT-NOT-POS.XML, BAD-SCHEMA-UNIQUEKEY-USES-DEFAULT.XML, SOLRCONFIG-PROPINJECT-INDEXDEFAULT.XML, SOLRCONFIG-MASTER1.XML, SOLRCONFIG-NOCACHE.XML, SCHEMA-BINARYFIELD.XML, BAD-SCHEMA-NOT-INDEXED-BUT-TF.XML, MAPPING-ISOLATIN1ACCENT.TXT, SOLRCONFIG-PROPINJECT.XML, SCHEMA-COPYFIELD-TEST.XML, SOLRCONFIG-CACHING.XML, BAD-SCHEMA-SIM-GLOBAL-VS-FT-MISMATCH.XML, SOLRCONFIG-ALTDIRECTORY.XML, BAD-SCHEMA-DUP-FIELD.XML, SOLRCONFIG_CODEC.XML, SOLRCONFIG-REQHANDLER.INCL, SCHEMA-STOP-KEEP.XML, SCHEMA-REPLICATION2.XML, BAD-SCHEMA-NOT-INDEXED-BUT-NORMS.XML, KEEP-2.TXT, SCHEMA-IB.XML, STOPWITHBOM.TXT, ELEVATE.XML, SOLRCONFIG-MASTER3.XML, SOLRCONFIG-SLAVE1.XML, SCHEMA-REQUIRED-FIELDS.XML, SCHEMA-LUCENEMATCHVERSION.XML, SCHEMASURROUND.XML, SOLRCONFIG-FUNCTIONQUERY.XML, SOLRCONFIG-MASTER.XML, SOLRCONFIG-QUERYSENDER.XML, SCHEMA-REPLICATION1.XML, SCHEMA_CODEC.XML, SOLRCONFIG-ELEVATE.XML, SCHEMA11.XML, SOLRCONFIG-QUERYSENDER-NOQUERY.XML, SOLRCONFIG-UPDATE-PROCESSOR-CHAINS.XML, COMPOUNDDICTIONARY.TXT, BAD-SCHEMA-NONTEXT-ANALYZER.XML, SOLRCONFIG-DELPOLICY1.XML, PHRASESUGGEST.TXT, KEEP-1.TXT, SOLRCONFIG-SIMPLELOCK.XML, SOLRCONFIG-SPELLCHECKCOMPONENT.XML, BAD-SCHEMA-EXTERNAL-FILEFIELD.XML, SOLRCONFIG-NATIVELOCK.XML, SOLRCONFIG-MASTER1-KEEPONEBACKUP.XML, OLD_SYNONYMS.TXT, SOLRCONFIG_PERF.XML, XSLT, CURRENCY.XML, DA_COMPOUNDDICTIONARY.TXT, STOPWORDS.TXT, OPEN-EXCHANGE-RATES.JSON, SCHEMA-SIM.XML, STOPTYPES-1.TXT, SOLRCONFIG-TLOG.XML, HYPHENATION.DTD, SCHEMA-PHRASESUGGEST.XML, STOP-1.TXT, SCHEMA-CHARFILTERS.XML, SCHEMA-DFR.XML, BAD-SCHEMA-UNIQUEKEY-IS-COPYFIELD-DEST.XML, SCHEMA-TRIE.XML, SCHEMA12.XML, PROTWORDS.TXT, SOLRCONFIG-TRANSFORMERS.XML, SOLRCONFIG-PHRASESUGGEST.XML, SCHEMA-SPELLCHECKER.XML, SOLRCONFIG-ENABLEPLUGIN.XML, SOLRCONFIG-DELPOLICY2.XML, HUNSPELL-TEST.AFF, SCHEMA.XML, SOLRCONFIG-MASTER2.XML, SCHEMA15.XML, SOLRCONFIG-REPEATER.XML, SOLRCONFIG-TERMINDEX.XML, SOLRCONFIG-SOLR-749.XML, SYNONYMS.TXT, SCHEMA-REVERSED.XML, SOLRCONFIG-SOLCOREPROPERTIES.XML, BAD-SCHEMA-DUP-FIELDTYPE.XML, STOPWORDSWRONGENCODING.TXT, SOLRCONFIG-SLAVE.XML, SCHEMA-COLLATE.XML, SCHEMA-MINIMAL.XML, SCHEMA-LMJELINEKMERCER.XML, WDFTYPES.TXT, STOP-2.TXT, SCHEMA-NOT-REQUIRED-UNIQUE-KEY.XML, SOLRCONFIG-HIGHLIGHT.XML, BAD-MP-SOLRCONFIG.XML, SCHEMA-LMDIRICHLET.XML, HUNSPELL-TEST.DIC, FRENCHARTICLES.TXT, STOPTYPES-2.TXT, STEMDICT.TXT, BAD-SCHEMA-DUP-DYNAMICFIELD.XML, SOLRCONFIG-SPELLCHECKER.XML, SOLRCONFIG-MERGEPOLICY.XML, DA_UTF8.XML, SCHEMA-BM25.XML, SOLRCONFIG-BASIC.XML, SOLRCONFIG-XINCLUDE.XML, SOLRCONFIG-LAZYWRITER.XML, STOP-SNOWBALL.TXT]
[junit4:junit4]   2> 763 T2078 oass.SolrIndexSearcher.<init> Opening Searcher@12f67689 main
[junit4:junit4]   2> 764 T2078 oass.SolrIndexSearcher.getIndexDir WARNING WARNING: Directory impl does not support setting indexDir: org.apache.lucene.store.MockDirectoryWrapper
[junit4:junit4]   2> 764 T2078 oasu.CommitTracker.<init> Hard AutoCommit: disabled
[junit4:junit4]   2> 764 T2078 oasu.CommitTracker.<init> Soft AutoCommit: disabled
[junit4:junit4]   2> 764 T2078 oashc.QueryElevationComponent.inform Loading QueryElevation from: /mnt/ssd/jenkins/workspace/Lucene-Solr-trunk-Linux-Java8-64/checkout/solr/build/solr-core/test-files/solr/collection1/conf/elevate.xml
[junit4:junit4]   2> 769 T2078 oashc.QueryElevationComponent.inform Loading QueryElevation from: /mnt/ssd/jenkins/workspace/Lucene-Solr-trunk-Linux-Java8-64/checkout/solr/build/solr-core/test-files/solr/collection1/conf/elevate.xml
[junit4:junit4]   2> 775 T2118 oasc.SolrCore.registerSearcher [collection1] Registered new searcher Searcher@12f67689 main{StandardDirectoryReader(segments_1:1)}
[junit4:junit4]   2> 774 T2078 oasc.CoreContainer.register registering core: collection1
[junit4:junit4]   2> 776 T2078 oass.SolrDispatchFilter.init user.dir=/mnt/ssd/jenkins/workspace/Lucene-Solr-trunk-Linux-Java8-64/checkout/solr/build/solr-core/test/J1
[junit4:junit4]   2> 776 T2078 oass.SolrDispatchFilter.init SolrDispatchFilter.init() done
[junit4:junit4]   2> 776 T2078 oascsi.HttpClientUtil.createClient Creating new http client, config:maxConnections=128&maxConnectionsPerHost=32&followRedirects=false
[junit4:junit4]   2> ASYNC  NEW_CORE C83 name=collection1 org.apache.solr.core.SolrCore@1498c09a
[junit4:junit4]   2> 781 T2081 C83 oasu.DirectUpdateHandler2.deleteAll [collection1] REMOVING ALL DOCUMENTS FROM INDEX
[junit4:junit4]   2> 782 T2081 C83 oasc.SolrDeletionPolicy.onInit SolrDeletionPolicy.onInit: commits:num=1
[junit4:junit4]   2> 		commit{dir=MockDirWrapper(org.apache.lucene.store.RAMDirectory@388cc906 lockFactory=org.apache.lucene.store.SingleInstanceLockFactory@1488d931),segFN=segments_1,generation=1,filenames=[segments_1]
[junit4:junit4]   2> 782 T2081 C83 oasc.SolrDeletionPolicy.updateCommits newest commit = 1
[junit4:junit4]   2> 782 T2081 C83 UPDATE [collection1] webapp=/solr path=/update params={wt=javabin&version=2} {deleteByQuery=*:*} 0 2
[junit4:junit4]   2> ASYNC  NEW_CORE C84 name=collection1 org.apache.solr.core.SolrCore@670dfb1a
[junit4:junit4]   2> 786 T2091 C84 oasu.DirectUpdateHandler2.deleteAll [collection1] REMOVING ALL DOCUMENTS FROM INDEX
[junit4:junit4]   2> 787 T2091 C84 oasc.SolrDeletionPolicy.onInit SolrDeletionPolicy.onInit: commits:num=1
[junit4:junit4]   2> 		commit{dir=MockDirWrapper(org.apache.lucene.store.RAMDirectory@46e09cd1 lockFactory=org.apache.lucene.store.SingleInstanceLockFactory@4d03ae84),segFN=segments_1,generation=1,filenames=[segments_1]
[junit4:junit4]   2> 787 T2091 C84 oasc.SolrDeletionPolicy.updateCommits newest commit = 1
[junit4:junit4]   2> 787 T2091 C84 UPDATE [collection1] webapp=/solr path=/update params={wt=javabin&version=2} {deleteByQuery=*:*} 0 2
[junit4:junit4]   2> ASYNC  NEW_CORE C85 name=collection1 org.apache.solr.core.SolrCore@1e12974f
[junit4:junit4]   2> 790 T2101 C85 oasu.DirectUpdateHandler2.deleteAll [collection1] REMOVING ALL DOCUMENTS FROM INDEX
[junit4:junit4]   2> 791 T2101 C85 oasc.SolrDeletionPolicy.onInit SolrDeletionPolicy.onInit: commits:num=1
[junit4:junit4]   2> 		commit{dir=MockDirWrapper(org.apache.lucene.store.RAMDirectory@568bd2f5 lockFactory=org.apache.lucene.store.SingleInstanceLockFactory@5b9d6ea2),segFN=segments_1,generation=1,filenames=[segments_1]
[junit4:junit4]   2> 792 T2101 C85 oasc.SolrDeletionPolicy.updateCommits newest commit = 1
[junit4:junit4]   2> 792 T2101 C85 UPDATE [collection1] webapp=/solr path=/update params={wt=javabin&version=2} {deleteByQuery=*:*} 0 2
[junit4:junit4]   2> ASYNC  NEW_CORE C86 name=collection1 org.apache.solr.core.SolrCore@eb7d2b7
[junit4:junit4]   2> 795 T2111 C86 oasu.DirectUpdateHandler2.deleteAll [collection1] REMOVING ALL DOCUMENTS FROM INDEX
[junit4:junit4]   2> 797 T2111 C86 oasc.SolrDeletionPolicy.onInit SolrDeletionPolicy.onInit: commits:num=1
[junit4:junit4]   2> 		commit{dir=MockDirWrapper(org.apache.lucene.store.RAMDirectory@466af3ed lockFactory=org.apache.lucene.store.SingleInstanceLockFactory@47548dd7),segFN=segments_1,generation=1,filenames=[segments_1]
[junit4:junit4]   2> 797 T2111 C86 oasc.SolrDeletionPolicy.updateCommits newest commit = 1
[junit4:junit4]   2> 797 T2111 C86 UPDATE [collection1] webapp=/solr path=/update params={wt=javabin&version=2} {deleteByQuery=*:*} 0 2
[junit4:junit4]   2> 800 T2081 C83 UPDATE [collection1] webapp=/solr path=/update params={wt=javabin&version=2} {add=[1]} 0 1
[junit4:junit4]   2> 802 T2091 C84 UPDATE [collection1] webapp=/solr path=/update params={wt=javabin&version=2} {add=[1]} 0 1
[junit4:junit4]   2> 804 T2081 C83 UPDATE [collection1] webapp=/solr path=/update params={wt=javabin&version=2} {add=[2]} 0 0
[junit4:junit4]   2> 808 T2101 C85 UPDATE [collection1] webapp=/solr path=/update params={wt=javabin&version=2} {add=[2]} 0 2
[junit4:junit4]   2> 809 T2081 C83 UPDATE [collection1] webapp=/solr path=/update params={wt=javabin&version=2} {add=[3]} 0 0
[junit4:junit4]   2> 811 T2111 C86 UPDATE [collection1] webapp=/solr path=/update params={wt=javabin&version=2} {add=[3]} 0 0
[junit4:junit4]   2> 813 T2081 C83 UPDATE [collection1] webapp=/solr path=/update params={wt=javabin&version=2} {add=[4]} 0 0
[junit4:junit4]   2> 815 T2091 C84 UPDATE [collection1] webapp=/solr path=/update params={wt=javabin&version=2} {add=[4]} 0 0
[junit4:junit4]   2> 816 T2081 C83 UPDATE [collection1] webapp=/solr path=/update params={wt=javabin&version=2} {add=[5]} 0 0
[junit4:junit4]   2> 818 T2101 C85 UPDATE [collection1] webapp=/solr path=/update params={wt=javabin&version=2} {add=[5]} 0 0
[junit4:junit4]   2> 820 T2081 C83 UPDATE [collection1] webapp=/solr path=/update params={wt=javabin&version=2} {add=[6]} 0 0
[junit4:junit4]   2> 821 T2111 C86 UPDATE [collection1] webapp=/solr path=/update params={wt=javabin&version=2} {add=[6]} 0 0
[junit4:junit4]   2> 824 T2081 C83 UPDATE [collection1] webapp=/solr path=/update params={wt=javabin&version=2} {add=[7]} 0 1
[junit4:junit4]   2> 825 T2111 C86 UPDATE [collection1] webapp=/solr path=/update params={wt=javabin&version=2} {add=[7]} 0 0
[junit4:junit4]   2> 827 T2081 C83 oasu.DirectUpdateHandler2.commit start commit{flags=0,version=0,optimize=false,openSearcher=true,waitSearcher=true,expungeDeletes=false,softCommit=false}
[junit4:junit4]   2> 828 T2081 C83 oasc.SolrDeletionPolicy.onCommit SolrDeletionPolicy.onCommit: commits:num=2
[junit4:junit4]   2> 		commit{dir=MockDirWrapper(org.apache.lucene.store.RAMDirectory@388cc906 lockFactory=org.apache.lucene.store.SingleInstanceLockFactory@1488d931),segFN=segments_1,generation=1,filenames=[segments_1]
[junit4:junit4]   2> 		commit{dir=MockDirWrapper(org.apache.lucene.store.RAMDirectory@388cc906 lockFactory=org.apache.lucene.store.SingleInstanceLockFactory@1488d931),segFN=segments_2,generation=2,filenames=[_0_nrm.cfs, _0.fnm, _0_Lucene40_0.tip, _0_Lucene40_0.frq, _0_nrm.cfe, _0.fdt, segments_2, _0.fdx, _0_Lucene40_0.prx, _0.si, _0_Lucene40_0.tim]
[junit4:junit4]   2> 828 T2081 C83 oasc.SolrDeletionPolicy.updateCommits newest commit = 2
[junit4:junit4]   2> 828 T2081 C83 oass.SolrIndexSearcher.<init> Opening Searcher@20af3c40 main
[junit4:junit4]   2> 829 T2081 C83 oass.SolrIndexSearcher.getIndexDir WARNING WARNING: Directory impl does not support setting indexDir: org.apache.lucene.store.MockDirectoryWrapper
[junit4:junit4]   2> 830 T2081 C83 oasu.DirectUpdateHandler2.commit end_commit_flush
[junit4:junit4]   2> 831 T2088 oasc.SolrCore.registerSearcher [collection1] Registered new searcher Searcher@20af3c40 main{StandardDirectoryReader(segments_2:4 _0(5.0):C7)}
[junit4:junit4]   2> 831 T2081 C83 UPDATE [collection1] webapp=/solr path=/update params={version=2&softCommit=false&waitSearcher=true&wt=javabin&commit=true} {commit=} 0 4
[junit4:junit4]   2> 833 T2091 C84 oasu.DirectUpdateHandler2.commit start commit{flags=0,version=0,optimize=false,openSearcher=true,waitSearcher=true,expungeDeletes=false,softCommit=false}
[junit4:junit4]   2> 833 T2091 C84 oasc.SolrDeletionPolicy.onCommit SolrDeletionPolicy.onCommit: commits:num=2
[junit4:junit4]   2> 		commit{dir=MockDirWrapper(org.apache.lucene.store.RAMDirectory@46e09cd1 lockFactory=org.apache.lucene.store.SingleInstanceLockFactory@4d03ae84),segFN=segments_1,generation=1,filenames=[segments_1]
[junit4:junit4]   2> 		commit{dir=MockDirWrapper(org.apache.lucene.store.RAMDirectory@46e09cd1 lockFactory=org.apache.lucene.store.SingleInstanceLockFactory@4d03ae84),segFN=segments_2,generation=2,filenames=[_0_nrm.cfs, _0.fnm, _0_Lucene40_0.tip, _0_Lucene40_0.frq, _0_nrm.cfe, _0.fdt, segments_2, _0.fdx, _0_Lucene40_0.prx, _0.si, _0_Lucene40_0.tim]
[junit4:junit4]   2> 833 T2091 C84 oasc.SolrDeletionPolicy.updateCommits newest commit = 2
[junit4:junit4]   2> 834 T2091 C84 oass.SolrIndexSearcher.<init> Opening Searcher@5af86411 main
[junit4:junit4]   2> 834 T2091 C84 oass.SolrIndexSearcher.getIndexDir WARNING WARNING: Directory impl does not support setting indexDir: org.apache.lucene.store.MockDirectoryWrapper
[junit4:junit4]   2> 834 T2091 C84 oasu.DirectUpdateHandler2.commit end_commit_flush
[junit4:junit4]   2> 835 T2098 oasc.SolrCore.registerSearcher [collection1] Registered new searcher Searcher@5af86411 main{StandardDirectoryReader(segments_2:4 _0(5.0):C2)}
[junit4:junit4]   2> 835 T2091 C84 UPDATE [collection1] webapp=/solr path=/update params={version=2&softCommit=false&waitSearcher=true&wt=javabin&commit=true} {commit=} 0 2
[junit4:junit4]   2> 837 T2101 C85 oasu.DirectUpdateHandler2.commit start commit{flags=0,version=0,optimize=false,openSearcher=true,waitSearcher=true,expungeDeletes=false,softCommit=false}
[junit4:junit4]   2> 850 T2101 C85 oasc.SolrDeletionPolicy.onCommit SolrDeletionPolicy.onCommit: commits:num=2
[junit4:junit4]   2> 		commit{dir=MockDirWrapper(org.apache.lucene.store.RAMDirectory@568bd2f5 lockFactory=org.apache.lucene.store.SingleInstanceLockFactory@5b9d6ea2),segFN=segments_1,generation=1,filenames=[segments_1]
[junit4:junit4]   2> 		commit{dir=MockDirWrapper(org.apache.lucene.store.RAMDirectory@568bd2f5 lockFactory=org.apache.lucene.store.SingleInstanceLockFactory@5b9d6ea2),segFN=segments_2,generation=2,filenames=[_0_nrm.cfs, _0.fnm, _0_Lucene40_0.tip, _0_Lucene40_0.frq, _0_nrm.cfe, _0.fdt, segments_2, _0.fdx, _0_Lucene40_0.prx, _0.si, _0_Lucene40_0.tim]
[junit4:junit4]   2> 850 T2101 C85 oasc.SolrDeletionPolicy.updateCommits newest commit = 2
[junit4:junit4]   2> 851 T2101 C85 oass.SolrIndexSearcher.<init> Opening Searcher@59a32a81 main
[junit4:junit4]   2> 851 T2101 C85 oass.SolrIndexSearcher.getIndexDir WARNING WARNING: Directory impl does not support setting indexDir: org.apache.lucene.store.MockDirectoryWrapper
[junit4:junit4]   2> 851 T2101 C85 oasu.DirectUpdateHandler2.commit end_commit_flush
[junit4:junit4]   2> 851 T2108 oasc.SolrCore.registerSearcher [collection1] Registered new searcher Searcher@59a32a81 main{StandardDirectoryReader(segments_2:4 _0(5.0):C2)}
[junit4:junit4]   2> 851 T2101 C85 UPDATE [collection1] webapp=/solr path=/update params={version=2&softCommit=false&waitSearcher=true&wt=javabin&commit=true} {commit=} 0 14
[junit4:junit4]   2> 853 T2111 C86 oasu.DirectUpdateHandler2.commit start commit{flags=0,version=0,optimize=false,openSearcher=true,waitSearcher=true,expungeDeletes=false,softCommit=false}
[junit4:junit4]   2> 854 T2111 C86 oasc.SolrDeletionPolicy.onCommit SolrDeletionPolicy.onCommit: commits:num=2
[junit4:junit4]   2> 		commit{dir=MockDirWrapper(org.apache.lucene.store.RAMDirectory@466af3ed lockFactory=org.apache.lucene.store.SingleInstanceLockFactory@47548dd7),segFN=segments_1,generation=1,filenames=[segments_1]
[junit4:junit4]   2> 		commit{dir=MockDirWrapper(org.apache.lucene.store.RAMDirectory@466af3ed lockFactory=org.apache.lucene.store.SingleInstanceLockFactory@47548dd7),segFN=segments_2,generation=2,filenames=[_0_nrm.cfs, _0.fnm, _0_Lucene40_0.tip, _0_Lucene40_0.frq, _0_nrm.cfe, _0.fdt, segments_2, _0.fdx, _0_Lucene40_0.prx, _0.si, _0_Lucene40_0.tim]
[junit4:junit4]   2> 854 T2111 C86 oasc.SolrDeletionPolicy.updateCommits newest commit = 2
[junit4:junit4]   2> 855 T2111 C86 oass.SolrIndexSearcher.<init> Opening Searcher@43ac31a5 main
[junit4:junit4]   2> 855 T2111 C86 oass.SolrIndexSearcher.getIndexDir WARNING WARNING: Directory impl does not support setting indexDir: org.apache.lucene.store.MockDirectoryWrapper
[junit4:junit4]   2> 855 T2111 C86 oasu.DirectUpdateHandler2.commit end_commit_flush
[junit4:junit4]   2> 855 T2118 oasc.SolrCore.registerSearcher [collection1] Registered new searcher Searcher@43ac31a5 main{StandardDirectoryReader(segments_2:4 _0(5.0):C3)}
[junit4:junit4]   2> 855 T2111 C86 UPDATE [collection1] webapp=/solr path=/update params={version=2&softCommit=false&waitSearcher=true&wt=javabin&commit=true} {commit=} 0 2
[junit4:junit4]   2> 858 T2081 C83 REQ [collection1] webapp=/solr path=/elevate params={shards.qt=/elevate&wt=javabin&qt=/elevate&fl=id,+score,+[elevated]&distrib=false&sort=id+desc&version=2&q=*:*&rows=500} hits=7 status=0 QTime=1 
[junit4:junit4]   2> 864 T2102 C85 REQ [collection1] webapp=/solr path=/elevate params={shards.qt=/elevate&fsv=true&fl=id,score&sort=id+desc&shard.url=localhost:40302/solr&isShard=true&NOW=1341867674068&q=*:*&rows=500&wt=javabin&qt=/elevate&distrib=false&version=2&start=0} hits=2 status=0 QTime=0 
[junit4:junit4]   2> 865 T2112 C86 REQ [collection1] webapp=/solr path=/elevate params={shards.qt=/elevate&fsv=true&fl=id,score&sort=id+desc&shard.url=localhost:58655/solr|[::1]:33332/solr&isShard=true&NOW=1341867674068&q=*:*&rows=500&wt=javabin&qt=/elevate&distrib=false&version=2&start=0} hits=3 status=0 QTime=0 
[junit4:junit4]   2> 866 T2092 C84 REQ [collection1] webapp=/solr path=/elevate params={shards.qt=/elevate&fsv=true&fl=id,score&sort=id+desc&shard.url=localhost:44819/solr|[::1]:33332/solr&isShard=true&NOW=1341867674068&q=*:*&rows=500&wt=javabin&qt=/elevate&distrib=false&version=2&start=0} hits=2 status=0 QTime=0 
[junit4:junit4]   2> 869 T2102 C85 REQ [collection1] webapp=/solr path=/elevate params={shards.qt=/elevate&fl=id,+score,+[elevated]&shard.url=localhost:40302/solr&isShard=true&NOW=1341867674068&q=*:*&rows=500&wt=javabin&qt=/elevate&distrib=false&ids=2.0,5.0&version=2} status=0 QTime=0 
[junit4:junit4]   2> 869 T2092 C84 REQ [collection1] webapp=/solr path=/elevate params={shards.qt=/elevate&fl=id,+score,+[elevated]&shard.url=localhost:44819/solr|[::1]:33332/solr&isShard=true&NOW=1341867674068&q=*:*&rows=500&wt=javabin&qt=/elevate&distrib=false&ids=4.0,1.0&version=2} status=0 QTime=0 
[junit4:junit4]   2> 869 T2112 C86 REQ [collection1] webapp=/solr path=/elevate params={shards.qt=/elevate&fl=id,+score,+[elevated]&shard.url=localhost:58655/solr|[::1]:33332/solr&isShard=true&NOW=1341867674068&q=*:*&rows=500&wt=javabin&qt=/elevate&distrib=false&ids=7.0,6.0,3.0&version=2} status=0 QTime=0 
[junit4:junit4]   2> 870 T2111 C86 REQ [collection1] webapp=/solr path=/elevate params={shards.qt=/elevate&wt=javabin&qt=/elevate&fl=id,+score,+[elevated]&sort=id+desc&version=2&q=*:*&rows=500&shards=localhost:44819/solr|[::1]:33332/solr,localhost:40302/solr,localhost:58655/solr|[::1]:33332/solr} status=0 QTime=9 
[junit4:junit4]   2> 873 T2078 oas.BaseDistributedSearchTestCase.compareResponses SEVERE Mismatched responses:
[junit4:junit4]   2> 	{responseHeader={status=0,QTime=9,params={shards.qt=/elevate,wt=javabin,qt=/elevate,fl=id, score, [elevated],sort=id desc,version=2,q=*:*,rows=500,shards=localhost:44819/solr|[::1]:33332/solr,localhost:40302/solr,localhost:58655/solr|[::1]:33332/solr}},response={numFound=7,start=0,maxScore=1.0,docs=[SolrDocument{id=7.0, [elevated]=false, score=1.0}, SolrDocument{id=6.0, [elevated]=false, score=1.0}, SolrDocument{id=5.0, [elevated]=false, score=1.0}, SolrDocument{id=4.0, [elevated]=false, score=1.0}, SolrDocument{id=3.0, [elevated]=false, score=1.0}, SolrDocument{id=2.0, [elevated]=false, score=1.0}, SolrDocument{id=1.0, [elevated]=false, score=1.0}]}}
[junit4:junit4]   2> 	{responseHeader={status=0,QTime=1,params={shards.qt=/elevate,wt=javabin,qt=/elevate,fl=id, score, [elevated],distrib=false,sort=id desc,version=2,q=*:*,rows=500}},response={numFound=7,start=0,maxScore=1.0,docs=[SolrDocument{id=7.0, score=1.0, [elevated]=false}, SolrDocument{id=6.0, score=1.0, [elevated]=false}, SolrDocument{id=5.0, score=1.0, [elevated]=false}, SolrDocument{id=4.0, score=1.0, [elevated]=false}, SolrDocument{id=3.0, score=1.0, [elevated]=false}, SolrDocument{id=2.0, score=1.0, [elevated]=false}, SolrDocument{id=1.0, score=1.0, [elevated]=false}]}}
[junit4:junit4]   2> 874 T2078 oasc.CoreContainer.shutdown Shutting down CoreContainer instance=919321224
[junit4:junit4]   2> 875 T2078 oasc.SolrCore.close [collection1]  CLOSING SolrCore org.apache.solr.core.SolrCore@1498c09a
[junit4:junit4]   2> 876 T2078 oasc.SolrCore.closeSearcher [collection1] Closing main searcher on request.
[junit4:junit4]   2> 876 T2078 oasu.DirectUpdateHandler2.close closing DirectUpdateHandler2{commits=1,autocommits=0,soft autocommits=0,optimizes=0,rollbacks=0,expungeDeletes=0,docsPending=0,adds=0,deletesById=0,deletesByQuery=0,errors=0,cumulative_adds=7,cumulative_deletesById=0,cumulative_deletesByQuery=1,cumulative_errors=0}
[junit4:junit4]   2> 880 T2078 oejsh.ContextHandler.doStop stopped o.e.j.s.ServletContextHandler{/solr,null}
[junit4:junit4]   2> 931 T2078 oasc.CoreContainer.shutdown Shutting down CoreContainer instance=401191785
[junit4:junit4]   2> 932 T2078 oasc.SolrCore.close [collection1]  CLOSING SolrCore org.apache.solr.core.SolrCore@670dfb1a
[junit4:junit4]   2> 933 T2078 oasc.SolrCore.closeSearcher [collection1] Closing main searcher on request.
[junit4:junit4]   2> 933 T2078 oasu.DirectUpdateHandler2.close closing DirectUpdateHandler2{commits=1,autocommits=0,soft autocommits=0,optimizes=0,rollbacks=0,expungeDeletes=0,docsPending=0,adds=0,deletesById=0,deletesByQuery=0,errors=0,cumulative_adds=2,cumulative_deletesById=0,cumulative_deletesByQuery=1,cumulative_errors=0}
[junit4:junit4]   2> 936 T2078 oejsh.ContextHandler.doStop stopped o.e.j.s.ServletContextHandler{/solr,null}
[junit4:junit4]   2> 988 T2078 oasc.CoreContainer.shutdown Shutting down CoreContainer instance=277721809
[junit4:junit4]   2> 992 T2078 oasc.SolrCore.close [collection1]  CLOSING SolrCore org.apache.solr.core.SolrCore@1e12974f
[junit4:junit4]   2> 993 T2078 oasc.SolrCore.closeSearcher [collection1] Closing main searcher on request.
[junit4:junit4]   2> 993 T2078 oasu.DirectUpdateHandler2.close closing DirectUpdateHandler2{commits=1,autocommits=0,soft autocommits=0,optimizes=0,rollbacks=0,expungeDeletes=0,docsPending=0,adds=0,deletesById=0,deletesByQuery=0,errors=0,cumulative_adds=2,cumulative_deletesById=0,cumulative_deletesByQuery=1,cumulative_errors=0}
[junit4:junit4]   2> 997 T2078 oejsh.ContextHandler.doStop stopped o.e.j.s.ServletContextHandler{/solr,null}
[junit4:junit4]   2> 1050 T2078 oasc.CoreContainer.shutdown Shutting down CoreContainer instance=2137895968
[junit4:junit4]   2> 1051 T2078 oasc.SolrCore.close [collection1]  CLOSING SolrCore org.apache.solr.core.SolrCore@eb7d2b7
[junit4:junit4]   2> 1052 T2078 oasc.SolrCore.closeSearcher [collection1] Closing main searcher on request.
[junit4:junit4]   2> 1052 T2078 oasu.DirectUpdateHandler2.close closing DirectUpdateHandler2{commits=1,autocommits=0,soft autocommits=0,optimizes=0,rollbacks=0,expungeDeletes=0,docsPending=0,adds=0,deletesById=0,deletesByQuery=0,errors=0,cumulative_adds=3,cumulative_deletesById=0,cumulative_deletesByQuery=1,cumulative_errors=0}
[junit4:junit4]   2> 1055 T2078 oejsh.ContextHandler.doStop stopped o.e.j.s.ServletContextHandler{/solr,null}
[junit4:junit4]   2> 1108 T2078 oas.SolrTestCaseJ4.tearDown ###Ending testDistribSearch
[junit4:junit4]   2> NOTE: reproduce with: ant test  -Dtestcase=DistributedQueryElevationComponentTest -Dtests.method=testDistribSearch -Dtests.seed=262A05D3367AF0EA -Dtests.multiplier=3 -Dtests.slow=true -Dtests.locale=es_CR -Dtests.timezone=US/Central -Dtests.file.encoding=ISO-8859-1
[junit4:junit4]   2>
[junit4:junit4]    > (@AfterClass output)
[junit4:junit4]   2> 1137 T2078 oas.SolrTestCaseJ4.deleteCore ###deleteCore
[junit4:junit4]   2> NOTE: test params are: codec=Lucene40: {}, sim=DefaultSimilarity, locale=es_CR, timezone=US/Central
[junit4:junit4]   2> NOTE: Linux 3.2.0-26-generic amd64/Oracle Corporation 1.8.0-ea (64-bit)/cpus=8,threads=1,free=121175728,total=291569664
[junit4:junit4]   2> NOTE: All tests run in this JVM: [SpellPossibilityIteratorTest, StandardRequestHandlerTest, SolrCoreTest, TestSolrDeletionPolicy1, OverseerTest, TestGreekStemFilterFactory, TestConfig, NotRequiredUniqueKeyTest, TestLRUCache, TestArbitraryIndexDir, TermVectorComponentTest, UpdateParamsTest, PrimUtilsTest, TestNumberUtils, TestCzechStemFilterFactory, TestRangeQuery, TestJapaneseTokenizerFactory, TestHindiFilters, SampleTest, TestShingleFilterFactory, SortByFunctionTest, PolyFieldTest, TestJmxMonitoredMap, FieldAnalysisRequestHandlerTest, TestNGramFilters, TestBinaryResponseWriter, TestStressVersions, TestGermanNormalizationFilterFactory, TestUAX29URLEmailTokenizerFactory, TestCoreContainer, UUIDFieldTest, DebugComponentTest, TestIBSimilarityFactory, DistanceFunctionTest, TestSystemIdResolver, TestPersianNormalizationFilterFactory, TestStressRecovery, TestBeiderMorseFilterFactory, TestGalicianMinimalStemFilterFactory, UniqFieldsUpdateProcessorFactoryTest, TestDocSet, TestGroupingSearch, TestSolrXMLSerializer, LengthFilterTest, TestPluginEnable, LoggingHandlerTest, TestLuceneMatchVersion, FieldMutatingUpdateProcessorTest, TestHungarianLightStemFilterFactory, TestHunspellStemFilterFactory, TestRealTimeGet, TestJapaneseReadingFormFilterFactory, MultiTermTest, CommonGramsFilterFactoryTest, SoftAutoCommitTest, HighlighterConfigTest, MBeansHandlerTest, TestCSVResponseWriter, TestKeywordMarkerFilterFactory, ResourceLoaderTest, URLClassifyProcessorTest, TestPropInjectDefaults, TestFastLRUCache, SpellCheckComponentTest, TestIndexSearcher, TestSuggestSpellingConverter, TestQueryTypes, TestPseudoReturnFields, FullSolrCloudTest, RecoveryZkTest, TestReplicationHandler, LeaderElectionIntegrationTest, LeaderElectionTest, CloudStateUpdateTest, BasicZkTest, TestPhoneticFilterFactory, WordBreakSolrSpellCheckerTest, TestHashPartitioner, StatsComponentTest, IndexBasedSpellCheckerTest, TestMultiCoreConfBootstrap, TestSort, FileBasedSpellCheckerTest, ConvertedLegacyTest, PeerSyncTest, SignatureUpdateProcessorFactoryTest, TestJmxIntegration, HighlighterTest, CoreAdminHandlerTest, TestTrie, DirectSolrConnectionTest, TestRemoteStreaming, CacheHeaderTest, QueryEqualityTest, TestWordDelimiterFilterFactory, TestCSVLoader, SpatialFilterTest, DistributedQueryElevationComponentTest]
[junit4:junit4]   2> 
[junit4:junit4] Completed on J1 in 1.14s, 1 test, 1 failure <<< FAILURES!

[...truncated 322 lines...]
BUILD FAILED
/mnt/ssd/jenkins/workspace/Lucene-Solr-trunk-Linux-Java8-64/checkout/build.xml:29: The following error occurred while executing this line:
/mnt/ssd/jenkins/workspace/Lucene-Solr-trunk-Linux-Java8-64/checkout/solr/build.xml:144: The following error occurred while executing this line:
/mnt/ssd/jenkins/workspace/Lucene-Solr-trunk-Linux-Java8-64/checkout/lucene/module-build.xml:62: The following error occurred while executing this line:
/mnt/ssd/jenkins/workspace/Lucene-Solr-trunk-Linux-Java8-64/checkout/lucene/common-build.xml:1096: The following error occurred while executing this line:
/mnt/ssd/jenkins/workspace/Lucene-Solr-trunk-Linux-Java8-64/checkout/lucene/common-build.xml:793: There were test failures: 290 suites, 1026 tests, 1 failure, 5 ignored

Total time: 18 minutes 9 seconds
Build step 'Execute shell' marked build as failure
Archiving artifacts
Recording test results
Email was triggered for: Failure
Sending email for trigger: Failure




Mime
View raw message