lucene-dev mailing list archives

Site index · List index
Message view « Date » · « Thread »
Top « Date » · « Thread »
From Policeman Jenkins Server <jenk...@sd-datasolutions.de>
Subject [JENKINS] Lucene-Solr-4.x-Windows-Java6-64 - Build # 305 - Still Failing!
Date Wed, 11 Jul 2012 19:37:15 GMT
Build: http://jenkins.sd-datasolutions.de/job/Lucene-Solr-4.x-Windows-Java6-64/305/

1 tests failed.
REGRESSION:  org.apache.solr.spelling.suggest.SuggesterTest.testSuggestions

Error Message:
Exception during query

Stack Trace:
java.lang.RuntimeException: Exception during query
	at __randomizedtesting.SeedInfo.seed([2C23BC868FC05926:8AFF857341F40ED8]:0)
	at org.apache.solr.SolrTestCaseJ4.assertQ(SolrTestCaseJ4.java:487)
	at org.apache.solr.SolrTestCaseJ4.assertQ(SolrTestCaseJ4.java:454)
	at org.apache.solr.spelling.suggest.SuggesterTest.testSuggestions(SuggesterTest.java:71)
	at sun.reflect.NativeMethodAccessorImpl.invoke0(Native Method)
	at sun.reflect.NativeMethodAccessorImpl.invoke(NativeMethodAccessorImpl.java:39)
	at sun.reflect.DelegatingMethodAccessorImpl.invoke(DelegatingMethodAccessorImpl.java:25)
	at java.lang.reflect.Method.invoke(Method.java:597)
	at com.carrotsearch.randomizedtesting.RandomizedRunner.invoke(RandomizedRunner.java:1995)
	at com.carrotsearch.randomizedtesting.RandomizedRunner.access$1100(RandomizedRunner.java:132)
	at com.carrotsearch.randomizedtesting.RandomizedRunner$6.evaluate(RandomizedRunner.java:818)
	at com.carrotsearch.randomizedtesting.RandomizedRunner$7.evaluate(RandomizedRunner.java:877)
	at com.carrotsearch.randomizedtesting.RandomizedRunner$8.evaluate(RandomizedRunner.java:891)
	at com.carrotsearch.randomizedtesting.rules.SystemPropertiesRestoreRule$1.evaluate(SystemPropertiesRestoreRule.java:53)
	at org.apache.lucene.util.TestRuleSetupTeardownChained$1.evaluate(TestRuleSetupTeardownChained.java:50)
	at org.apache.lucene.util.TestRuleFieldCacheSanity$1.evaluate(TestRuleFieldCacheSanity.java:32)
	at org.apache.lucene.util.AbstractBeforeAfterRule$1.evaluate(AbstractBeforeAfterRule.java:45)
	at com.carrotsearch.randomizedtesting.rules.SystemPropertiesInvariantRule$1.evaluate(SystemPropertiesInvariantRule.java:55)
	at org.apache.lucene.util.TestRuleReportUncaughtExceptions$1.evaluate(TestRuleReportUncaughtExceptions.java:68)
	at org.apache.lucene.util.TestRuleThreadAndTestName$1.evaluate(TestRuleThreadAndTestName.java:48)
	at org.apache.lucene.util.TestRuleIgnoreAfterMaxFailures$1.evaluate(TestRuleIgnoreAfterMaxFailures.java:70)
	at org.apache.lucene.util.TestRuleMarkFailure$1.evaluate(TestRuleMarkFailure.java:48)
	at com.carrotsearch.randomizedtesting.RandomizedRunner.runSingleTest(RandomizedRunner.java:825)
	at com.carrotsearch.randomizedtesting.RandomizedRunner.access$700(RandomizedRunner.java:132)
	at com.carrotsearch.randomizedtesting.RandomizedRunner$3$1.run(RandomizedRunner.java:671)
	at com.carrotsearch.randomizedtesting.RandomizedRunner$3.evaluate(RandomizedRunner.java:697)
	at com.carrotsearch.randomizedtesting.RandomizedRunner$4.evaluate(RandomizedRunner.java:736)
	at com.carrotsearch.randomizedtesting.RandomizedRunner$5.evaluate(RandomizedRunner.java:747)
	at com.carrotsearch.randomizedtesting.rules.SystemPropertiesRestoreRule$1.evaluate(SystemPropertiesRestoreRule.java:53)
	at org.apache.lucene.util.AbstractBeforeAfterRule$1.evaluate(AbstractBeforeAfterRule.java:45)
	at org.apache.lucene.util.TestRuleReportUncaughtExceptions$1.evaluate(TestRuleReportUncaughtExceptions.java:68)
	at org.apache.lucene.util.TestRuleStoreClassName$1.evaluate(TestRuleStoreClassName.java:38)
	at org.apache.lucene.util.TestRuleIcuHack$1.evaluate(TestRuleIcuHack.java:51)
	at com.carrotsearch.randomizedtesting.rules.SystemPropertiesInvariantRule$1.evaluate(SystemPropertiesInvariantRule.java:55)
	at org.apache.lucene.util.TestRuleNoInstanceHooksOverrides$1.evaluate(TestRuleNoInstanceHooksOverrides.java:53)
	at org.apache.lucene.util.TestRuleNoStaticHooksShadowing$1.evaluate(TestRuleNoStaticHooksShadowing.java:52)
	at org.apache.lucene.util.TestRuleAssertionsRequired$1.evaluate(TestRuleAssertionsRequired.java:36)
	at org.apache.lucene.util.TestRuleMarkFailure$1.evaluate(TestRuleMarkFailure.java:48)
	at org.apache.lucene.util.TestRuleIgnoreAfterMaxFailures$1.evaluate(TestRuleIgnoreAfterMaxFailures.java:70)
	at org.apache.lucene.util.TestRuleIgnoreTestSuites$1.evaluate(TestRuleIgnoreTestSuites.java:55)
	at com.carrotsearch.randomizedtesting.RandomizedRunner.runSuite(RandomizedRunner.java:605)
	at com.carrotsearch.randomizedtesting.RandomizedRunner.access$400(RandomizedRunner.java:132)
	at com.carrotsearch.randomizedtesting.RandomizedRunner$2.run(RandomizedRunner.java:551)
Caused by: java.lang.RuntimeException: REQUEST FAILED: xpath=//lst[@name='spellcheck']/lst[@name='suggestions']/lst[@name='ac']/int[@name='numFound'][.='2']
	xml response was: <?xml version="1.0" encoding="UTF-8"?>
<response>
<lst name="responseHeader"><int name="status">0</int><int name="QTime">0</int></lst><lst
name="spellcheck"><lst name="suggestions"/></lst>
</response>

	request was:q=ac&spellcheck.count=2&qt=/suggest&spellcheck.onlyMorePopular=true
	at org.apache.solr.SolrTestCaseJ4.assertQ(SolrTestCaseJ4.java:480)
	... 41 more




Build Log:
[...truncated 10398 lines...]
[junit4:junit4] Suite: org.apache.solr.spelling.suggest.SuggesterTest
[junit4:junit4]    > (@BeforeClass output)
[junit4:junit4]   2> 0 T3070 oas.SolrTestCaseJ4.initCore ####initCore
[junit4:junit4]   2> Creating dataDir: C:\Jenkins\workspace\Lucene-Solr-4.x-Windows-Java6-64\solr\build\solr-core\test\J0\.\solrtest-SuggesterTest-1342035335430
[junit4:junit4]   2> 3 T3070 oasc.SolrResourceLoader.<init> new SolrResourceLoader
for directory: 'C:\Jenkins\workspace\Lucene-Solr-4.x-Windows-Java6-64\solr\build\solr-core\test-files\solr\collection1\'
[junit4:junit4]   2> 3 T3070 oasc.SolrResourceLoader.replaceClassLoader Adding 'file:/C:/Jenkins/workspace/Lucene-Solr-4.x-Windows-Java6-64/solr/build/solr-core/test-files/solr/collection1/lib/classes/'
to classloader
[junit4:junit4]   2> 3 T3070 oasc.SolrResourceLoader.replaceClassLoader Adding 'file:/C:/Jenkins/workspace/Lucene-Solr-4.x-Windows-Java6-64/solr/build/solr-core/test-files/solr/collection1/lib/README'
to classloader
[junit4:junit4]   2> 65 T3070 oasc.SolrConfig.<init> Using Lucene MatchVersion: LUCENE_40
[junit4:junit4]   2> 189 T3070 oasc.SolrConfig.<init> Loaded SolrConfig: solrconfig-spellchecker.xml
[junit4:junit4]   2> 189 T3070 oass.IndexSchema.readSchema Reading Solr Schema
[junit4:junit4]   2> 194 T3070 oass.IndexSchema.readSchema Schema name=Solr SpellCheck
Test
[junit4:junit4]   2> 266 T3070 oass.IndexSchema.readSchema default search field in schema
is text
[junit4:junit4]   2> 270 T3070 oass.IndexSchema.readSchema query parser default operator
is OR
[junit4:junit4]   2> 273 T3070 oass.IndexSchema.readSchema unique key field: id
[junit4:junit4]   2> 280 T3070 oasc.SolrResourceLoader.locateSolrHome JNDI not configured
for solr (NoInitialContextEx)
[junit4:junit4]   2> 280 T3070 oasc.SolrResourceLoader.locateSolrHome using system property
solr.solr.home: C:\Jenkins\workspace\Lucene-Solr-4.x-Windows-Java6-64\solr\build\solr-core\test-files\solr
[junit4:junit4]   2> 280 T3070 oasc.SolrResourceLoader.<init> new SolrResourceLoader
for directory: 'C:\Jenkins\workspace\Lucene-Solr-4.x-Windows-Java6-64\solr\build\solr-core\test-files\solr\'
[junit4:junit4]   2> 280 T3070 oasc.CoreContainer.<init> New CoreContainer 1521597967
[junit4:junit4]   2> 280 T3070 oasc.SolrCore.<init> [collection1] Opening new SolrCore
at C:\Jenkins\workspace\Lucene-Solr-4.x-Windows-Java6-64\solr\build\solr-core\test-files\solr\collection1\,
dataDir=C:\Jenkins\workspace\Lucene-Solr-4.x-Windows-Java6-64\solr\build\solr-core\test\J0\.\solrtest-SuggesterTest-1342035335430\
[junit4:junit4]   2> 281 T3070 oasc.SolrCore.<init> JMX monitoring not detected for
core: collection1
[junit4:junit4]   2> 281 T3070 oasc.SolrCore.getNewIndexDir WARNING New index directory
detected: old=null new=C:\Jenkins\workspace\Lucene-Solr-4.x-Windows-Java6-64\solr\build\solr-core\test\J0\.\solrtest-SuggesterTest-1342035335430\index/
[junit4:junit4]   2> 282 T3070 oasc.SolrCore.initIndex WARNING [collection1] Solr index
directory 'C:\Jenkins\workspace\Lucene-Solr-4.x-Windows-Java6-64\solr\build\solr-core\test\J0\.\solrtest-SuggesterTest-1342035335430\index'
doesn't exist. Creating new index...
[junit4:junit4]   2> 293 T3070 oasc.SolrDeletionPolicy.onCommit SolrDeletionPolicy.onCommit:
commits:num=1
[junit4:junit4]   2> 		commit{dir=MockDirWrapper(NRTCachingDirectory(org.apache.lucene.store.MMapDirectory@C:\Jenkins\workspace\Lucene-Solr-4.x-Windows-Java6-64\solr\build\solr-core\test\J0\solrtest-SuggesterTest-1342035335430\index
lockFactory=org.apache.lucene.store.NativeFSLockFactory@2645b48a; maxCacheMB=0.4638671875
maxMergeSizeMB=0.791015625)),segFN=segments_1,generation=1,filenames=[segments_1]
[junit4:junit4]   2> 293 T3070 oasc.SolrDeletionPolicy.updateCommits newest commit = 1
[junit4:junit4]   2> 298 T3070 oasc.RequestHandlers.initHandlersFromConfig created standard:
solr.StandardRequestHandler
[junit4:junit4]   2> 298 T3070 oasc.RequestHandlers.initHandlersFromConfig created /suggest:
org.apache.solr.handler.component.SearchHandler
[junit4:junit4]   2> 298 T3070 oasc.RequestHandlers.initHandlersFromConfig created /suggest_tst:
org.apache.solr.handler.component.SearchHandler
[junit4:junit4]   2> 300 T3070 oasc.RequestHandlers.initHandlersFromConfig created /suggest_fst:
org.apache.solr.handler.component.SearchHandler
[junit4:junit4]   2> 300 T3070 oasc.RequestHandlers.initHandlersFromConfig created /suggest_wfst:
org.apache.solr.handler.component.SearchHandler
[junit4:junit4]   2> 310 T3070 oass.SolrIndexSearcher.<init> Opening Searcher@2ebffd2b
main
[junit4:junit4]   2> 310 T3070 oass.SolrIndexSearcher.getIndexDir WARNING WARNING: Directory
impl does not support setting indexDir: org.apache.lucene.store.MockDirectoryWrapper
[junit4:junit4]   2> 312 T3070 oasu.CommitTracker.<init> Hard AutoCommit: disabled
[junit4:junit4]   2> 312 T3070 oasu.CommitTracker.<init> Soft AutoCommit: disabled
[junit4:junit4]   2> 312 T3070 oashc.SpellCheckComponent.inform Initializing spell checkers
[junit4:junit4]   2> 312 T3070 oasss.Suggester.init init: {name=suggest,classname=org.apache.solr.spelling.suggest.Suggester,lookupImpl=org.apache.solr.spelling.suggest.jaspell.JaspellLookup,field=suggest,storeDir=suggest,buildOnCommit=true,threshold=0.0}
[junit4:junit4]   2> 313 T3070 oasssj.JaspellLookupFactory.create init: {name=suggest,classname=org.apache.solr.spelling.suggest.Suggester,lookupImpl=org.apache.solr.spelling.suggest.jaspell.JaspellLookup,field=suggest,storeDir=suggest,buildOnCommit=true,threshold=0.0}
[junit4:junit4]   2> 314 T3070 oashc.SpellCheckComponent.inform Registering newSearcher
listener for spellchecker: suggest
[junit4:junit4]   2> 314 T3070 oashc.SpellCheckComponent.inform No queryConverter defined,
using default converter
[junit4:junit4]   2> 314 T3070 oashc.SpellCheckComponent.inform Initializing spell checkers
[junit4:junit4]   2> 314 T3070 oasss.Suggester.init init: {name=suggest_tst,classname=org.apache.solr.spelling.suggest.Suggester,lookupImpl=org.apache.solr.spelling.suggest.tst.TSTLookup,field=suggest,storeDir=suggest_tst,buildOnCommit=true,threshold=0.0}
[junit4:junit4]   2> 314 T3070 oashc.SpellCheckComponent.inform Registering newSearcher
listener for spellchecker: suggest_tst
[junit4:junit4]   2> 316 T3070 oashc.SpellCheckComponent.inform No queryConverter defined,
using default converter
[junit4:junit4]   2> 316 T3070 oashc.SpellCheckComponent.inform Initializing spell checkers
[junit4:junit4]   2> 316 T3070 oasss.Suggester.init init: {name=suggest_fst,classname=org.apache.solr.spelling.suggest.Suggester,lookupImpl=org.apache.solr.spelling.suggest.fst.FSTLookup,field=suggest,storeDir=suggest_fst,buildOnCommit=true,weightBuckets=5,exactMatchFirst=true}
[junit4:junit4]   2> 318 T3070 oashc.SpellCheckComponent.inform Registering newSearcher
listener for spellchecker: suggest_fst
[junit4:junit4]   2> 318 T3070 oashc.SpellCheckComponent.inform No queryConverter defined,
using default converter
[junit4:junit4]   2> 318 T3070 oashc.SpellCheckComponent.inform Initializing spell checkers
[junit4:junit4]   2> 318 T3070 oasss.Suggester.init init: {name=suggest_wfst,classname=org.apache.solr.spelling.suggest.Suggester,lookupImpl=org.apache.solr.spelling.suggest.fst.WFSTLookupFactory,field=suggest,storeDir=suggest_wfst,buildOnCommit=true,exactMatchFirst=true}
[junit4:junit4]   2> 320 T3070 oashc.SpellCheckComponent.inform Registering newSearcher
listener for spellchecker: suggest_wfst
[junit4:junit4]   2> 320 T3070 oashc.SpellCheckComponent.inform No queryConverter defined,
using default converter
[junit4:junit4]   2> 321 T3070 oashc.HttpShardHandlerFactory.getParameter Setting socketTimeout
to: 0
[junit4:junit4]   2> 321 T3070 oashc.HttpShardHandlerFactory.getParameter Setting urlScheme
to: http://
[junit4:junit4]   2> 321 T3070 oashc.HttpShardHandlerFactory.getParameter Setting connTimeout
to: 0
[junit4:junit4]   2> 321 T3070 oashc.HttpShardHandlerFactory.getParameter Setting maxConnectionsPerHost
to: 20
[junit4:junit4]   2> 321 T3070 oashc.HttpShardHandlerFactory.getParameter Setting corePoolSize
to: 0
[junit4:junit4]   2> 321 T3070 oashc.HttpShardHandlerFactory.getParameter Setting maximumPoolSize
to: 2147483647
[junit4:junit4]   2> 322 T3070 oashc.HttpShardHandlerFactory.getParameter Setting maxThreadIdleTime
to: 5
[junit4:junit4]   2> 322 T3070 oashc.HttpShardHandlerFactory.getParameter Setting sizeOfQueue
to: -1
[junit4:junit4]   2> 322 T3070 oashc.HttpShardHandlerFactory.getParameter Setting fairnessPolicy
to: false
[junit4:junit4]   2> 322 T3070 oascsi.HttpClientUtil.createClient Creating new http client,
config:maxConnectionsPerHost=20&maxConnections=10000&socketTimeout=0&connTimeout=0&retry=false
[junit4:junit4]   2> 332 T3070 oasc.CoreContainer.register registering core: collection1
[junit4:junit4]   2> 333 T3070 oas.SolrTestCaseJ4.initCore ####initCore end
[junit4:junit4]   2> 
[junit4:junit4] ERROR   0.23s | SuggesterTest.testSuggestions
[junit4:junit4]    > Throwable #1: java.lang.RuntimeException: Exception during query
[junit4:junit4]    > 	at __randomizedtesting.SeedInfo.seed([2C23BC868FC05926:8AFF857341F40ED8]:0)
[junit4:junit4]    > 	at org.apache.solr.SolrTestCaseJ4.assertQ(SolrTestCaseJ4.java:487)
[junit4:junit4]    > 	at org.apache.solr.SolrTestCaseJ4.assertQ(SolrTestCaseJ4.java:454)
[junit4:junit4]    > 	at org.apache.solr.spelling.suggest.SuggesterTest.testSuggestions(SuggesterTest.java:71)
[junit4:junit4]    > 	at sun.reflect.NativeMethodAccessorImpl.invoke0(Native Method)
[junit4:junit4]    > 	at sun.reflect.NativeMethodAccessorImpl.invoke(NativeMethodAccessorImpl.java:39)
[junit4:junit4]    > 	at sun.reflect.DelegatingMethodAccessorImpl.invoke(DelegatingMethodAccessorImpl.java:25)
[junit4:junit4]    > 	at java.lang.reflect.Method.invoke(Method.java:597)
[junit4:junit4]    > 	at com.carrotsearch.randomizedtesting.RandomizedRunner.invoke(RandomizedRunner.java:1995)
[junit4:junit4]    > 	at com.carrotsearch.randomizedtesting.RandomizedRunner.access$1100(RandomizedRunner.java:132)
[junit4:junit4]    > 	at com.carrotsearch.randomizedtesting.RandomizedRunner$6.evaluate(RandomizedRunner.java:818)
[junit4:junit4]    > 	at com.carrotsearch.randomizedtesting.RandomizedRunner$7.evaluate(RandomizedRunner.java:877)
[junit4:junit4]    > 	at com.carrotsearch.randomizedtesting.RandomizedRunner$8.evaluate(RandomizedRunner.java:891)
[junit4:junit4]    > 	at com.carrotsearch.randomizedtesting.rules.SystemPropertiesRestoreRule$1.evaluate(SystemPropertiesRestoreRule.java:53)
[junit4:junit4]    > 	at org.apache.lucene.util.TestRuleSetupTeardownChained$1.evaluate(TestRuleSetupTeardownChained.java:50)
[junit4:junit4]    > 	at org.apache.lucene.util.TestRuleFieldCacheSanity$1.evaluate(TestRuleFieldCacheSanity.java:32)
[junit4:junit4]    > 	at org.apache.lucene.util.AbstractBeforeAfterRule$1.evaluate(AbstractBeforeAfterRule.java:45)
[junit4:junit4]    > 	at com.carrotsearch.randomizedtesting.rules.SystemPropertiesInvariantRule$1.evaluate(SystemPropertiesInvariantRule.java:55)
[junit4:junit4]    > 	at org.apache.lucene.util.TestRuleReportUncaughtExceptions$1.evaluate(TestRuleReportUncaughtExceptions.java:68)
[junit4:junit4]    > 	at org.apache.lucene.util.TestRuleThreadAndTestName$1.evaluate(TestRuleThreadAndTestName.java:48)
[junit4:junit4]    > 	at org.apache.lucene.util.TestRuleIgnoreAfterMaxFailures$1.evaluate(TestRuleIgnoreAfterMaxFailures.java:70)
[junit4:junit4]    > 	at org.apache.lucene.util.TestRuleMarkFailure$1.evaluate(TestRuleMarkFailure.java:48)
[junit4:junit4]    > 	at com.carrotsearch.randomizedtesting.RandomizedRunner.runSingleTest(RandomizedRunner.java:825)
[junit4:junit4]    > 	at com.carrotsearch.randomizedtesting.RandomizedRunner.access$700(RandomizedRunner.java:132)
[junit4:junit4]    > 	at com.carrotsearch.randomizedtesting.RandomizedRunner$3$1.run(RandomizedRunner.java:671)
[junit4:junit4]    > 	at com.carrotsearch.randomizedtesting.RandomizedRunner$3.evaluate(RandomizedRunner.java:697)
[junit4:junit4]    > 	at com.carrotsearch.randomizedtesting.RandomizedRunner$4.evaluate(RandomizedRunner.java:736)
[junit4:junit4]    > 	at com.carrotsearch.randomizedtesting.RandomizedRunner$5.evaluate(RandomizedRunner.java:747)
[junit4:junit4]    > 	at com.carrotsearch.randomizedtesting.rules.SystemPropertiesRestoreRule$1.evaluate(SystemPropertiesRestoreRule.java:53)
[junit4:junit4]    > 	at org.apache.lucene.util.AbstractBeforeAfterRule$1.evaluate(AbstractBeforeAfterRule.java:45)
[junit4:junit4]    > 	at org.apache.lucene.util.TestRuleReportUncaughtExceptions$1.evaluate(TestRuleReportUncaughtExceptions.java:68)
[junit4:junit4]    > 	at org.apache.lucene.util.TestRuleStoreClassName$1.evaluate(TestRuleStoreClassName.java:38)
[junit4:junit4]    > 	at org.apache.lucene.util.TestRuleIcuHack$1.evaluate(TestRuleIcuHack.java:51)
[junit4:junit4]    > 	at com.carrotsearch.randomizedtesting.rules.SystemPropertiesInvariantRule$1.evaluate(SystemPropertiesInvariantRule.java:55)
[junit4:junit4]    > 	at org.apache.lucene.util.TestRuleNoInstanceHooksOverrides$1.evaluate(TestRuleNoInstanceHooksOverrides.java:53)
[junit4:junit4]    > 	at org.apache.lucene.util.TestRuleNoStaticHooksShadowing$1.evaluate(TestRuleNoStaticHooksShadowing.java:52)
[junit4:junit4]    > 	at org.apache.lucene.util.TestRuleAssertionsRequired$1.evaluate(TestRuleAssertionsRequired.java:36)
[junit4:junit4]    > 	at org.apache.lucene.util.TestRuleMarkFailure$1.evaluate(TestRuleMarkFailure.java:48)
[junit4:junit4]    > 	at org.apache.lucene.util.TestRuleIgnoreAfterMaxFailures$1.evaluate(TestRuleIgnoreAfterMaxFailures.java:70)
[junit4:junit4]    > 	at org.apache.lucene.util.TestRuleIgnoreTestSuites$1.evaluate(TestRuleIgnoreTestSuites.java:55)
[junit4:junit4]    > 	at com.carrotsearch.randomizedtesting.RandomizedRunner.runSuite(RandomizedRunner.java:605)
[junit4:junit4]    > 	at com.carrotsearch.randomizedtesting.RandomizedRunner.access$400(RandomizedRunner.java:132)
[junit4:junit4]    > 	at com.carrotsearch.randomizedtesting.RandomizedRunner$2.run(RandomizedRunner.java:551)
[junit4:junit4]    > Caused by: java.lang.RuntimeException: REQUEST FAILED: xpath=//lst[@name='spellcheck']/lst[@name='suggestions']/lst[@name='ac']/int[@name='numFound'][.='2']
[junit4:junit4]    > 	xml response was: <?xml version="1.0" encoding="UTF-8"?>
[junit4:junit4]    > <response>
[junit4:junit4]    > <lst name="responseHeader"><int name="status">0</int><int
name="QTime">0</int></lst><lst name="spellcheck"><lst name="suggestions"/></lst>
[junit4:junit4]    > </response>
[junit4:junit4]    > 
[junit4:junit4]    > 	request was:q=ac&spellcheck.count=2&qt=/suggest&spellcheck.onlyMorePopular=true
[junit4:junit4]    > 	at org.apache.solr.SolrTestCaseJ4.assertQ(SolrTestCaseJ4.java:480)
[junit4:junit4]    > 	... 41 more
[junit4:junit4]    > 
[junit4:junit4]   2> 345 T3070 oas.SolrTestCaseJ4.setUp ###Starting testSuggestions
[junit4:junit4]   2> ASYNC  NEW_CORE C229 name=collection1 org.apache.solr.core.SolrCore@4bd5e61d
[junit4:junit4]   2> 440 T3070 C229 oasc.SolrDeletionPolicy.onInit SolrDeletionPolicy.onInit:
commits:num=1
[junit4:junit4]   2> 		commit{dir=MockDirWrapper(NRTCachingDirectory(org.apache.lucene.store.MMapDirectory@C:\Jenkins\workspace\Lucene-Solr-4.x-Windows-Java6-64\solr\build\solr-core\test\J0\solrtest-SuggesterTest-1342035335430\index
lockFactory=org.apache.lucene.store.NativeFSLockFactory@2645b48a; maxCacheMB=0.4638671875
maxMergeSizeMB=0.791015625)),segFN=segments_1,generation=1,filenames=[segments_1]
[junit4:junit4]   2> 441 T3070 C229 oasc.SolrDeletionPolicy.updateCommits newest commit
= 1
[junit4:junit4]   2> 443 T3070 C229 UPDATE [collection1] webapp=null path=null params={}
{add=[1]} 0 89
[junit4:junit4]   2> 457 T3070 C229 UPDATE [collection1] webapp=null path=null params={}
{add=[2]} 0 0
[junit4:junit4]   2> 478 T3070 C229 UPDATE [collection1] webapp=null path=null params={}
{add=[3]} 0 0
[junit4:junit4]   2> 490 T3070 C229 oasu.DirectUpdateHandler2.commit start commit{flags=0,version=0,optimize=false,openSearcher=true,waitSearcher=true,expungeDeletes=false,softCommit=false}
[junit4:junit4]   2> 519 T3070 C229 oasc.SolrDeletionPolicy.onCommit SolrDeletionPolicy.onCommit:
commits:num=2
[junit4:junit4]   2> 		commit{dir=MockDirWrapper(NRTCachingDirectory(org.apache.lucene.store.MMapDirectory@C:\Jenkins\workspace\Lucene-Solr-4.x-Windows-Java6-64\solr\build\solr-core\test\J0\solrtest-SuggesterTest-1342035335430\index
lockFactory=org.apache.lucene.store.NativeFSLockFactory@2645b48a; maxCacheMB=0.4638671875
maxMergeSizeMB=0.791015625)),segFN=segments_1,generation=1,filenames=[segments_1]
[junit4:junit4]   2> 		commit{dir=MockDirWrapper(NRTCachingDirectory(org.apache.lucene.store.MMapDirectory@C:\Jenkins\workspace\Lucene-Solr-4.x-Windows-Java6-64\solr\build\solr-core\test\J0\solrtest-SuggesterTest-1342035335430\index
lockFactory=org.apache.lucene.store.NativeFSLockFactory@2645b48a; maxCacheMB=0.4638671875
maxMergeSizeMB=0.791015625)),segFN=segments_2,generation=2,filenames=[_0.tis, _0.nrm, _0.fnm,
_0.tii, _0.frq, segments_2, _0.fdx, _0.si, _0.prx, _0.fdt]
[junit4:junit4]   2> 519 T3070 C229 oasc.SolrDeletionPolicy.updateCommits newest commit
= 2
[junit4:junit4]   2> 520 T2253 oaz.ClientCnxn$SendThread.startConnect Opening socket connection
to server 127.0.0.1/127.0.0.1:54639
[junit4:junit4]   2> 520 T3070 C229 oasc.SolrCore.getSearcher WARNING [collection1] PERFORMANCE
WARNING: Overlapping onDeckSearchers=2
[junit4:junit4]   2> 542 T3070 C229 oass.SolrIndexSearcher.<init> Opening Searcher@31de453c
main
[junit4:junit4]   2> 542 T3070 C229 oass.SolrIndexSearcher.getIndexDir WARNING WARNING:
Directory impl does not support setting indexDir: org.apache.lucene.store.MockDirectoryWrapper
[junit4:junit4]   2> 543 T3070 C229 oasu.DirectUpdateHandler2.commit end_commit_flush
[junit4:junit4]   2> 543 T3071 oasc.SolrCore.registerSearcher [collection1] Registered
new searcher Searcher@2ebffd2b main{StandardDirectoryReader(segments_1:1)}
[junit4:junit4]   2> 543 T3071 oashc.SpellCheckComponent$SpellCheckerListener.newSearcher
Loading spell index for spellchecker: suggest
[junit4:junit4]   2> 543 T3071 oasss.Suggester.reload reload()
[junit4:junit4]   2> 543 T3071 oashc.SpellCheckComponent$SpellCheckerListener.newSearcher
SEVERE Exception in reloading spell check index for spellchecker: suggest java.io.FileNotFoundException:
C:\Jenkins\workspace\Lucene-Solr-4.x-Windows-Java6-64\solr\build\solr-core\test\J0\.\solrtest-SuggesterTest-1342035335430\suggest\jaspell.dat
(The system cannot find the file specified)
[junit4:junit4]   2> 	at java.io.FileInputStream.open(Native Method)
[junit4:junit4]   2> 	at java.io.FileInputStream.<init>(FileInputStream.java:120)
[junit4:junit4]   2> 	at org.apache.solr.spelling.suggest.Suggester.reload(Suggester.java:164)
[junit4:junit4]   2> 	at org.apache.solr.handler.component.SpellCheckComponent$SpellCheckerListener.newSearcher(SpellCheckComponent.java:673)
[junit4:junit4]   2> 	at org.apache.solr.core.SolrCore$4.call(SolrCore.java:1399)
[junit4:junit4]   2> 	at java.util.concurrent.FutureTask$Sync.innerRun(FutureTask.java:303)
[junit4:junit4]   2> 	at java.util.concurrent.FutureTask.run(FutureTask.java:138)
[junit4:junit4]   2> 	at java.util.concurrent.ThreadPoolExecutor$Worker.runTask(ThreadPoolExecutor.java:886)
[junit4:junit4]   2> 	at java.util.concurrent.ThreadPoolExecutor$Worker.run(ThreadPoolExecutor.java:908)
[junit4:junit4]   2> 	at java.lang.Thread.run(Thread.java:662)
[junit4:junit4]   2> 
[junit4:junit4]   2> 544 T3071 oashc.SpellCheckComponent$SpellCheckerListener.newSearcher
Loading spell index for spellchecker: suggest_tst
[junit4:junit4]   2> 544 T3071 oasss.Suggester.reload reload()
[junit4:junit4]   2> 544 T3071 oashc.SpellCheckComponent$SpellCheckerListener.newSearcher
SEVERE Exception in reloading spell check index for spellchecker: suggest_tst java.io.FileNotFoundException:
C:\Jenkins\workspace\Lucene-Solr-4.x-Windows-Java6-64\solr\build\solr-core\test\J0\.\solrtest-SuggesterTest-1342035335430\suggest_tst\tst.dat
(The system cannot find the file specified)
[junit4:junit4]   2> 	at java.io.FileInputStream.open(Native Method)
[junit4:junit4]   2> 	at java.io.FileInputStream.<init>(FileInputStream.java:120)
[junit4:junit4]   2> 	at org.apache.solr.spelling.suggest.Suggester.reload(Suggester.java:164)
[junit4:junit4]   2> 	at org.apache.solr.handler.component.SpellCheckComponent$SpellCheckerListener.newSearcher(SpellCheckComponent.java:673)
[junit4:junit4]   2> 	at org.apache.solr.core.SolrCore$4.call(SolrCore.java:1399)
[junit4:junit4]   2> 	at java.util.concurrent.FutureTask$Sync.innerRun(FutureTask.java:303)
[junit4:junit4]   2> 	at java.util.concurrent.FutureTask.run(FutureTask.java:138)
[junit4:junit4]   2> 	at java.util.concurrent.ThreadPoolExecutor$Worker.runTask(ThreadPoolExecutor.java:886)
[junit4:junit4]   2> 	at java.util.concurrent.ThreadPoolExecutor$Worker.run(ThreadPoolExecutor.java:908)
[junit4:junit4]   2> 	at java.lang.Thread.run(Thread.java:662)
[junit4:junit4]   2> 
[junit4:junit4]   2> 546 T3071 oashc.SpellCheckComponent$SpellCheckerListener.newSearcher
Loading spell index for spellchecker: suggest_fst
[junit4:junit4]   2> 546 T3071 oasss.Suggester.reload reload()
[junit4:junit4]   2> 546 T3071 oashc.SpellCheckComponent$SpellCheckerListener.newSearcher
SEVERE Exception in reloading spell check index for spellchecker: suggest_fst java.io.FileNotFoundException:
C:\Jenkins\workspace\Lucene-Solr-4.x-Windows-Java6-64\solr\build\solr-core\test\J0\.\solrtest-SuggesterTest-1342035335430\suggest_fst\fst.bin
(The system cannot find the file specified)
[junit4:junit4]   2> 	at java.io.FileInputStream.open(Native Method)
[junit4:junit4]   2> 	at java.io.FileInputStream.<init>(FileInputStream.java:120)
[junit4:junit4]   2> 	at org.apache.solr.spelling.suggest.Suggester.reload(Suggester.java:164)
[junit4:junit4]   2> 	at org.apache.solr.handler.component.SpellCheckComponent$SpellCheckerListener.newSearcher(SpellCheckComponent.java:673)
[junit4:junit4]   2> 	at org.apache.solr.core.SolrCore$4.call(SolrCore.java:1399)
[junit4:junit4]   2> 	at java.util.concurrent.FutureTask$Sync.innerRun(FutureTask.java:303)
[junit4:junit4]   2> 	at java.util.concurrent.FutureTask.run(FutureTask.java:138)
[junit4:junit4]   2> 	at java.util.concurrent.ThreadPoolExecutor$Worker.runTask(ThreadPoolExecutor.java:886)
[junit4:junit4]   2> 	at java.util.concurrent.ThreadPoolExecutor$Worker.run(ThreadPoolExecutor.java:908)
[junit4:junit4]   2> 	at java.lang.Thread.run(Thread.java:662)
[junit4:junit4]   2> 
[junit4:junit4]   2> 547 T3071 oashc.SpellCheckComponent$SpellCheckerListener.newSearcher
Loading spell index for spellchecker: suggest_wfst
[junit4:junit4]   2> 547 T3071 oasss.Suggester.reload reload()
[junit4:junit4]   2> 547 T3071 oashc.SpellCheckComponent$SpellCheckerListener.newSearcher
SEVERE Exception in reloading spell check index for spellchecker: suggest_wfst java.io.FileNotFoundException:
C:\Jenkins\workspace\Lucene-Solr-4.x-Windows-Java6-64\solr\build\solr-core\test\J0\.\solrtest-SuggesterTest-1342035335430\suggest_wfst\wfst.bin
(The system cannot find the file specified)
[junit4:junit4]   2> 	at java.io.FileInputStream.open(Native Method)
[junit4:junit4]   2> 	at java.io.FileInputStream.<init>(FileInputStream.java:120)
[junit4:junit4]   2> 	at org.apache.solr.spelling.suggest.Suggester.reload(Suggester.java:164)
[junit4:junit4]   2> 	at org.apache.solr.handler.component.SpellCheckComponent$SpellCheckerListener.newSearcher(SpellCheckComponent.java:673)
[junit4:junit4]   2> 	at org.apache.solr.core.SolrCore$4.call(SolrCore.java:1399)
[junit4:junit4]   2> 	at java.util.concurrent.FutureTask$Sync.innerRun(FutureTask.java:303)
[junit4:junit4]   2> 	at java.util.concurrent.FutureTask.run(FutureTask.java:138)
[junit4:junit4]   2> 	at java.util.concurrent.ThreadPoolExecutor$Worker.runTask(ThreadPoolExecutor.java:886)
[junit4:junit4]   2> 	at java.util.concurrent.ThreadPoolExecutor$Worker.run(ThreadPoolExecutor.java:908)
[junit4:junit4]   2> 	at java.lang.Thread.run(Thread.java:662)
[junit4:junit4]   2> 
[junit4:junit4]   2> 555 T3071 oasc.SolrCore.registerSearcher [collection1] Registered
new searcher Searcher@31de453c main{StandardDirectoryReader(segments_2:3 _0(4.0):C3)}
[junit4:junit4]   2> 556 T3070 C229 UPDATE [collection1] webapp=null path=null params={}
{commit=} 0 66
[junit4:junit4]   2> 558 T3070 C229 REQ [collection1] webapp=null path=null params={q=ac&spellcheck.count=2&qt=/suggest&spellcheck.onlyMorePopular=true}
status=0 QTime=0 
[junit4:junit4]   2> 561 T3070 oas.SolrTestCaseJ4.assertQ SEVERE REQUEST FAILED: xpath=//lst[@name='spellcheck']/lst[@name='suggestions']/lst[@name='ac']/int[@name='numFound'][.='2']
[junit4:junit4]   2> 		xml response was: <?xml version="1.0" encoding="UTF-8"?>
[junit4:junit4]   2> 	<response>
[junit4:junit4]   2> 	<lst name="responseHeader"><int name="status">0</int><int
name="QTime">0</int></lst><lst name="spellcheck"><lst name="suggestions"/></lst>
[junit4:junit4]   2> 	</response>
[junit4:junit4]   2> 	
[junit4:junit4]   2> 		request was:q=ac&spellcheck.count=2&qt=/suggest&spellcheck.onlyMorePopular=true
[junit4:junit4]   2> 562 T3070 oasc.SolrException.log SEVERE REQUEST FAILED: q=ac&spellcheck.count=2&qt=/suggest&spellcheck.onlyMorePopular=true:java.lang.RuntimeException:
REQUEST FAILED: xpath=//lst[@name='spellcheck']/lst[@name='suggestions']/lst[@name='ac']/int[@name='numFound'][.='2']
[junit4:junit4]   2> 		xml response was: <?xml version="1.0" encoding="UTF-8"?>
[junit4:junit4]   2> 	<response>
[junit4:junit4]   2> 	<lst name="responseHeader"><int name="status">0</int><int
name="QTime">0</int></lst><lst name="spellcheck"><lst name="suggestions"/></lst>
[junit4:junit4]   2> 	</response>
[junit4:junit4]   2> 	
[junit4:junit4]   2> 		request was:q=ac&spellcheck.count=2&qt=/suggest&spellcheck.onlyMorePopular=true
[junit4:junit4]   2> 		at org.apache.solr.SolrTestCaseJ4.assertQ(SolrTestCaseJ4.java:480)
[junit4:junit4]   2> 		at org.apache.solr.SolrTestCaseJ4.assertQ(SolrTestCaseJ4.java:454)
[junit4:junit4]   2> 		at org.apache.solr.spelling.suggest.SuggesterTest.testSuggestions(SuggesterTest.java:71)
[junit4:junit4]   2> 		at sun.reflect.NativeMethodAccessorImpl.invoke0(Native Method)
[junit4:junit4]   2> 		at sun.reflect.NativeMethodAccessorImpl.invoke(NativeMethodAccessorImpl.java:39)
[junit4:junit4]   2> 		at sun.reflect.DelegatingMethodAccessorImpl.invoke(DelegatingMethodAccessorImpl.java:25)
[junit4:junit4]   2> 		at java.lang.reflect.Method.invoke(Method.java:597)
[junit4:junit4]   2> 		at com.carrotsearch.randomizedtesting.RandomizedRunner.invoke(RandomizedRunner.java:1995)
[junit4:junit4]   2> 		at com.carrotsearch.randomizedtesting.RandomizedRunner.access$1100(RandomizedRunner.java:132)
[junit4:junit4]   2> 		at com.carrotsearch.randomizedtesting.RandomizedRunner$6.evaluate(RandomizedRunner.java:818)
[junit4:junit4]   2> 		at com.carrotsearch.randomizedtesting.RandomizedRunner$7.evaluate(RandomizedRunner.java:877)
[junit4:junit4]   2> 		at com.carrotsearch.randomizedtesting.RandomizedRunner$8.evaluate(RandomizedRunner.java:891)
[junit4:junit4]   2> 		at com.carrotsearch.randomizedtesting.rules.SystemPropertiesRestoreRule$1.evaluate(SystemPropertiesRestoreRule.java:53)
[junit4:junit4]   2> 		at org.apache.lucene.util.TestRuleSetupTeardownChained$1.evaluate(TestRuleSetupTeardownChained.java:50)
[junit4:junit4]   2> 		at org.apache.lucene.util.TestRuleFieldCacheSanity$1.evaluate(TestRuleFieldCacheSanity.java:32)
[junit4:junit4]   2> 		at org.apache.lucene.util.AbstractBeforeAfterRule$1.evaluate(AbstractBeforeAfterRule.java:45)
[junit4:junit4]   2> 		at com.carrotsearch.randomizedtesting.rules.SystemPropertiesInvariantRule$1.evaluate(SystemPropertiesInvariantRule.java:55)
[junit4:junit4]   2> 		at org.apache.lucene.util.TestRuleReportUncaughtExceptions$1.evaluate(TestRuleReportUncaughtExceptions.java:68)
[junit4:junit4]   2> 		at org.apache.lucene.util.TestRuleThreadAndTestName$1.evaluate(TestRuleThreadAndTestName.java:48)
[junit4:junit4]   2> 		at org.apache.lucene.util.TestRuleIgnoreAfterMaxFailures$1.evaluate(TestRuleIgnoreAfterMaxFailures.java:70)
[junit4:junit4]   2> 		at org.apache.lucene.util.TestRuleMarkFailure$1.evaluate(TestRuleMarkFailure.java:48)
[junit4:junit4]   2> 		at com.carrotsearch.randomizedtesting.RandomizedRunner.runSingleTest(RandomizedRunner.java:825)
[junit4:junit4]   2> 		at com.carrotsearch.randomizedtesting.RandomizedRunner.access$700(RandomizedRunner.java:132)
[junit4:junit4]   2> 		at com.carrotsearch.randomizedtesting.RandomizedRunner$3$1.run(RandomizedRunner.java:671)
[junit4:junit4]   2> 		at com.carrotsearch.randomizedtesting.RandomizedRunner$3.evaluate(RandomizedRunner.java:697)
[junit4:junit4]   2> 		at com.carrotsearch.randomizedtesting.RandomizedRunner$4.evaluate(RandomizedRunner.java:736)
[junit4:junit4]   2> 		at com.carrotsearch.randomizedtesting.RandomizedRunner$5.evaluate(RandomizedRunner.java:747)
[junit4:junit4]   2> 		at com.carrotsearch.randomizedtesting.rules.SystemPropertiesRestoreRule$1.evaluate(SystemPropertiesRestoreRule.java:53)
[junit4:junit4]   2> 		at org.apache.lucene.util.AbstractBeforeAfterRule$1.evaluate(AbstractBeforeAfterRule.java:45)
[junit4:junit4]   2> 		at org.apache.lucene.util.TestRuleReportUncaughtExceptions$1.evaluate(TestRuleReportUncaughtExceptions.java:68)
[junit4:junit4]   2> 		at org.apache.lucene.util.TestRuleStoreClassName$1.evaluate(TestRuleStoreClassName.java:38)
[junit4:junit4]   2> 		at org.apache.lucene.util.TestRuleIcuHack$1.evaluate(TestRuleIcuHack.java:51)
[junit4:junit4]   2> 		at com.carrotsearch.randomizedtesting.rules.SystemPropertiesInvariantRule$1.evaluate(SystemPropertiesInvariantRule.java:55)
[junit4:junit4]   2> 		at org.apache.lucene.util.TestRuleNoInstanceHooksOverrides$1.evaluate(TestRuleNoInstanceHooksOverrides.java:53)
[junit4:junit4]   2> 		at org.apache.lucene.util.TestRuleNoStaticHooksShadowing$1.evaluate(TestRuleNoStaticHooksShadowing.java:52)
[junit4:junit4]   2> 		at org.apache.lucene.util.TestRuleAssertionsRequired$1.evaluate(TestRuleAssertionsRequired.java:36)
[junit4:junit4]   2> 		at org.apache.lucene.util.TestRuleMarkFailure$1.evaluate(TestRuleMarkFailure.java:48)
[junit4:junit4]   2> 		at org.apache.lucene.util.TestRuleIgnoreAfterMaxFailures$1.evaluate(TestRuleIgnoreAfterMaxFailures.java:70)
[junit4:junit4]   2> 		at org.apache.lucene.util.TestRuleIgnoreTestSuites$1.evaluate(TestRuleIgnoreTestSuites.java:55)
[junit4:junit4]   2> 		at com.carrotsearch.randomizedtesting.RandomizedRunner.runSuite(RandomizedRunner.java:605)
[junit4:junit4]   2> 		at com.carrotsearch.randomizedtesting.RandomizedRunner.access$400(RandomizedRunner.java:132)
[junit4:junit4]   2> 		at com.carrotsearch.randomizedtesting.RandomizedRunner$2.run(RandomizedRunner.java:551)
[junit4:junit4]   2> 	
[junit4:junit4]   2> 563 T3070 oas.SolrTestCaseJ4.tearDown ###Ending testSuggestions
[junit4:junit4]   2> NOTE: reproduce with: ant test  -Dtestcase=SuggesterTest -Dtests.method=testSuggestions
-Dtests.seed=2C23BC868FC05926 -Dtests.slow=true -Dtests.locale=fr_FR -Dtests.timezone=Europe/Volgograd
-Dtests.file.encoding=US-ASCII
[junit4:junit4]   2>
[junit4:junit4]    > (@AfterClass output)
[junit4:junit4]   2> 3060 T3070 oas.SolrTestCaseJ4.deleteCore ###deleteCore
[junit4:junit4]   2> 3060 T3070 oasc.CoreContainer.shutdown Shutting down CoreContainer
instance=194667414
[junit4:junit4]   2> 3060 T3070 oasc.SolrCore.close [collection1]  CLOSING SolrCore org.apache.solr.core.SolrCore@35a7ce95
[junit4:junit4]   2> 3060 T3070 oasc.SolrCore.closeSearcher [collection1] Closing main
searcher on request.
[junit4:junit4]   2> 3060 T3070 oasu.DirectUpdateHandler2.close closing DirectUpdateHandler2{commits=0,autocommits=0,soft
autocommits=0,optimizes=0,rollbacks=0,expungeDeletes=0,docsPending=0,adds=0,deletesById=0,deletesByQuery=0,errors=0,cumulative_adds=0,cumulative_deletesById=0,cumulative_deletesByQuery=0,cumulative_errors=0}
[junit4:junit4]   2> NOTE: test params are: codec=Lucene3x, sim=RandomSimilarityProvider(queryNorm=false,coord=false):
{}, locale=fr_FR, timezone=Europe/Volgograd
[junit4:junit4]   2> NOTE: Windows 7 6.1 amd64/Sun Microsystems Inc. 1.6.0_32 (64-bit)/cpus=2,threads=1,free=173119632,total=303431680
[junit4:junit4]   2> NOTE: All tests run in this JVM: [DistanceFunctionTest, TestJapaneseReadingFormFilterFactory,
TestPorterStemFilterFactory, OutputWriterTest, XmlUpdateRequestHandlerTest, XsltUpdateRequestHandlerTest,
CloudStateUpdateTest, DirectUpdateHandlerTest, TestHunspellStemFilterFactory, TestLMDirichletSimilarityFactory,
TestFiltering, TestLRUCache, IndexSchemaTest, TestGermanNormalizationFilterFactory, QueryEqualityTest,
TestBinaryResponseWriter, SolrIndexConfigTest, TestDistributedGrouping, TestIndexingPerformance,
TestConfig, DistributedQueryElevationComponentTest, DistributedSpellCheckComponentTest, SoftAutoCommitTest,
JSONWriterTest, TestPortugueseStemFilterFactory, ZkSolrClientTest, TestPerFieldSimilarity,
URLClassifyProcessorTest, RequestHandlersTest, TestJapanesePartOfSpeechStopFilterFactory,
SortByFunctionTest, SpellingQueryConverterTest, TestIndexSearcher, TestJapaneseKatakanaStemFilterFactory,
TermVectorComponentTest, TestSearchPerf, AnalysisAfterCoreReloadTest, TestHTMLStripCharFilterFactory,
BadIndexSchemaTest, TestPseudoReturnFields, TestChineseTokenizerFactory, SignatureUpdateProcessorFactoryTest,
LegacyHTMLStripCharFilterTest, TestFinnishLightStemFilterFactory, CommonGramsFilterFactoryTest,
TestJapaneseTokenizerFactory, TestJoin, TestDefaultSimilarityFactory, TestStemmerOverrideFilterFactory,
TestDocSet, HighlighterTest, RequiredFieldsTest, TestStressReorder, TestCollationKeyFilterFactory,
NotRequiredUniqueKeyTest, TestQuerySenderListener, LukeRequestHandlerTest, JsonLoaderTest,
SolrRequestParserTest, TestStressLucene, QueryElevationComponentTest, IndexReaderFactoryTest,
TestPortugueseMinimalStemFilterFactory, SpellPossibilityIteratorTest, BasicDistributedZkTest,
TestCodecSupport, SolrCoreTest, TestBrazilianStemFilterFactory, TestDistributedSearch, TestOmitPositions,
TestNumberUtils, TestFaceting, TestRandomFaceting, TestExtendedDismaxParser, TestValueSourceCache,
RAMDirectoryFactoryTest, IndexSchemaRuntimeFieldTest, CoreAdminHandlerTest, TestNorwegianMinimalStemFilterFactory,
TestSolrJ, TestRTGBase, AutoCommitTest, TestSolrXMLSerializer, TestPhraseSuggestions, TestBulgarianStemFilterFactory,
FastVectorHighlighterTest, DistributedTermsComponentTest, CSVRequestHandlerTest, CopyFieldTest,
NoCacheHeaderTest, TestDictionaryCompoundWordTokenFilterFactory, TestLatvianStemFilterFactory,
SolrPluginUtilsTest, TestStandardFactories, TestCJKBigramFilterFactory, TestFunctionQuery,
TestWordDelimiterFilterFactory, MultiTermTest, TestXIncludeConfig, ResourceLoaderTest, DefaultValueUpdateProcessorTest,
TestSolrDeletionPolicy1, CacheHeaderTest, TestLMJelinekMercerSimilarityFactory, TestPhoneticFilterFactory,
SpatialFilterTest, TestReplicationHandler, TestRealTimeGet, DirectUpdateHandlerOptimizeTest,
TestPortugueseLightStemFilterFactory, BadComponentTest, TestSlowSynonymFilter, TestRemoveDuplicatesTokenFilterFactory,
TestRussianFilters, FileUtilsTest, ZkNodePropsTest, SolrInfoMBeanTest, HighlighterConfigTest,
SpellCheckComponentTest, TestRemoteStreaming, CommonGramsQueryFilterFactoryTest, TestQueryTypes,
TestStopFilterFactory, DirectSolrConnectionTest, TestElisionFilterFactory, AlternateDirectoryTest,
SpellCheckCollatorTest, MBeansHandlerTest, TestPropInject, TestBeiderMorseFilterFactory, TestSpanishLightStemFilterFactory,
TestGermanMinimalStemFilterFactory, NumericFieldsTest, SOLR749Test, TestSwedishLightStemFilterFactory,
TestPHPSerializedResponseWriter, IndexBasedSpellCheckerTest, TestFastLRUCache, CurrencyFieldTest,
TestHyphenationCompoundWordTokenFilterFactory, TestCJKWidthFilterFactory, TestGermanStemFilterFactory,
OverseerTest, FullSolrCloudTest, RecoveryZkTest, FullSolrCloudDistribCmdsTest, LeaderElectionIntegrationTest,
LeaderElectionTest, ZkControllerTest, BasicZkTest, WordBreakSolrSpellCheckerTest, TestHashPartitioner,
StatsComponentTest, TestRecovery, TestRangeQuery, TestMultiCoreConfBootstrap, SimpleFacetsTest,
TestCoreContainer, TestSort, TestGroupingSearch, DirectSolrSpellCheckerTest, FileBasedSpellCheckerTest,
ConvertedLegacyTest, PeerSyncTest, BasicFunctionalityTest, TestJmxIntegration, SampleTest,
TestTrie, TestCSVLoader, PolyFieldTest, TestCSVResponseWriter, MoreLikeThisHandlerTest, DocumentBuilderTest,
DisMaxRequestHandlerTest, BinaryUpdateRequestHandlerTest, QueryParsingTest, TermsComponentTest,
MinimalSchemaTest, StandardRequestHandlerTest, FieldAnalysisRequestHandlerTest, PingRequestHandlerTest,
SuggesterWFSTTest, TestSurroundQueryParser, DocumentAnalysisRequestHandlerTest, TestSolrQueryParser,
TestReversedWildcardFilterFactory, DebugComponentTest, ReturnFieldsTest, SearchHandlerTest,
SuggesterFSTTest, TestArbitraryIndexDir, TestQueryUtils, LoggingHandlerTest, SuggesterTSTTest,
SolrCmdDistributorTest, UniqFieldsUpdateProcessorFactoryTest, UpdateParamsTest, SuggesterTest]
[junit4:junit4]   2> 
[junit4:junit4] Completed in 3.11s, 4 tests, 1 error <<< FAILURES!

[...truncated 290 lines...]
BUILD FAILED
C:\Jenkins\workspace\Lucene-Solr-4.x-Windows-Java6-64\build.xml:29: The following error occurred
while executing this line:
C:\Jenkins\workspace\Lucene-Solr-4.x-Windows-Java6-64\solr\build.xml:144: The following error
occurred while executing this line:
C:\Jenkins\workspace\Lucene-Solr-4.x-Windows-Java6-64\lucene\module-build.xml:62: The following
error occurred while executing this line:
C:\Jenkins\workspace\Lucene-Solr-4.x-Windows-Java6-64\lucene\common-build.xml:1095: The following
error occurred while executing this line:
C:\Jenkins\workspace\Lucene-Solr-4.x-Windows-Java6-64\lucene\common-build.xml:792: There were
test failures: 299 suites, 1062 tests, 1 error, 10 ignored (5 assumptions)

Total time: 37 minutes 17 seconds
Build step 'Invoke Ant' marked build as failure
Recording test results
Email was triggered for: Failure
Sending email for trigger: Failure




Mime
View raw message