lucene-dev mailing list archives

Site index · List index
Message view « Date » · « Thread »
Top « Date » · « Thread »
From Policeman Jenkins Server <jenk...@sd-datasolutions.de>
Subject [JENKINS] Lucene-Solr-4.x-Windows-Java6-64 - Build # 384 - Failure!
Date Fri, 20 Jul 2012 08:58:06 GMT
Build: http://jenkins.sd-datasolutions.de/job/Lucene-Solr-4.x-Windows-Java6-64/384/

1 tests failed.
FAILED:  junit.framework.TestSuite.org.apache.solr.cloud.CloudStateUpdateTest

Error Message:
ERROR: SolrIndexSearcher opens=5 closes=4

Stack Trace:
java.lang.AssertionError: ERROR: SolrIndexSearcher opens=5 closes=4
	at __randomizedtesting.SeedInfo.seed([FD5FC09E1D433B61]:0)
	at org.junit.Assert.fail(Assert.java:93)
	at org.apache.solr.SolrTestCaseJ4.endTrackingSearchers(SolrTestCaseJ4.java:216)
	at org.apache.solr.SolrTestCaseJ4.afterClass(SolrTestCaseJ4.java:82)
	at sun.reflect.GeneratedMethodAccessor15.invoke(Unknown Source)
	at sun.reflect.DelegatingMethodAccessorImpl.invoke(DelegatingMethodAccessorImpl.java:25)
	at java.lang.reflect.Method.invoke(Method.java:597)
	at com.carrotsearch.randomizedtesting.RandomizedRunner.invoke(RandomizedRunner.java:1995)
	at com.carrotsearch.randomizedtesting.RandomizedRunner.access$1100(RandomizedRunner.java:132)
	at com.carrotsearch.randomizedtesting.RandomizedRunner$5.evaluate(RandomizedRunner.java:754)
	at com.carrotsearch.randomizedtesting.rules.SystemPropertiesRestoreRule$1.evaluate(SystemPropertiesRestoreRule.java:53)
	at org.apache.lucene.util.AbstractBeforeAfterRule$1.evaluate(AbstractBeforeAfterRule.java:45)
	at org.apache.lucene.util.TestRuleReportUncaughtExceptions$1.evaluate(TestRuleReportUncaughtExceptions.java:68)
	at org.apache.lucene.util.TestRuleStoreClassName$1.evaluate(TestRuleStoreClassName.java:38)
	at org.apache.lucene.util.TestRuleIcuHack$1.evaluate(TestRuleIcuHack.java:51)
	at com.carrotsearch.randomizedtesting.rules.SystemPropertiesInvariantRule$1.evaluate(SystemPropertiesInvariantRule.java:55)
	at org.apache.lucene.util.TestRuleNoInstanceHooksOverrides$1.evaluate(TestRuleNoInstanceHooksOverrides.java:53)
	at org.apache.lucene.util.TestRuleNoStaticHooksShadowing$1.evaluate(TestRuleNoStaticHooksShadowing.java:52)
	at org.apache.lucene.util.TestRuleAssertionsRequired$1.evaluate(TestRuleAssertionsRequired.java:36)
	at org.apache.lucene.util.TestRuleMarkFailure$1.evaluate(TestRuleMarkFailure.java:48)
	at org.apache.lucene.util.TestRuleIgnoreAfterMaxFailures$1.evaluate(TestRuleIgnoreAfterMaxFailures.java:70)
	at org.apache.lucene.util.TestRuleIgnoreTestSuites$1.evaluate(TestRuleIgnoreTestSuites.java:55)
	at com.carrotsearch.randomizedtesting.RandomizedRunner.runSuite(RandomizedRunner.java:605)
	at com.carrotsearch.randomizedtesting.RandomizedRunner.access$400(RandomizedRunner.java:132)
	at com.carrotsearch.randomizedtesting.RandomizedRunner$2.run(RandomizedRunner.java:551)




Build Log:
[...truncated 15236 lines...]
[junit4:junit4] Suite: org.apache.solr.cloud.CloudStateUpdateTest
[junit4:junit4]    > (@AfterClass output)
[junit4:junit4]   2> 22468 T1039 oas.SolrTestCaseJ4.deleteCore ###deleteCore
[junit4:junit4]   2> 147384 T1039 oas.SolrTestCaseJ4.endTrackingSearchers SEVERE ERROR:
SolrIndexSearcher opens=5 closes=4
[junit4:junit4]   2> NOTE: test params are: codec=Appending, sim=RandomSimilarityProvider(queryNorm=true,coord=false):
{}, locale=es_PA, timezone=America/Cordoba
[junit4:junit4]   2> NOTE: Windows 7 6.1 amd64/Sun Microsystems Inc. 1.6.0_33 (64-bit)/cpus=2,threads=3,free=67579512,total=195362816
[junit4:junit4]   2> NOTE: All tests run in this JVM: [DocumentBuilderTest, TestCollationKeyRangeQueries,
DistributedTermsComponentTest, TestQueryUtils, TestCharFilters, TestElisionFilterFactory,
UUIDFieldTest, TestJapaneseBaseFormFilterFactory, SolrRequestParserTest, TestUpdate, FastVectorHighlighterTest,
TestPatternReplaceFilterFactory, TestRangeQuery, DocumentAnalysisRequestHandlerTest, TestSwedishLightStemFilterFactory,
CircularListTest, TestPorterStemFilterFactory, RAMDirectoryFactoryTest, DateMathParserTest,
DistributedSpellCheckComponentTest, TestQuerySenderNoQuery, UpdateRequestProcessorFactoryTest,
ShowFileRequestHandlerTest, TestHungarianLightStemFilterFactory, TestIrishLowerCaseFilterFactory,
DebugComponentTest, BasicDistributedZkTest, TestCoreContainer, ZkSolrClientTest, SnowballPorterFilterFactoryTest,
TestReversedWildcardFilterFactory, SpellCheckCollatorTest, TestOmitPositions, SOLR749Test,
TestSlowSynonymFilter, TestSort, UpdateParamsTest, TestQuerySenderListener, LegacyHTMLStripCharFilterTest,
CommonGramsQueryFilterFactoryTest, CloudStateTest, TestLMDirichletSimilarityFactory, TestLatvianStemFilterFactory,
BadComponentTest, SpellPossibilityIteratorTest, TestPortugueseMinimalStemFilterFactory, SortByFunctionTest,
SolrCoreCheckLockOnStartupTest, TestRemoveDuplicatesTokenFilterFactory, NotRequiredUniqueKeyTest,
ScriptEngineTest, TestPHPSerializedResponseWriter, FullSolrCloudDistribCmdsTest, TestPatternReplaceCharFilterFactory,
TestNorwegianMinimalStemFilterFactory, TestKeepFilterFactory, SpatialFilterTest, TestJapaneseIterationMarkCharFilterFactory,
TestHunspellStemFilterFactory, DirectSolrConnectionTest, TestSolrJ, SignatureUpdateProcessorFactoryTest,
TestPerFieldSimilarity, ZkNodePropsTest, SuggesterTSTTest, URLClassifyProcessorTest, PreAnalyzedFieldTest,
PrimUtilsTest, ReturnFieldsTest, TestWriterPerf, SpellingQueryConverterTest, TestSolrDeletionPolicy1,
TestFaceting, TestCzechStemFilterFactory, TestBinaryField, MoreLikeThisHandlerTest, ZkControllerTest,
TestCapitalizationFilterFactory, PeerSyncTest, QueryElevationComponentTest, RequestHandlersTest,
TestPluginEnable, TestHashPartitioner, TestXIncludeConfig, TestMappingCharFilterFactory, TestGroupingSearch,
TestLFUCache, TestSolrXMLSerializer, StatsComponentTest, TestJoin, TestJapanesePartOfSpeechStopFilterFactory,
AnalysisAfterCoreReloadTest, CopyFieldTest, TestSystemIdResolver, CloudStateUpdateTest]
[junit4:junit4]   2> NOTE: reproduce with: ant test  -Dtestcase=CloudStateUpdateTest -Dtests.seed=FD5FC09E1D433B61
-Dtests.slow=true -Dtests.locale=es_PA -Dtests.timezone=America/Cordoba -Dtests.file.encoding=US-ASCII
[junit4:junit4]   2> 
[junit4:junit4] ERROR   0.00s | CloudStateUpdateTest (suite)
[junit4:junit4]    > Throwable #1: java.lang.AssertionError: ERROR: SolrIndexSearcher opens=5
closes=4
[junit4:junit4]    > 	at __randomizedtesting.SeedInfo.seed([FD5FC09E1D433B61]:0)
[junit4:junit4]    > 	at org.junit.Assert.fail(Assert.java:93)
[junit4:junit4]    > 	at org.apache.solr.SolrTestCaseJ4.endTrackingSearchers(SolrTestCaseJ4.java:216)
[junit4:junit4]    > 	at org.apache.solr.SolrTestCaseJ4.afterClass(SolrTestCaseJ4.java:82)
[junit4:junit4]    > 	at sun.reflect.GeneratedMethodAccessor15.invoke(Unknown Source)
[junit4:junit4]    > 	at sun.reflect.DelegatingMethodAccessorImpl.invoke(DelegatingMethodAccessorImpl.java:25)
[junit4:junit4]    > 	at java.lang.reflect.Method.invoke(Method.java:597)
[junit4:junit4]    > 	at com.carrotsearch.randomizedtesting.RandomizedRunner.invoke(RandomizedRunner.java:1995)
[junit4:junit4]    > 	at com.carrotsearch.randomizedtesting.RandomizedRunner.access$1100(RandomizedRunner.java:132)
[junit4:junit4]    > 	at com.carrotsearch.randomizedtesting.RandomizedRunner$5.evaluate(RandomizedRunner.java:754)
[junit4:junit4]    > 	at com.carrotsearch.randomizedtesting.rules.SystemPropertiesRestoreRule$1.evaluate(SystemPropertiesRestoreRule.java:53)
[junit4:junit4]    > 	at org.apache.lucene.util.AbstractBeforeAfterRule$1.evaluate(AbstractBeforeAfterRule.java:45)
[junit4:junit4]    > 	at org.apache.lucene.util.TestRuleReportUncaughtExceptions$1.evaluate(TestRuleReportUncaughtExceptions.java:68)
[junit4:junit4]    > 	at org.apache.lucene.util.TestRuleStoreClassName$1.evaluate(TestRuleStoreClassName.java:38)
[junit4:junit4]    > 	at org.apache.lucene.util.TestRuleIcuHack$1.evaluate(TestRuleIcuHack.java:51)
[junit4:junit4]    > 	at com.carrotsearch.randomizedtesting.rules.SystemPropertiesInvariantRule$1.evaluate(SystemPropertiesInvariantRule.java:55)
[junit4:junit4]    > 	at org.apache.lucene.util.TestRuleNoInstanceHooksOverrides$1.evaluate(TestRuleNoInstanceHooksOverrides.java:53)
[junit4:junit4]    > 	at org.apache.lucene.util.TestRuleNoStaticHooksShadowing$1.evaluate(TestRuleNoStaticHooksShadowing.java:52)
[junit4:junit4]    > 	at org.apache.lucene.util.TestRuleAssertionsRequired$1.evaluate(TestRuleAssertionsRequired.java:36)
[junit4:junit4]    > 	at org.apache.lucene.util.TestRuleMarkFailure$1.evaluate(TestRuleMarkFailure.java:48)
[junit4:junit4]    > 	at org.apache.lucene.util.TestRuleIgnoreAfterMaxFailures$1.evaluate(TestRuleIgnoreAfterMaxFailures.java:70)
[junit4:junit4]    > 	at org.apache.lucene.util.TestRuleIgnoreTestSuites$1.evaluate(TestRuleIgnoreTestSuites.java:55)
[junit4:junit4]    > 	at com.carrotsearch.randomizedtesting.RandomizedRunner.runSuite(RandomizedRunner.java:605)
[junit4:junit4]    > 	at com.carrotsearch.randomizedtesting.RandomizedRunner.access$400(RandomizedRunner.java:132)
[junit4:junit4]    > 	at com.carrotsearch.randomizedtesting.RandomizedRunner$2.run(RandomizedRunner.java:551)
[junit4:junit4]    >
[junit4:junit4] Completed in 147.43s, 1 test, 1 failure <<< FAILURES!

[...truncated 869 lines...]
BUILD FAILED
C:\Jenkins\workspace\Lucene-Solr-4.x-Windows-Java6-64\build.xml:29: The following error occurred
while executing this line:
C:\Jenkins\workspace\Lucene-Solr-4.x-Windows-Java6-64\solr\build.xml:144: The following error
occurred while executing this line:
C:\Jenkins\workspace\Lucene-Solr-4.x-Windows-Java6-64\lucene\module-build.xml:62: The following
error occurred while executing this line:
C:\Jenkins\workspace\Lucene-Solr-4.x-Windows-Java6-64\lucene\common-build.xml:1093: The following
error occurred while executing this line:
C:\Jenkins\workspace\Lucene-Solr-4.x-Windows-Java6-64\lucene\common-build.xml:788: There were
test failures: 304 suites, 1083 tests, 1 suite-level error, 10 ignored (5 assumptions)

Total time: 38 minutes 44 seconds
Build step 'Invoke Ant' marked build as failure
Recording test results
Email was triggered for: Failure
Sending email for trigger: Failure




Mime
View raw message