lucene-dev mailing list archives

Site index · List index
Message view « Date » · « Thread »
Top « Date » · « Thread »
From Policeman Jenkins Server <jenk...@sd-datasolutions.de>
Subject [JENKINS] Lucene-Solr-4.x-Linux-Java8-64 - Build # 3 - Still Failing!
Date Tue, 03 Jul 2012 16:21:36 GMT
Build: http://jenkins.sd-datasolutions.de/job/Lucene-Solr-4.x-Linux-Java8-64/3/

2 tests failed.
REGRESSION:  org.apache.solr.handler.component.DistributedQueryElevationComponentTest.testDistribSearch

Error Message:
Index: 18, Size: 18

Stack Trace:
java.lang.IndexOutOfBoundsException: Index: 18, Size: 18
	at __randomizedtesting.SeedInfo.seed([8B6B7A1149375073:A8DF4093E68304F]:0)
	at java.util.ArrayList.rangeCheck(ArrayList.java:603)
	at java.util.ArrayList.get(ArrayList.java:381)
	at org.apache.solr.common.util.NamedList.getName(NamedList.java:127)
	at org.apache.solr.BaseDistributedSearchTestCase.compare(BaseDistributedSearchTestCase.java:466)
	at org.apache.solr.BaseDistributedSearchTestCase.compare(BaseDistributedSearchTestCase.java:612)
	at org.apache.solr.BaseDistributedSearchTestCase.compare(BaseDistributedSearchTestCase.java:500)
	at org.apache.solr.BaseDistributedSearchTestCase.compare(BaseDistributedSearchTestCase.java:612)
	at org.apache.solr.BaseDistributedSearchTestCase.compare(BaseDistributedSearchTestCase.java:500)
	at org.apache.solr.BaseDistributedSearchTestCase.compareResponses(BaseDistributedSearchTestCase.java:667)
	at org.apache.solr.BaseDistributedSearchTestCase.query(BaseDistributedSearchTestCase.java:392)
	at org.apache.solr.handler.component.DistributedQueryElevationComponentTest.doTest(DistributedQueryElevationComponentTest.java:81)
	at org.apache.solr.BaseDistributedSearchTestCase.testDistribSearch(BaseDistributedSearchTestCase.java:679)
	at sun.reflect.NativeMethodAccessorImpl.invoke0(Native Method)
	at sun.reflect.NativeMethodAccessorImpl.invoke(NativeMethodAccessorImpl.java:57)
	at sun.reflect.DelegatingMethodAccessorImpl.invoke(DelegatingMethodAccessorImpl.java:43)
	at java.lang.reflect.Method.invoke(Method.java:474)
	at com.carrotsearch.randomizedtesting.RandomizedRunner.invoke(RandomizedRunner.java:1969)
	at com.carrotsearch.randomizedtesting.RandomizedRunner.access$1100(RandomizedRunner.java:132)
	at com.carrotsearch.randomizedtesting.RandomizedRunner$6.evaluate(RandomizedRunner.java:814)
	at com.carrotsearch.randomizedtesting.RandomizedRunner$7.evaluate(RandomizedRunner.java:875)
	at com.carrotsearch.randomizedtesting.RandomizedRunner$8.evaluate(RandomizedRunner.java:889)
	at com.carrotsearch.randomizedtesting.rules.SystemPropertiesRestoreRule$1.evaluate(SystemPropertiesRestoreRule.java:53)
	at org.apache.lucene.util.TestRuleSetupTeardownChained$1.evaluate(TestRuleSetupTeardownChained.java:50)
	at org.apache.lucene.util.TestRuleFieldCacheSanity$1.evaluate(TestRuleFieldCacheSanity.java:32)
	at org.apache.lucene.util.AbstractBeforeAfterRule$1.evaluate(AbstractBeforeAfterRule.java:45)
	at com.carrotsearch.randomizedtesting.rules.SystemPropertiesInvariantRule$1.evaluate(SystemPropertiesInvariantRule.java:55)
	at org.apache.lucene.util.TestRuleReportUncaughtExceptions$1.evaluate(TestRuleReportUncaughtExceptions.java:68)
	at org.apache.lucene.util.TestRuleThreadAndTestName$1.evaluate(TestRuleThreadAndTestName.java:48)
	at org.apache.lucene.util.TestRuleIgnoreAfterMaxFailures$1.evaluate(TestRuleIgnoreAfterMaxFailures.java:70)
	at org.apache.lucene.util.TestRuleMarkFailure$1.evaluate(TestRuleMarkFailure.java:48)
	at com.carrotsearch.randomizedtesting.RandomizedRunner.runSingleTest(RandomizedRunner.java:821)
	at com.carrotsearch.randomizedtesting.RandomizedRunner.access$700(RandomizedRunner.java:132)
	at com.carrotsearch.randomizedtesting.RandomizedRunner$3$1.run(RandomizedRunner.java:669)
	at com.carrotsearch.randomizedtesting.RandomizedRunner$3.evaluate(RandomizedRunner.java:695)
	at com.carrotsearch.randomizedtesting.RandomizedRunner$4.evaluate(RandomizedRunner.java:734)
	at com.carrotsearch.randomizedtesting.RandomizedRunner$5.evaluate(RandomizedRunner.java:745)
	at com.carrotsearch.randomizedtesting.rules.SystemPropertiesRestoreRule$1.evaluate(SystemPropertiesRestoreRule.java:53)
	at org.apache.lucene.util.AbstractBeforeAfterRule$1.evaluate(AbstractBeforeAfterRule.java:45)
	at org.apache.lucene.util.TestRuleReportUncaughtExceptions$1.evaluate(TestRuleReportUncaughtExceptions.java:68)
	at org.apache.lucene.util.TestRuleStoreClassName$1.evaluate(TestRuleStoreClassName.java:38)
	at org.apache.lucene.util.TestRuleIcuHack$1.evaluate(TestRuleIcuHack.java:51)
	at com.carrotsearch.randomizedtesting.rules.SystemPropertiesInvariantRule$1.evaluate(SystemPropertiesInvariantRule.java:55)
	at org.apache.lucene.util.TestRuleNoInstanceHooksOverrides$1.evaluate(TestRuleNoInstanceHooksOverrides.java:53)
	at org.apache.lucene.util.TestRuleNoStaticHooksShadowing$1.evaluate(TestRuleNoStaticHooksShadowing.java:52)
	at org.apache.lucene.util.TestRuleAssertionsRequired$1.evaluate(TestRuleAssertionsRequired.java:36)
	at org.apache.lucene.util.TestRuleMarkFailure$1.evaluate(TestRuleMarkFailure.java:48)
	at org.apache.lucene.util.TestRuleIgnoreAfterMaxFailures$1.evaluate(TestRuleIgnoreAfterMaxFailures.java:70)
	at org.apache.lucene.util.TestRuleIgnoreTestSuites$1.evaluate(TestRuleIgnoreTestSuites.java:55)
	at com.carrotsearch.randomizedtesting.RandomizedRunner.runSuite(RandomizedRunner.java:605)
	at com.carrotsearch.randomizedtesting.RandomizedRunner.access$400(RandomizedRunner.java:132)
	at com.carrotsearch.randomizedtesting.RandomizedRunner$2.run(RandomizedRunner.java:551)


FAILED:  org.apache.solr.handler.component.SpellCheckComponentTest.testPerDictionary

Error Message:
mismatch: '0'!='2' @ spellcheck/suggestions/bar/startOffset

Stack Trace:
java.lang.RuntimeException: mismatch: '0'!='2' @ spellcheck/suggestions/bar/startOffset
	at __randomizedtesting.SeedInfo.seed([8B6B7A1149375073:4C658EB9415B453B]:0)
	at org.apache.solr.SolrTestCaseJ4.assertJQ(SolrTestCaseJ4.java:547)
	at org.apache.solr.SolrTestCaseJ4.assertJQ(SolrTestCaseJ4.java:495)
	at org.apache.solr.handler.component.SpellCheckComponentTest.testPerDictionary(SpellCheckComponentTest.java:102)
	at sun.reflect.NativeMethodAccessorImpl.invoke0(Native Method)
	at sun.reflect.NativeMethodAccessorImpl.invoke(NativeMethodAccessorImpl.java:57)
	at sun.reflect.DelegatingMethodAccessorImpl.invoke(DelegatingMethodAccessorImpl.java:43)
	at java.lang.reflect.Method.invoke(Method.java:474)
	at com.carrotsearch.randomizedtesting.RandomizedRunner.invoke(RandomizedRunner.java:1969)
	at com.carrotsearch.randomizedtesting.RandomizedRunner.access$1100(RandomizedRunner.java:132)
	at com.carrotsearch.randomizedtesting.RandomizedRunner$6.evaluate(RandomizedRunner.java:814)
	at com.carrotsearch.randomizedtesting.RandomizedRunner$7.evaluate(RandomizedRunner.java:875)
	at com.carrotsearch.randomizedtesting.RandomizedRunner$8.evaluate(RandomizedRunner.java:889)
	at com.carrotsearch.randomizedtesting.rules.SystemPropertiesRestoreRule$1.evaluate(SystemPropertiesRestoreRule.java:53)
	at org.apache.lucene.util.TestRuleSetupTeardownChained$1.evaluate(TestRuleSetupTeardownChained.java:50)
	at org.apache.lucene.util.TestRuleFieldCacheSanity$1.evaluate(TestRuleFieldCacheSanity.java:32)
	at org.apache.lucene.util.AbstractBeforeAfterRule$1.evaluate(AbstractBeforeAfterRule.java:45)
	at com.carrotsearch.randomizedtesting.rules.SystemPropertiesInvariantRule$1.evaluate(SystemPropertiesInvariantRule.java:55)
	at org.apache.lucene.util.TestRuleReportUncaughtExceptions$1.evaluate(TestRuleReportUncaughtExceptions.java:68)
	at org.apache.lucene.util.TestRuleThreadAndTestName$1.evaluate(TestRuleThreadAndTestName.java:48)
	at org.apache.lucene.util.TestRuleIgnoreAfterMaxFailures$1.evaluate(TestRuleIgnoreAfterMaxFailures.java:70)
	at org.apache.lucene.util.TestRuleMarkFailure$1.evaluate(TestRuleMarkFailure.java:48)
	at com.carrotsearch.randomizedtesting.RandomizedRunner.runSingleTest(RandomizedRunner.java:821)
	at com.carrotsearch.randomizedtesting.RandomizedRunner.access$700(RandomizedRunner.java:132)
	at com.carrotsearch.randomizedtesting.RandomizedRunner$3$1.run(RandomizedRunner.java:669)
	at com.carrotsearch.randomizedtesting.RandomizedRunner$3.evaluate(RandomizedRunner.java:695)
	at com.carrotsearch.randomizedtesting.RandomizedRunner$4.evaluate(RandomizedRunner.java:734)
	at com.carrotsearch.randomizedtesting.RandomizedRunner$5.evaluate(RandomizedRunner.java:745)
	at com.carrotsearch.randomizedtesting.rules.SystemPropertiesRestoreRule$1.evaluate(SystemPropertiesRestoreRule.java:53)
	at org.apache.lucene.util.AbstractBeforeAfterRule$1.evaluate(AbstractBeforeAfterRule.java:45)
	at org.apache.lucene.util.TestRuleReportUncaughtExceptions$1.evaluate(TestRuleReportUncaughtExceptions.java:68)
	at org.apache.lucene.util.TestRuleStoreClassName$1.evaluate(TestRuleStoreClassName.java:38)
	at org.apache.lucene.util.TestRuleIcuHack$1.evaluate(TestRuleIcuHack.java:51)
	at com.carrotsearch.randomizedtesting.rules.SystemPropertiesInvariantRule$1.evaluate(SystemPropertiesInvariantRule.java:55)
	at org.apache.lucene.util.TestRuleNoInstanceHooksOverrides$1.evaluate(TestRuleNoInstanceHooksOverrides.java:53)
	at org.apache.lucene.util.TestRuleNoStaticHooksShadowing$1.evaluate(TestRuleNoStaticHooksShadowing.java:52)
	at org.apache.lucene.util.TestRuleAssertionsRequired$1.evaluate(TestRuleAssertionsRequired.java:36)
	at org.apache.lucene.util.TestRuleMarkFailure$1.evaluate(TestRuleMarkFailure.java:48)
	at org.apache.lucene.util.TestRuleIgnoreAfterMaxFailures$1.evaluate(TestRuleIgnoreAfterMaxFailures.java:70)
	at org.apache.lucene.util.TestRuleIgnoreTestSuites$1.evaluate(TestRuleIgnoreTestSuites.java:55)
	at com.carrotsearch.randomizedtesting.RandomizedRunner.runSuite(RandomizedRunner.java:605)
	at com.carrotsearch.randomizedtesting.RandomizedRunner.access$400(RandomizedRunner.java:132)
	at com.carrotsearch.randomizedtesting.RandomizedRunner$2.run(RandomizedRunner.java:551)




Build Log:
[...truncated 7543 lines...]
   [junit4] Suite: org.apache.solr.handler.component.SpellCheckComponentTest
   [junit4]    > (@BeforeClass output)
   [junit4]   2> 0 T71 oas.SolrTestCaseJ4.initCore ####initCore
   [junit4]   2> Creating dataDir: /mnt/ssd/jenkins/workspace/Lucene-Solr-4.x-Linux-Java8-64/checkout/solr/build/solr-core/test/J1/./solrtest-SpellCheckComponentTest-1341332155754
   [junit4]   2> 1 T71 oasc.SolrResourceLoader.<init> new SolrResourceLoader for directory: '/mnt/ssd/jenkins/workspace/Lucene-Solr-4.x-Linux-Java8-64/checkout/solr/build/solr-core/test-files/solr/collection1/'
   [junit4]   2> 1 T71 oasc.SolrResourceLoader.replaceClassLoader Adding 'file:/mnt/ssd/jenkins/workspace/Lucene-Solr-4.x-Linux-Java8-64/checkout/solr/build/solr-core/test-files/solr/collection1/lib/classes/' to classloader
   [junit4]   2> 2 T71 oasc.SolrResourceLoader.replaceClassLoader Adding 'file:/mnt/ssd/jenkins/workspace/Lucene-Solr-4.x-Linux-Java8-64/checkout/solr/build/solr-core/test-files/solr/collection1/lib/README' to classloader
   [junit4]   2> 26 T71 oasc.SolrConfig.<init> Using Lucene MatchVersion: LUCENE_40
   [junit4]   2> 133 T71 oasc.SolrConfig.<init> Loaded SolrConfig: solrconfig-spellcheckcomponent.xml
   [junit4]   2> 134 T71 oass.IndexSchema.readSchema Reading Solr Schema
   [junit4]   2> 173 T71 oass.IndexSchema.readSchema Schema name=test
   [junit4]   2> 691 T71 oass.OpenExchangeRatesOrgProvider.init Initialized with rates=open-exchange-rates.json, refreshInterval=1440.
   [junit4]   2> 699 T71 oass.IndexSchema.readSchema default search field in schema is text
   [junit4]   2> 703 T71 oass.IndexSchema.readSchema unique key field: id
   [junit4]   2> 725 T71 oass.FileExchangeRateProvider.reload Reloading exchange rates from file currency.xml
   [junit4]   2> 743 T71 oass.FileExchangeRateProvider.reload Reloading exchange rates from file currency.xml
   [junit4]   2> 746 T71 oass.OpenExchangeRatesOrgProvider.reload Reloading exchange rates from open-exchange-rates.json
   [junit4]   2> 747 T71 oass.OpenExchangeRatesOrgProvider.reload Reloading exchange rates from open-exchange-rates.json
   [junit4]   2> 759 T71 oasc.SolrResourceLoader.locateSolrHome JNDI not configured for solr (NoInitialContextEx)
   [junit4]   2> 760 T71 oasc.SolrResourceLoader.locateSolrHome using system property solr.solr.home: /mnt/ssd/jenkins/workspace/Lucene-Solr-4.x-Linux-Java8-64/checkout/solr/build/solr-core/test-files/solr
   [junit4]   2> 760 T71 oasc.SolrResourceLoader.<init> new SolrResourceLoader for directory: '/mnt/ssd/jenkins/workspace/Lucene-Solr-4.x-Linux-Java8-64/checkout/solr/build/solr-core/test-files/solr/'
   [junit4]   2> 760 T71 oasc.CoreContainer.<init> New CoreContainer 224785734
   [junit4]   2> 760 T71 oasc.SolrCore.<init> [collection1] Opening new SolrCore at /mnt/ssd/jenkins/workspace/Lucene-Solr-4.x-Linux-Java8-64/checkout/solr/build/solr-core/test-files/solr/collection1/, dataDir=/mnt/ssd/jenkins/workspace/Lucene-Solr-4.x-Linux-Java8-64/checkout/solr/build/solr-core/test/J1/./solrtest-SpellCheckComponentTest-1341332155754/
   [junit4]   2> 761 T71 oasc.SolrCore.<init> JMX monitoring not detected for core: collection1
   [junit4]   2> 761 T71 oasc.SolrCore.getNewIndexDir WARNING New index directory detected: old=null new=/mnt/ssd/jenkins/workspace/Lucene-Solr-4.x-Linux-Java8-64/checkout/solr/build/solr-core/test/J1/./solrtest-SpellCheckComponentTest-1341332155754/index/
   [junit4]   2> 761 T71 oasc.SolrCore.initIndex WARNING [collection1] Solr index directory '/mnt/ssd/jenkins/workspace/Lucene-Solr-4.x-Linux-Java8-64/checkout/solr/build/solr-core/test/J1/./solrtest-SpellCheckComponentTest-1341332155754/index' doesn't exist. Creating new index...
   [junit4]   2> 776 T71 oasc.SolrDeletionPolicy.onCommit SolrDeletionPolicy.onCommit: commits:num=1
   [junit4]   2> 		commit{dir=MockDirWrapper(org.apache.lucene.store.SimpleFSDirectory@/mnt/ssd/jenkins/workspace/Lucene-Solr-4.x-Linux-Java8-64/checkout/solr/build/solr-core/test/J1/index4319443195tmp lockFactory=org.apache.lucene.store.NativeFSLockFactory@20d4ee30),segFN=segments_1,generation=1,filenames=[segments_1]
   [junit4]   2> 778 T71 oasc.SolrDeletionPolicy.updateCommits newest commit = 1
   [junit4]   2> 780 T71 oasc.RequestHandlers.initHandlersFromConfig created standard: solr.StandardRequestHandler
   [junit4]   2> 781 T71 oasc.RequestHandlers.initHandlersFromConfig created spellCheckCompRH: org.apache.solr.handler.component.SearchHandler
   [junit4]   2> 783 T71 oasc.RequestHandlers.initHandlersFromConfig created spellCheckCompRH1: org.apache.solr.handler.component.SearchHandler
   [junit4]   2> 784 T71 oasc.RequestHandlers.initHandlersFromConfig created spellCheckWithWordbreak: org.apache.solr.handler.component.SearchHandler
   [junit4]   2> 792 T71 oass.SolrIndexSearcher.<init> Opening Searcher@532be3f main
   [junit4]   2> 792 T71 oass.SolrIndexSearcher.<init> WARNING WARNING: Directory impl does not support setting indexDir: org.apache.lucene.store.MockDirectoryWrapper
   [junit4]   2> 793 T71 oasu.CommitTracker.<init> Hard AutoCommit: disabled
   [junit4]   2> 793 T71 oasu.CommitTracker.<init> Soft AutoCommit: disabled
   [junit4]   2> 793 T71 oashc.SpellCheckComponent.inform Initializing spell checkers
   [junit4]   2> 807 T71 oashc.SpellCheckComponent.inform Registering newSearcher listener for spellchecker: default
   [junit4]   2> 821 T71 oashc.SpellCheckComponent.inform Registering newSearcher listener for spellchecker: default_teststop
   [junit4]   2> 836 T71 oass.DirectSolrSpellChecker.init init: {name=direct,classname=solr.DirectSolrSpellChecker,minQueryLength=3,maxQueryFrequency=100.0,field=teststop}
   [junit4]   2> 836 T71 oass.DirectSolrSpellChecker.init init: {name=direct_lowerfilt,classname=solr.DirectSolrSpellChecker,minQueryLength=3,maxQueryFrequency=100.0,field=lowerfilt}
   [junit4]   2> 845 T71 oashc.SpellCheckComponent.inform Registering newSearcher listener for spellchecker: threshold
   [junit4]   2> 845 T71 oass.DirectSolrSpellChecker.init init: {name=threshold_direct,classname=solr.DirectSolrSpellChecker,field=lowerfilt,spellcheckIndexDir=spellcheckerThreshold,buildOnCommit=true,thresholdTokenFrequency=0.29}
   [junit4]   2> 845 T71 oashc.SpellCheckComponent.inform Registering newSearcher listener for spellchecker: threshold_direct
   [junit4]   2> 851 T71 oashc.SpellCheckComponent.inform Registering newSearcher listener for spellchecker: multipleFields
   [junit4]   2> 873 T71 oashc.SpellCheckComponent.inform Registering newSearcher listener for spellchecker: freq
   [junit4]   2> 879 T71 oashc.SpellCheckComponent.inform Registering newSearcher listener for spellchecker: fqcn
   [junit4]   2> 880 T71 oashc.HttpShardHandlerFactory.getParameter Setting socketTimeout to: 0
   [junit4]   2> 881 T71 oashc.HttpShardHandlerFactory.getParameter Setting urlScheme to: http://
   [junit4]   2> 881 T71 oashc.HttpShardHandlerFactory.getParameter Setting connTimeout to: 0
   [junit4]   2> 881 T71 oashc.HttpShardHandlerFactory.getParameter Setting maxConnectionsPerHost to: 20
   [junit4]   2> 881 T71 oashc.HttpShardHandlerFactory.getParameter Setting corePoolSize to: 0
   [junit4]   2> 881 T71 oashc.HttpShardHandlerFactory.getParameter Setting maximumPoolSize to: 2147483647
   [junit4]   2> 882 T71 oashc.HttpShardHandlerFactory.getParameter Setting maxThreadIdleTime to: 5
   [junit4]   2> 882 T71 oashc.HttpShardHandlerFactory.getParameter Setting sizeOfQueue to: -1
   [junit4]   2> 882 T71 oashc.HttpShardHandlerFactory.getParameter Setting fairnessPolicy to: false
   [junit4]   2> 882 T71 oascsi.HttpClientUtil.createClient Creating new http client, config:maxConnectionsPerHost=20&maxConnections=10000&socketTimeout=0&connTimeout=0&retry=false
   [junit4]   2> 886 T72 oasc.SolrCore.registerSearcher [collection1] Registered new searcher Searcher@532be3f main{StandardDirectoryReader(segments_1:1)}
   [junit4]   2> 887 T71 oasc.CoreContainer.register registering core: collection1
   [junit4]   2> 888 T71 oas.SolrTestCaseJ4.initCore ####initCore end
   [junit4]   2> 
   [junit4] ERROR   0.46s J1 | SpellCheckComponentTest.testPerDictionary
   [junit4]    > Throwable #1: java.lang.RuntimeException: mismatch: '0'!='2' @ spellcheck/suggestions/bar/startOffset
   [junit4]    > 	at __randomizedtesting.SeedInfo.seed([8B6B7A1149375073:4C658EB9415B453B]:0)
   [junit4]    > 	at org.apache.solr.SolrTestCaseJ4.assertJQ(SolrTestCaseJ4.java:547)
   [junit4]    > 	at org.apache.solr.SolrTestCaseJ4.assertJQ(SolrTestCaseJ4.java:495)
   [junit4]    > 	at org.apache.solr.handler.component.SpellCheckComponentTest.testPerDictionary(SpellCheckComponentTest.java:102)
   [junit4]    > 	at sun.reflect.NativeMethodAccessorImpl.invoke0(Native Method)
   [junit4]    > 	at sun.reflect.NativeMethodAccessorImpl.invoke(NativeMethodAccessorImpl.java:57)
   [junit4]    > 	at sun.reflect.DelegatingMethodAccessorImpl.invoke(DelegatingMethodAccessorImpl.java:43)
   [junit4]    > 	at java.lang.reflect.Method.invoke(Method.java:474)
   [junit4]    > 	at com.carrotsearch.randomizedtesting.RandomizedRunner.invoke(RandomizedRunner.java:1969)
   [junit4]    > 	at com.carrotsearch.randomizedtesting.RandomizedRunner.access$1100(RandomizedRunner.java:132)
   [junit4]    > 	at com.carrotsearch.randomizedtesting.RandomizedRunner$6.evaluate(RandomizedRunner.java:814)
   [junit4]    > 	at com.carrotsearch.randomizedtesting.RandomizedRunner$7.evaluate(RandomizedRunner.java:875)
   [junit4]    > 	at com.carrotsearch.randomizedtesting.RandomizedRunner$8.evaluate(RandomizedRunner.java:889)
   [junit4]    > 	at com.carrotsearch.randomizedtesting.rules.SystemPropertiesRestoreRule$1.evaluate(SystemPropertiesRestoreRule.java:53)
   [junit4]    > 	at org.apache.lucene.util.TestRuleSetupTeardownChained$1.evaluate(TestRuleSetupTeardownChained.java:50)
   [junit4]    > 	at org.apache.lucene.util.TestRuleFieldCacheSanity$1.evaluate(TestRuleFieldCacheSanity.java:32)
   [junit4]    > 	at org.apache.lucene.util.AbstractBeforeAfterRule$1.evaluate(AbstractBeforeAfterRule.java:45)
   [junit4]    > 	at com.carrotsearch.randomizedtesting.rules.SystemPropertiesInvariantRule$1.evaluate(SystemPropertiesInvariantRule.java:55)
   [junit4]    > 	at org.apache.lucene.util.TestRuleReportUncaughtExceptions$1.evaluate(TestRuleReportUncaughtExceptions.java:68)
   [junit4]    > 	at org.apache.lucene.util.TestRuleThreadAndTestName$1.evaluate(TestRuleThreadAndTestName.java:48)
   [junit4]    > 	at org.apache.lucene.util.TestRuleIgnoreAfterMaxFailures$1.evaluate(TestRuleIgnoreAfterMaxFailures.java:70)
   [junit4]    > 	at org.apache.lucene.util.TestRuleMarkFailure$1.evaluate(TestRuleMarkFailure.java:48)
   [junit4]    > 	at com.carrotsearch.randomizedtesting.RandomizedRunner.runSingleTest(RandomizedRunner.java:821)
   [junit4]    > 	at com.carrotsearch.randomizedtesting.RandomizedRunner.access$700(RandomizedRunner.java:132)
   [junit4]    > 	at com.carrotsearch.randomizedtesting.RandomizedRunner$3$1.run(RandomizedRunner.java:669)
   [junit4]    > 	at com.carrotsearch.randomizedtesting.RandomizedRunner$3.evaluate(RandomizedRunner.java:695)
   [junit4]    > 	at com.carrotsearch.randomizedtesting.RandomizedRunner$4.evaluate(RandomizedRunner.java:734)
   [junit4]    > 	at com.carrotsearch.randomizedtesting.RandomizedRunner$5.evaluate(RandomizedRunner.java:745)
   [junit4]    > 	at com.carrotsearch.randomizedtesting.rules.SystemPropertiesRestoreRule$1.evaluate(SystemPropertiesRestoreRule.java:53)
   [junit4]    > 	at org.apache.lucene.util.AbstractBeforeAfterRule$1.evaluate(AbstractBeforeAfterRule.java:45)
   [junit4]    > 	at org.apache.lucene.util.TestRuleReportUncaughtExceptions$1.evaluate(TestRuleReportUncaughtExceptions.java:68)
   [junit4]    > 	at org.apache.lucene.util.TestRuleStoreClassName$1.evaluate(TestRuleStoreClassName.java:38)
   [junit4]    > 	at org.apache.lucene.util.TestRuleIcuHack$1.evaluate(TestRuleIcuHack.java:51)
   [junit4]    > 	at com.carrotsearch.randomizedtesting.rules.SystemPropertiesInvariantRule$1.evaluate(SystemPropertiesInvariantRule.java:55)
   [junit4]    > 	at org.apache.lucene.util.TestRuleNoInstanceHooksOverrides$1.evaluate(TestRuleNoInstanceHooksOverrides.java:53)
   [junit4]    > 	at org.apache.lucene.util.TestRuleNoStaticHooksShadowing$1.evaluate(TestRuleNoStaticHooksShadowing.java:52)
   [junit4]    > 	at org.apache.lucene.util.TestRuleAssertionsRequired$1.evaluate(TestRuleAssertionsRequired.java:36)
   [junit4]    > 	at org.apache.lucene.util.TestRuleMarkFailure$1.evaluate(TestRuleMarkFailure.java:48)
   [junit4]    > 	at org.apache.lucene.util.TestRuleIgnoreAfterMaxFailures$1.evaluate(TestRuleIgnoreAfterMaxFailures.java:70)
   [junit4]    > 	at org.apache.lucene.util.TestRuleIgnoreTestSuites$1.evaluate(TestRuleIgnoreTestSuites.java:55)
   [junit4]    > 	at com.carrotsearch.randomizedtesting.RandomizedRunner.runSuite(RandomizedRunner.java:605)
   [junit4]    > 	at com.carrotsearch.randomizedtesting.RandomizedRunner.access$400(RandomizedRunner.java:132)
   [junit4]    > 	at com.carrotsearch.randomizedtesting.RandomizedRunner$2.run(RandomizedRunner.java:551)
   [junit4]    > 
   [junit4]   2> 2472 T71 oas.SolrTestCaseJ4.setUp ###Starting testPerDictionary
   [junit4]   2> 2478 T71 C4 UPDATE [collection1] webapp=null path=null params={} {add=[0]} 0 2
   [junit4]   2> 2485 T71 C4 UPDATE [collection1] webapp=null path=null params={} {add=[1]} 0 2
   [junit4]   2> 2491 T71 C4 UPDATE [collection1] webapp=null path=null params={} {add=[2]} 0 1
   [junit4]   2> 2498 T71 C4 UPDATE [collection1] webapp=null path=null params={} {add=[3]} 0 2
   [junit4]   2> 2504 T71 C4 UPDATE [collection1] webapp=null path=null params={} {add=[4]} 0 1
   [junit4]   2> 2511 T71 C4 UPDATE [collection1] webapp=null path=null params={} {add=[5]} 0 1
   [junit4]   2> 2517 T71 C4 UPDATE [collection1] webapp=null path=null params={} {add=[6]} 0 1
   [junit4]   2> 2523 T71 C4 UPDATE [collection1] webapp=null path=null params={} {add=[7]} 0 1
   [junit4]   2> 2530 T71 C4 UPDATE [collection1] webapp=null path=null params={} {add=[8]} 0 2
   [junit4]   2> 2536 T71 C4 UPDATE [collection1] webapp=null path=null params={} {add=[9]} 0 1
   [junit4]   2> 2541 T71 C4 oasu.DirectUpdateHandler2.commit start commit{flags=0,version=0,optimize=false,openSearcher=true,waitSearcher=true,expungeDeletes=false,softCommit=false}
   [junit4]   2> 2547 T71 C4 oasc.SolrDeletionPolicy.onCommit SolrDeletionPolicy.onCommit: commits:num=2
   [junit4]   2> 		commit{dir=MockDirWrapper(org.apache.lucene.store.SimpleFSDirectory@/mnt/ssd/jenkins/workspace/Lucene-Solr-4.x-Linux-Java8-64/checkout/solr/build/solr-core/test/J1/index4319443195tmp lockFactory=org.apache.lucene.store.NativeFSLockFactory@20d4ee30),segFN=segments_6,generation=6,filenames=[segments_6]
   [junit4]   2> 		commit{dir=MockDirWrapper(org.apache.lucene.store.SimpleFSDirectory@/mnt/ssd/jenkins/workspace/Lucene-Solr-4.x-Linux-Java8-64/checkout/solr/build/solr-core/test/J1/index4319443195tmp lockFactory=org.apache.lucene.store.NativeFSLockFactory@20d4ee30),segFN=segments_7,generation=7,filenames=[_3_Lucene40_0.frq, segments_7, _3_nrm.cfe, _3.fdt, _3.fdx, _3_Lucene40_0.prx, _3_nrm.cfs, _3.si, _3_Lucene40_0.tim, _3_Lucene40_0.tip, _3.fnm]
   [junit4]   2> 2548 T71 C4 oasc.SolrDeletionPolicy.updateCommits newest commit = 7
   [junit4]   2> 2551 T71 C4 oass.SolrIndexSearcher.<init> Opening Searcher@193ac3a5 main
   [junit4]   2> 2551 T71 C4 oass.SolrIndexSearcher.<init> WARNING WARNING: Directory impl does not support setting indexDir: org.apache.lucene.store.MockDirectoryWrapper
   [junit4]   2> 2552 T72 oashc.SpellCheckComponent$SpellCheckerListener.buildSpellIndex Building spell index for spell checker: default
   [junit4]   2> 2552 T71 C4 oasu.DirectUpdateHandler2.commit end_commit_flush
   [junit4]   2> 2603 T72 oashc.SpellCheckComponent$SpellCheckerListener.buildSpellIndex Building spell index for spell checker: default_teststop
   [junit4]   2> 2610 T72 oashc.SpellCheckComponent$SpellCheckerListener.buildSpellIndex Building spell index for spell checker: threshold
   [junit4]   2> 2645 T72 oashc.SpellCheckComponent$SpellCheckerListener.buildSpellIndex Building spell index for spell checker: threshold_direct
   [junit4]   2> 2645 T72 oashc.SpellCheckComponent$SpellCheckerListener.buildSpellIndex Building spell index for spell checker: multipleFields
   [junit4]   2> 2699 T72 oashc.SpellCheckComponent$SpellCheckerListener.buildSpellIndex Building spell index for spell checker: freq
   [junit4]   2> 2755 T72 oashc.SpellCheckComponent$SpellCheckerListener.buildSpellIndex Building spell index for spell checker: fqcn
   [junit4]   2> 2809 T72 oasc.SolrCore.registerSearcher [collection1] Registered new searcher Searcher@193ac3a5 main{StandardDirectoryReader(segments_7:11 _3(4.0):C10)}
   [junit4]   2> 2812 T71 C4 UPDATE [collection1] webapp=null path=null params={} {commit=} 0 271
   [junit4]   2> 2815 T71 C4 REQ [collection1] webapp=null path=null params={spellcheck.build=true&q=documemt&json.nl=map&spellcheck..perDict.foo=bar&spellcheck..perDict.bar=foo&spellcheck.dictionary=perDict&spellcheck=true&qt=spellCheckCompRH} hits=0 status=0 QTime=1 
   [junit4]   2> 2816 T71 oas.SolrTestCaseJ4.assertJQ SEVERE query failed JSON validation. error=mismatch: '0'!='2' @ spellcheck/suggestions/bar/startOffset
   [junit4]   2> 	 expected =/spellcheck/suggestions/bar=={"numFound":1, "startOffset":0, "endOffset":1, "suggestion":["foo"]}
   [junit4]   2> 	 response = {
   [junit4]   2> 	  "responseHeader":{
   [junit4]   2> 	    "status":0,
   [junit4]   2> 	    "QTime":1},
   [junit4]   2> 	  "command":"build",
   [junit4]   2> 	  "response":{"numFound":0,"start":0,"docs":[]
   [junit4]   2> 	  },
   [junit4]   2> 	  "spellcheck":{
   [junit4]   2> 	    "suggestions":{
   [junit4]   2> 	      "foo":{
   [junit4]   2> 	        "numFound":1,
   [junit4]   2> 	        "startOffset":0,
   [junit4]   2> 	        "endOffset":1,
   [junit4]   2> 	        "suggestion":["bar"]},
   [junit4]   2> 	      "bar":{
   [junit4]   2> 	        "numFound":1,
   [junit4]   2> 	        "startOffset":2,
   [junit4]   2> 	        "endOffset":3,
   [junit4]   2> 	        "suggestion":["foo"]}}}}
   [junit4]   2> 	
   [junit4]   2> 	 request = spellcheck.build=true&q=documemt&json.nl=map&spellcheck..perDict.foo=bar&spellcheck..perDict.bar=foo&spellcheck.dictionary=perDict&spellcheck=true&qt=spellCheckCompRH
   [junit4]   2> 2816 T71 oas.SolrTestCaseJ4.tearDown ###Ending testPerDictionary
   [junit4]   2> 2820 T71 C4 oasu.DirectUpdateHandler2.deleteAll [collection1] REMOVING ALL DOCUMENTS FROM INDEX
   [junit4]   2> 2821 T71 C4 UPDATE [collection1] webapp=null path=null params={} {deleteByQuery=*:*} 0 1
   [junit4]   2> 2827 T71 C4 oasu.DirectUpdateHandler2.commit start commit{flags=0,version=0,optimize=false,openSearcher=true,waitSearcher=true,expungeDeletes=false,softCommit=false}
   [junit4]   2> 2828 T71 C4 oasc.SolrDeletionPolicy.onCommit SolrDeletionPolicy.onCommit: commits:num=2
   [junit4]   2> 		commit{dir=MockDirWrapper(org.apache.lucene.store.SimpleFSDirectory@/mnt/ssd/jenkins/workspace/Lucene-Solr-4.x-Linux-Java8-64/checkout/solr/build/solr-core/test/J1/index4319443195tmp lockFactory=org.apache.lucene.store.NativeFSLockFactory@20d4ee30),segFN=segments_7,generation=7,filenames=[_3_Lucene40_0.frq, segments_7, _3_nrm.cfe, _3.fdt, _3.fdx, _3_Lucene40_0.prx, _3_nrm.cfs, _3.si, _3_Lucene40_0.tim, _3_Lucene40_0.tip, _3.fnm]
   [junit4]   2> 		commit{dir=MockDirWrapper(org.apache.lucene.store.SimpleFSDirectory@/mnt/ssd/jenkins/workspace/Lucene-Solr-4.x-Linux-Java8-64/checkout/solr/build/solr-core/test/J1/index4319443195tmp lockFactory=org.apache.lucene.store.NativeFSLockFactory@20d4ee30),segFN=segments_8,generation=8,filenames=[segments_8]
   [junit4]   2> 2829 T71 C4 oasc.SolrDeletionPolicy.updateCommits newest commit = 8
   [junit4]   2> 2831 T71 C4 oass.SolrIndexSearcher.<init> Opening Searcher@300283d9 main
   [junit4]   2> 2831 T71 C4 oass.SolrIndexSearcher.<init> WARNING WARNING: Directory impl does not support setting indexDir: org.apache.lucene.store.MockDirectoryWrapper
   [junit4]   2> 2832 T72 oashc.SpellCheckComponent$SpellCheckerListener.buildSpellIndex Building spell index for spell checker: default
   [junit4]   2> 2832 T71 C4 oasu.DirectUpdateHandler2.commit end_commit_flush
   [junit4]   2> 2845 T72 oashc.SpellCheckComponent$SpellCheckerListener.buildSpellIndex Building spell index for spell checker: default_teststop
   [junit4]   2> 2853 T72 oashc.SpellCheckComponent$SpellCheckerListener.buildSpellIndex Building spell index for spell checker: threshold
   [junit4]   2> 2864 T72 oashc.SpellCheckComponent$SpellCheckerListener.buildSpellIndex Building spell index for spell checker: threshold_direct
   [junit4]   2> 2865 T72 oashc.SpellCheckComponent$SpellCheckerListener.buildSpellIndex Building spell index for spell checker: multipleFields
   [junit4]   2> 2875 T72 oashc.SpellCheckComponent$SpellCheckerListener.buildSpellIndex Building spell index for spell checker: freq
   [junit4]   2> 2884 T72 oashc.SpellCheckComponent$SpellCheckerListener.buildSpellIndex Building spell index for spell checker: fqcn
   [junit4]   2> 2894 T72 oasc.SolrCore.registerSearcher [collection1] Registered new searcher Searcher@300283d9 main{StandardDirectoryReader(segments_8:12)}
   [junit4]   2> 2895 T71 C4 UPDATE [collection1] webapp=null path=null params={} {commit=} 0 68
   [junit4]   2> NOTE: reproduce with: ant test  -Dtestcase=SpellCheckComponentTest -Dtests.method=testPerDictionary -Dtests.seed=8B6B7A1149375073 -Dtests.multiplier=3 -Dtests.slow=true -Dtests.locale=et -Dtests.timezone=Europe/Zurich -Dargs="-Dfile.encoding=UTF-8"
   [junit4]   2>
   [junit4]    > (@AfterClass output)
   [junit4]   2> 6372 T71 oas.SolrTestCaseJ4.deleteCore ###deleteCore
   [junit4]   2> 6372 T71 oasc.CoreContainer.shutdown Shutting down CoreContainer instance=224785734
   [junit4]   2> 6373 T71 oasc.SolrCore.close [collection1]  CLOSING SolrCore org.apache.solr.core.SolrCore@4cdc161f
   [junit4]   2> 6373 T71 oasc.SolrCore.closeSearcher [collection1] Closing main searcher on request.
   [junit4]   2> 6373 T71 oasu.DirectUpdateHandler2.close closing DirectUpdateHandler2{commits=20,autocommits=0,soft autocommits=0,optimizes=0,rollbacks=0,expungeDeletes=0,docsPending=0,adds=0,deletesById=0,deletesByQuery=0,errors=0,cumulative_adds=92,cumulative_deletesById=0,cumulative_deletesByQuery=9,cumulative_errors=0}
   [junit4]   2> NOTE: test params are: codec=Lucene40: {start2=PostingsFormat(name=Lucene40WithOrds), end1=Lucene40(minBlockSize=73 maxBlockSize=200), word=Lucene40(minBlockSize=73 maxBlockSize=200), start4=Lucene40(minBlockSize=73 maxBlockSize=200), start3=PostingsFormat(name=Memory doPackFST= false), end3=PostingsFormat(name=Lucene40WithOrds), start1=Pulsing40(freqCutoff=12 minBlockSize=73 maxBlockSize=200), end2=PostingsFormat(name=Memory doPackFST= false), gram2=PostingsFormat(name=Memory doPackFST= false), gram1=Lucene40(minBlockSize=73 maxBlockSize=200), gram4=Pulsing40(freqCutoff=12 minBlockSize=73 maxBlockSize=200), gram3=PostingsFormat(name=Lucene40WithOrds), end4=Pulsing40(freqCutoff=12 minBlockSize=73 maxBlockSize=200)}, sim=RandomSimilarityProvider(queryNorm=false,coord=false): {}, locale=et, timezone=Europe/Zurich
   [junit4]   2> NOTE: Linux 2.6.32-41-server amd64/Oracle Corporation 1.8.0-ea (64-bit)/cpus=8,threads=1,free=162767888,total=228851712
   [junit4]   2> NOTE: All tests run in this JVM: [TestStopFilterFactory, ZkSolrClientTest, DocumentAnalysisRequestHandlerTest, TestEnglishMinimalStemFilterFactory, CommonGramsFilterFactoryTest, TestLMJelinekMercerSimilarityFactory, TestPseudoReturnFields, FileBasedSpellCheckerTest, DebugComponentTest, TestNGramFilters, JsonLoaderTest, SearchHandlerTest, SpellCheckComponentTest]
   [junit4]   2> 
   [junit4] Completed on J1 in 6.40s, 9 tests, 1 error <<< FAILURES!

[...truncated 663 lines...]
   [junit4] Suite: org.apache.solr.handler.component.DistributedQueryElevationComponentTest
   [junit4] ERROR   1.19s J1 | DistributedQueryElevationComponentTest.testDistribSearch
   [junit4]    > Throwable #1: java.lang.IndexOutOfBoundsException: Index: 18, Size: 18
   [junit4]    > 	at __randomizedtesting.SeedInfo.seed([8B6B7A1149375073:A8DF4093E68304F]:0)
   [junit4]    > 	at java.util.ArrayList.rangeCheck(ArrayList.java:603)
   [junit4]    > 	at java.util.ArrayList.get(ArrayList.java:381)
   [junit4]    > 	at org.apache.solr.common.util.NamedList.getName(NamedList.java:127)
   [junit4]    > 	at org.apache.solr.BaseDistributedSearchTestCase.compare(BaseDistributedSearchTestCase.java:466)
   [junit4]    > 	at org.apache.solr.BaseDistributedSearchTestCase.compare(BaseDistributedSearchTestCase.java:612)
   [junit4]    > 	at org.apache.solr.BaseDistributedSearchTestCase.compare(BaseDistributedSearchTestCase.java:500)
   [junit4]    > 	at org.apache.solr.BaseDistributedSearchTestCase.compare(BaseDistributedSearchTestCase.java:612)
   [junit4]    > 	at org.apache.solr.BaseDistributedSearchTestCase.compare(BaseDistributedSearchTestCase.java:500)
   [junit4]    > 	at org.apache.solr.BaseDistributedSearchTestCase.compareResponses(BaseDistributedSearchTestCase.java:667)
   [junit4]    > 	at org.apache.solr.BaseDistributedSearchTestCase.query(BaseDistributedSearchTestCase.java:392)
   [junit4]    > 	at org.apache.solr.handler.component.DistributedQueryElevationComponentTest.doTest(DistributedQueryElevationComponentTest.java:81)
   [junit4]    > 	at org.apache.solr.BaseDistributedSearchTestCase.testDistribSearch(BaseDistributedSearchTestCase.java:679)
   [junit4]    > 	at sun.reflect.NativeMethodAccessorImpl.invoke0(Native Method)
   [junit4]    > 	at sun.reflect.NativeMethodAccessorImpl.invoke(NativeMethodAccessorImpl.java:57)
   [junit4]    > 	at sun.reflect.DelegatingMethodAccessorImpl.invoke(DelegatingMethodAccessorImpl.java:43)
   [junit4]    > 	at java.lang.reflect.Method.invoke(Method.java:474)
   [junit4]    > 	at com.carrotsearch.randomizedtesting.RandomizedRunner.invoke(RandomizedRunner.java:1969)
   [junit4]    > 	at com.carrotsearch.randomizedtesting.RandomizedRunner.access$1100(RandomizedRunner.java:132)
   [junit4]    > 	at com.carrotsearch.randomizedtesting.RandomizedRunner$6.evaluate(RandomizedRunner.java:814)
   [junit4]    > 	at com.carrotsearch.randomizedtesting.RandomizedRunner$7.evaluate(RandomizedRunner.java:875)
   [junit4]    > 	at com.carrotsearch.randomizedtesting.RandomizedRunner$8.evaluate(RandomizedRunner.java:889)
   [junit4]    > 	at com.carrotsearch.randomizedtesting.rules.SystemPropertiesRestoreRule$1.evaluate(SystemPropertiesRestoreRule.java:53)
   [junit4]    > 	at org.apache.lucene.util.TestRuleSetupTeardownChained$1.evaluate(TestRuleSetupTeardownChained.java:50)
   [junit4]    > 	at org.apache.lucene.util.TestRuleFieldCacheSanity$1.evaluate(TestRuleFieldCacheSanity.java:32)
   [junit4]    > 	at org.apache.lucene.util.AbstractBeforeAfterRule$1.evaluate(AbstractBeforeAfterRule.java:45)
   [junit4]    > 	at com.carrotsearch.randomizedtesting.rules.SystemPropertiesInvariantRule$1.evaluate(SystemPropertiesInvariantRule.java:55)
   [junit4]    > 	at org.apache.lucene.util.TestRuleReportUncaughtExceptions$1.evaluate(TestRuleReportUncaughtExceptions.java:68)
   [junit4]    > 	at org.apache.lucene.util.TestRuleThreadAndTestName$1.evaluate(TestRuleThreadAndTestName.java:48)
   [junit4]    > 	at org.apache.lucene.util.TestRuleIgnoreAfterMaxFailures$1.evaluate(TestRuleIgnoreAfterMaxFailures.java:70)
   [junit4]    > 	at org.apache.lucene.util.TestRuleMarkFailure$1.evaluate(TestRuleMarkFailure.java:48)
   [junit4]    > 	at com.carrotsearch.randomizedtesting.RandomizedRunner.runSingleTest(RandomizedRunner.java:821)
   [junit4]    > 	at com.carrotsearch.randomizedtesting.RandomizedRunner.access$700(RandomizedRunner.java:132)
   [junit4]    > 	at com.carrotsearch.randomizedtesting.RandomizedRunner$3$1.run(RandomizedRunner.java:669)
   [junit4]    > 	at com.carrotsearch.randomizedtesting.RandomizedRunner$3.evaluate(RandomizedRunner.java:695)
   [junit4]    > 	at com.carrotsearch.randomizedtesting.RandomizedRunner$4.evaluate(RandomizedRunner.java:734)
   [junit4]    > 	at com.carrotsearch.randomizedtesting.RandomizedRunner$5.evaluate(RandomizedRunner.java:745)
   [junit4]    > 	at com.carrotsearch.randomizedtesting.rules.SystemPropertiesRestoreRule$1.evaluate(SystemPropertiesRestoreRule.java:53)
   [junit4]    > 	at org.apache.lucene.util.AbstractBeforeAfterRule$1.evaluate(AbstractBeforeAfterRule.java:45)
   [junit4]    > 	at org.apache.lucene.util.TestRuleReportUncaughtExceptions$1.evaluate(TestRuleReportUncaughtExceptions.java:68)
   [junit4]    > 	at org.apache.lucene.util.TestRuleStoreClassName$1.evaluate(TestRuleStoreClassName.java:38)
   [junit4]    > 	at org.apache.lucene.util.TestRuleIcuHack$1.evaluate(TestRuleIcuHack.java:51)
   [junit4]    > 	at com.carrotsearch.randomizedtesting.rules.SystemPropertiesInvariantRule$1.evaluate(SystemPropertiesInvariantRule.java:55)
   [junit4]    > 	at org.apache.lucene.util.TestRuleNoInstanceHooksOverrides$1.evaluate(TestRuleNoInstanceHooksOverrides.java:53)
   [junit4]    > 	at org.apache.lucene.util.TestRuleNoStaticHooksShadowing$1.evaluate(TestRuleNoStaticHooksShadowing.java:52)
   [junit4]    > 	at org.apache.lucene.util.TestRuleAssertionsRequired$1.evaluate(TestRuleAssertionsRequired.java:36)
   [junit4]    > 	at org.apache.lucene.util.TestRuleMarkFailure$1.evaluate(TestRuleMarkFailure.java:48)
   [junit4]    > 	at org.apache.lucene.util.TestRuleIgnoreAfterMaxFailures$1.evaluate(TestRuleIgnoreAfterMaxFailures.java:70)
   [junit4]    > 	at org.apache.lucene.util.TestRuleIgnoreTestSuites$1.evaluate(TestRuleIgnoreTestSuites.java:55)
   [junit4]    > 	at com.carrotsearch.randomizedtesting.RandomizedRunner.runSuite(RandomizedRunner.java:605)
   [junit4]    > 	at com.carrotsearch.randomizedtesting.RandomizedRunner.access$400(RandomizedRunner.java:132)
   [junit4]    > 	at com.carrotsearch.randomizedtesting.RandomizedRunner$2.run(RandomizedRunner.java:551)
   [junit4]    > 
   [junit4]   2> 1 T1912 oas.SolrTestCaseJ4.setUp ###Starting testDistribSearch
   [junit4]   2> 2 T1912 oejs.Server.doStart jetty-8.1.2.v20120308
   [junit4]   2> 4 T1912 oejs.AbstractConnector.doStart Started SocketConnector@0.0.0.0:58929
   [junit4]   2> 4 T1912 oasc.SolrResourceLoader.locateSolrHome JNDI not configured for solr (NoInitialContextEx)
   [junit4]   2> 5 T1912 oasc.SolrResourceLoader.locateSolrHome using system property solr.solr.home: /mnt/ssd/jenkins/workspace/Lucene-Solr-4.x-Linux-Java8-64/checkout/solr/build/solr-core/test-files/solr
   [junit4]   2> 5 T1912 oasc.SolrResourceLoader.<init> new SolrResourceLoader for deduced Solr Home: '/mnt/ssd/jenkins/workspace/Lucene-Solr-4.x-Linux-Java8-64/checkout/solr/build/solr-core/test-files/solr/'
   [junit4]   2> 8 T1912 oass.SolrDispatchFilter.init SolrDispatchFilter.init()
   [junit4]   2> 8 T1912 oasc.SolrResourceLoader.locateSolrHome JNDI not configured for solr (NoInitialContextEx)
   [junit4]   2> 9 T1912 oasc.SolrResourceLoader.locateSolrHome using system property solr.solr.home: /mnt/ssd/jenkins/workspace/Lucene-Solr-4.x-Linux-Java8-64/checkout/solr/build/solr-core/test-files/solr
   [junit4]   2> 9 T1912 oasc.CoreContainer$Initializer.initialize looking for solr.xml: /mnt/ssd/jenkins/workspace/Lucene-Solr-4.x-Linux-Java8-64/checkout/solr/build/solr-core/test-files/solr/solr.xml
   [junit4]   2> 9 T1912 oasc.CoreContainer.<init> New CoreContainer 182211001
   [junit4]   2> 9 T1912 oasc.CoreContainer.load Loading CoreContainer using Solr Home: '/mnt/ssd/jenkins/workspace/Lucene-Solr-4.x-Linux-Java8-64/checkout/solr/build/solr-core/test-files/solr/'
   [junit4]   2> 10 T1912 oasc.SolrResourceLoader.<init> new SolrResourceLoader for directory: '/mnt/ssd/jenkins/workspace/Lucene-Solr-4.x-Linux-Java8-64/checkout/solr/build/solr-core/test-files/solr/'
   [junit4]   2> 16 T1912 oasc.CoreContainer.load Registering Log Listener
   [junit4]   2> 27 T1912 oashc.HttpShardHandlerFactory.getParameter Setting socketTimeout to: 0
   [junit4]   2> 28 T1912 oashc.HttpShardHandlerFactory.getParameter Setting urlScheme to: http://
   [junit4]   2> 28 T1912 oashc.HttpShardHandlerFactory.getParameter Setting connTimeout to: 0
   [junit4]   2> 28 T1912 oashc.HttpShardHandlerFactory.getParameter Setting maxConnectionsPerHost to: 20
   [junit4]   2> 28 T1912 oashc.HttpShardHandlerFactory.getParameter Setting corePoolSize to: 0
   [junit4]   2> 29 T1912 oashc.HttpShardHandlerFactory.getParameter Setting maximumPoolSize to: 2147483647
   [junit4]   2> 29 T1912 oashc.HttpShardHandlerFactory.getParameter Setting maxThreadIdleTime to: 5
   [junit4]   2> 29 T1912 oashc.HttpShardHandlerFactory.getParameter Setting sizeOfQueue to: -1
   [junit4]   2> 29 T1912 oashc.HttpShardHandlerFactory.getParameter Setting fairnessPolicy to: false
   [junit4]   2> 30 T1912 oascsi.HttpClientUtil.createClient Creating new http client, config:maxConnectionsPerHost=20&maxConnections=10000&socketTimeout=0&connTimeout=0&retry=false
   [junit4]   2> 36 T1912 oasc.CoreContainer.create Creating SolrCore 'collection1' using instanceDir: /mnt/ssd/jenkins/workspace/Lucene-Solr-4.x-Linux-Java8-64/checkout/solr/build/solr-core/test-files/solr/collection1
   [junit4]   2> 37 T1912 oasc.SolrResourceLoader.<init> new SolrResourceLoader for directory: '/mnt/ssd/jenkins/workspace/Lucene-Solr-4.x-Linux-Java8-64/checkout/solr/build/solr-core/test-files/solr/collection1/'
   [junit4]   2> 37 T1912 oasc.SolrResourceLoader.replaceClassLoader Adding 'file:/mnt/ssd/jenkins/workspace/Lucene-Solr-4.x-Linux-Java8-64/checkout/solr/build/solr-core/test-files/solr/collection1/lib/classes/' to classloader
   [junit4]   2> 37 T1912 oasc.SolrResourceLoader.replaceClassLoader Adding 'file:/mnt/ssd/jenkins/workspace/Lucene-Solr-4.x-Linux-Java8-64/checkout/solr/build/solr-core/test-files/solr/collection1/lib/README' to classloader
   [junit4]   2> 57 T1912 oasc.SolrConfig.<init> Using Lucene MatchVersion: LUCENE_40
   [junit4]   2> 97 T1912 oasc.SolrConfig.<init> Loaded SolrConfig: solrconfig-elevate.xml
   [junit4]   2> 98 T1912 oass.IndexSchema.readSchema Reading Solr Schema
   [junit4]   2> 101 T1912 oass.IndexSchema.readSchema Schema name=example
   [junit4]   2> 211 T1912 oass.IndexSchema.readSchema default search field in schema is text
   [junit4]   2> 213 T1912 oass.IndexSchema.readSchema unique key field: id
   [junit4]   2> 215 T1912 oasc.SolrCore.<init> [collection1] Opening new SolrCore at /mnt/ssd/jenkins/workspace/Lucene-Solr-4.x-Linux-Java8-64/checkout/solr/build/solr-core/test-files/solr/collection1/, dataDir=./org.apache.solr.handler.component.DistributedQueryElevationComponentTest-1341332480404/control/data/
   [junit4]   2> 215 T1912 oasc.JmxMonitoredMap.<init> JMX monitoring is enabled. Adding Solr mbeans to JMX Server: com.sun.jmx.mbeanserver.JmxMBeanServer@845ca53
   [junit4]   2> 215 T1912 oasc.SolrCore.getNewIndexDir WARNING New index directory detected: old=null new=./org.apache.solr.handler.component.DistributedQueryElevationComponentTest-1341332480404/control/data/index/
   [junit4]   2> 216 T1912 oasc.SolrCore.initIndex WARNING [collection1] Solr index directory './org.apache.solr.handler.component.DistributedQueryElevationComponentTest-1341332480404/control/data/index' doesn't exist. Creating new index...
   [junit4]   2> 217 T1912 oasc.SolrDeletionPolicy.onCommit SolrDeletionPolicy.onCommit: commits:num=1
   [junit4]   2> 		commit{dir=MockDirWrapper(org.apache.lucene.store.RAMDirectory@426e294c lockFactory=org.apache.lucene.store.SingleInstanceLockFactory@4d550c79),segFN=segments_1,generation=1,filenames=[segments_1]
   [junit4]   2> 217 T1912 oasc.SolrDeletionPolicy.updateCommits newest commit = 1
   [junit4]   2> 220 T1912 oasc.RequestHandlers.initHandlersFromConfig created /update: solr.UpdateRequestHandler
   [junit4]   2> 220 T1912 oasc.RequestHandlers.initHandlersFromConfig created /elevate: org.apache.solr.handler.component.SearchHandler
   [junit4]   2> 220 T1912 oasc.RequestHandlers.initHandlersFromConfig created /dataElevate: org.apache.solr.handler.component.SearchHandler
   [junit4]   2> 221 T1912 oashl.XMLLoader.init xsltCacheLifetimeSeconds=60
   [junit4]   2> 221 T1912 oasc.RequestHandlers.initHandlersFromConfig WARNING no default request handler is registered (either '/select' or 'standard')
   [junit4]   2> 222 T1912 oasc.SolrCore.initDeprecatedSupport WARNING solrconfig.xml uses deprecated <admin/gettableFiles>, Please update your config to use the ShowFileRequestHandler.
   [junit4]   2> 222 T1912 oasc.SolrCore.initDeprecatedSupport WARNING adding ShowFileRequestHandler with hidden files: [STOPTYPES-1.TXT, BAD-SCHEMA-NOT-INDEXED-BUT-POS.XML, SCHEMA-NUMERIC.XML, SOLRCONFIG-PHRASESUGGEST.XML, SOLRCONFIG-TERMINDEX.XML, SOLRCONFIG-SOLR-749.XML, DA_UTF8.XML, SOLRCONFIG-QUERYSENDER-NOQUERY.XML, BAD-SCHEMA-DUP-FIELD.XML, SCHEMA11.XML, SOLRCONFIG-PROPINJECT-INDEXDEFAULT.XML, SOLRCONFIG-QUERYSENDER.XML, CURRENCY.XML, SCHEMA-REPLICATION2.XML, BAD-SCHEMA-EXTERNAL-FILEFIELD.XML, OPEN-EXCHANGE-RATES.JSON, BAD-SCHEMA-UNIQUEKEY-IS-COPYFIELD-DEST.XML, SCHEMA_CODEC.XML, SCHEMA-SIM.XML, SYNONYMS.TXT, SOLRCONFIG-DELPOLICY1.XML, STOP-2.TXT, BAD-SCHEMA-NONTEXT-ANALYZER.XML, BAD-SCHEMA-OMIT-TF-BUT-NOT-POS.XML, XSLT, BAD-SCHEMA-NOT-INDEXED-BUT-NORMS.XML, SOLRCONFIG-BASIC-LUCENEVERSION31.XML, BAD-SCHEMA-DUP-DYNAMICFIELD.XML, BAD-SCHEMA-SIM-GLOBAL-VS-FT-MISMATCH.XML, SOLRCONFIG-REQHANDLER.INCL, DA_COMPOUNDDICTIONARY.TXT, BAD_SOLRCONFIG.XML, SOLRCONFIG-TRANSFORMERS.XML, COMPOUNDDICTIONARY.TXT, SCHEMA-SPELLCHECKER.XML, SCHEMA-LMDIRICHLET.XML, SCHEMA-REPLICATION1.XML, STOP-1.TXT, SCHEMA-STOP-KEEP.XML, PHRASESUGGEST.TXT, SCHEMA-NOT-REQUIRED-UNIQUE-KEY.XML, SCHEMA-TFIDF.XML, SOLRCONFIG-SIMPLELOCK.XML, STOPWITHBOM.TXT, SOLRCONFIG-SPELLCHECKCOMPONENT.XML, SCHEMA-TRIE.XML, MAPPING-ISOLATIN1ACCENT.TXT, SCHEMA-PHRASESUGGEST.XML, BAD-SCHEMA-NOT-INDEXED-BUT-TF.XML, SOLRCONFIG-MASTER.XML, SOLRCONFIG-DELPOLICY2.XML, SOLRCONFIG-LAZYWRITER.XML, SOLRCONFIG-MASTER2.XML, SOLRCONFIG-REPEATER.XML, OLD_SYNONYMS.TXT, SOLRCONFIG_PERF.XML, PROTWORDS.TXT, SCHEMA-DFR.XML, SOLRCONFIG-SLAVE1.XML, SOLRCONFIG-TLOG.XML, SCHEMA-MINIMAL.XML, SCHEMA-COLLATEFILTER.XML, SCHEMA-COLLATE.XML, BAD-MP-SOLRCONFIG.XML, STOPWORDS.TXT, STOPWORDSWRONGENCODING.TXT, KEEP-2.TXT, SOLRCONFIG-SOLCOREPROPERTIES.XML, SOLRCONFIG-SPELLCHECKER.XML, SCHEMA-COPYFIELD-TEST.XML, SCHEMA15.XML, HUNSPELL-TEST.DIC, SOLRCONFIG-MERGEPOLICY.XML, SOLRCONFIG-UPDATE-PROCESSOR-CHAINS.XML, SOLRCONFIG-BASIC.XML, SOLRCONFIG-FUNCTIONQUERY.XML, SOLRCONFIG-HIGHLIGHT.XML, HUNSPELL-TEST.AFF, SCHEMA-BM25.XML, SOLRCONFIG-ELEVATE.XML, STOP-SNOWBALL.TXT, BAD-SCHEMA-DUP-FIELDTYPE.XML, SOLRCONFIG-MASTER1.XML, KEEP-1.TXT, SOLRCONFIG-PROPINJECT.XML, BAD-SCHEMA-UNIQUEKEY-USES-DEFAULT.XML, SCHEMA-REQUIRED-FIELDS.XML, SOLRCONFIG-XINCLUDE.XML, SCHEMA12.XML, SCHEMA-LMJELINEKMERCER.XML, SOLRCONFIG_CODEC.XML, HYPHENATION.DTD, SOLRCONFIG-CACHING.XML, WDFTYPES.TXT, SCHEMA-REVERSED.XML, FRENCHARTICLES.TXT, STEMDICT.TXT, SOLRCONFIG-SLAVE.XML, SCHEMA-FOLDING.XML, SOLRCONFIG-NATIVELOCK.XML, SOLRCONFIG-ENABLEPLUGIN.XML, SOLRCONFIG-MASTER1-KEEPONEBACKUP.XML, SCHEMA-BINARYFIELD.XML, SCHEMA-LUCENEMATCHVERSION.XML, STOPTYPES-2.TXT, SOLRCONFIG-MASTER3.XML, SCHEMA.XML, SOLRCONFIG-NOCACHE.XML, SOLRCONFIG-ALTDIRECTORY.XML, ELEVATE.XML, SCHEMASURROUND.XML, SCHEMA-IB.XML]
   [junit4]   2> 224 T1912 oass.SolrIndexSearcher.<init> Opening Searcher@7b4d4e4f main
   [junit4]   2> 224 T1912 oass.SolrIndexSearcher.<init> WARNING WARNING: Directory impl does not support setting indexDir: org.apache.lucene.store.MockDirectoryWrapper
   [junit4]   2> 224 T1912 oasu.CommitTracker.<init> Hard AutoCommit: disabled
   [junit4]   2> 224 T1912 oasu.CommitTracker.<init> Soft AutoCommit: disabled
   [junit4]   2> 226 T1912 oashc.QueryElevationComponent.inform Loading QueryElevation from: /mnt/ssd/jenkins/workspace/Lucene-Solr-4.x-Linux-Java8-64/checkout/solr/build/solr-core/test-files/solr/collection1/conf/elevate.xml
   [junit4]   2> 232 T1912 oashc.QueryElevationComponent.inform Loading QueryElevation from: /mnt/ssd/jenkins/workspace/Lucene-Solr-4.x-Linux-Java8-64/checkout/solr/build/solr-core/test-files/solr/collection1/conf/elevate.xml
   [junit4]   2> 237 T1922 oasc.SolrCore.registerSearcher [collection1] Registered new searcher Searcher@7b4d4e4f main{StandardDirectoryReader(segments_1:1)}
   [junit4]   2> 238 T1912 oasc.CoreContainer.register registering core: collection1
   [junit4]   2> 238 T1912 oass.SolrDispatchFilter.init user.dir=/mnt/ssd/jenkins/workspace/Lucene-Solr-4.x-Linux-Java8-64/checkout/solr/build/solr-core/test/J1
   [junit4]   2> 238 T1912 oass.SolrDispatchFilter.init SolrDispatchFilter.init() done
   [junit4]   2> 238 T1912 oascsi.HttpClientUtil.createClient Creating new http client, config:maxConnections=128&maxConnectionsPerHost=32&followRedirects=false
   [junit4]   2> 241 T1912 oejs.Server.doStart jetty-8.1.2.v20120308
   [junit4]   2> 243 T1912 oejs.AbstractConnector.doStart Started SocketConnector@0.0.0.0:49551
   [junit4]   2> 244 T1912 oasc.SolrResourceLoader.locateSolrHome JNDI not configured for solr (NoInitialContextEx)
   [junit4]   2> 245 T1912 oasc.SolrResourceLoader.locateSolrHome using system property solr.solr.home: /mnt/ssd/jenkins/workspace/Lucene-Solr-4.x-Linux-Java8-64/checkout/solr/build/solr-core/test-files/solr
   [junit4]   2> 245 T1912 oasc.SolrResourceLoader.<init> new SolrResourceLoader for deduced Solr Home: '/mnt/ssd/jenkins/workspace/Lucene-Solr-4.x-Linux-Java8-64/checkout/solr/build/solr-core/test-files/solr/'
   [junit4]   2> 249 T1912 oass.SolrDispatchFilter.init SolrDispatchFilter.init()
   [junit4]   2> 249 T1912 oasc.SolrResourceLoader.locateSolrHome JNDI not configured for solr (NoInitialContextEx)
   [junit4]   2> 249 T1912 oasc.SolrResourceLoader.locateSolrHome using system property solr.solr.home: /mnt/ssd/jenkins/workspace/Lucene-Solr-4.x-Linux-Java8-64/checkout/solr/build/solr-core/test-files/solr
   [junit4]   2> 250 T1912 oasc.CoreContainer$Initializer.initialize looking for solr.xml: /mnt/ssd/jenkins/workspace/Lucene-Solr-4.x-Linux-Java8-64/checkout/solr/build/solr-core/test-files/solr/solr.xml
   [junit4]   2> 250 T1912 oasc.CoreContainer.<init> New CoreContainer 155999841
   [junit4]   2> 250 T1912 oasc.CoreContainer.load Loading CoreContainer using Solr Home: '/mnt/ssd/jenkins/workspace/Lucene-Solr-4.x-Linux-Java8-64/checkout/solr/build/solr-core/test-files/solr/'
   [junit4]   2> 250 T1912 oasc.SolrResourceLoader.<init> new SolrResourceLoader for directory: '/mnt/ssd/jenkins/workspace/Lucene-Solr-4.x-Linux-Java8-64/checkout/solr/build/solr-core/test-files/solr/'
   [junit4]   2> 257 T1912 oasc.CoreContainer.load Registering Log Listener
   [junit4]   2> 265 T1912 oashc.HttpShardHandlerFactory.getParameter Setting socketTimeout to: 0
   [junit4]   2> 265 T1912 oashc.HttpShardHandlerFactory.getParameter Setting urlScheme to: http://
   [junit4]   2> 265 T1912 oashc.HttpShardHandlerFactory.getParameter Setting connTimeout to: 0
   [junit4]   2> 265 T1912 oashc.HttpShardHandlerFactory.getParameter Setting maxConnectionsPerHost to: 20
   [junit4]   2> 265 T1912 oashc.HttpShardHandlerFactory.getParameter Setting corePoolSize to: 0
   [junit4]   2> 266 T1912 oashc.HttpShardHandlerFactory.getParameter Setting maximumPoolSize to: 2147483647
   [junit4]   2> 266 T1912 oashc.HttpShardHandlerFactory.getParameter Setting maxThreadIdleTime to: 5
   [junit4]   2> 266 T1912 oashc.HttpShardHandlerFactory.getParameter Setting sizeOfQueue to: -1
   [junit4]   2> 266 T1912 oashc.HttpShardHandlerFactory.getParameter Setting fairnessPolicy to: false
   [junit4]   2> 266 T1912 oascsi.HttpClientUtil.createClient Creating new http client, config:maxConnectionsPerHost=20&maxConnections=10000&socketTimeout=0&connTimeout=0&retry=false
   [junit4]   2> 270 T1912 oasc.CoreContainer.create Creating SolrCore 'collection1' using instanceDir: /mnt/ssd/jenkins/workspace/Lucene-Solr-4.x-Linux-Java8-64/checkout/solr/build/solr-core/test-files/solr/collection1
   [junit4]   2> 271 T1912 oasc.SolrResourceLoader.<init> new SolrResourceLoader for directory: '/mnt/ssd/jenkins/workspace/Lucene-Solr-4.x-Linux-Java8-64/checkout/solr/build/solr-core/test-files/solr/collection1/'
   [junit4]   2> 271 T1912 oasc.SolrResourceLoader.replaceClassLoader Adding 'file:/mnt/ssd/jenkins/workspace/Lucene-Solr-4.x-Linux-Java8-64/checkout/solr/build/solr-core/test-files/solr/collection1/lib/classes/' to classloader
   [junit4]   2> 271 T1912 oasc.SolrResourceLoader.replaceClassLoader Adding 'file:/mnt/ssd/jenkins/workspace/Lucene-Solr-4.x-Linux-Java8-64/checkout/solr/build/solr-core/test-files/solr/collection1/lib/README' to classloader
   [junit4]   2> 285 T1912 oasc.SolrConfig.<init> Using Lucene MatchVersion: LUCENE_40
   [junit4]   2> 311 T1912 oasc.SolrConfig.<init> Loaded SolrConfig: solrconfig-elevate.xml
   [junit4]   2> 312 T1912 oass.IndexSchema.readSchema Reading Solr Schema
   [junit4]   2> 314 T1912 oass.IndexSchema.readSchema Schema name=example
   [junit4]   2> 422 T1912 oass.IndexSchema.readSchema default search field in schema is text
   [junit4]   2> 424 T1912 oass.IndexSchema.readSchema unique key field: id
   [junit4]   2> 425 T1912 oasc.SolrCore.<init> [collection1] Opening new SolrCore at /mnt/ssd/jenkins/workspace/Lucene-Solr-4.x-Linux-Java8-64/checkout/solr/build/solr-core/test-files/solr/collection1/, dataDir=./org.apache.solr.handler.component.DistributedQueryElevationComponentTest-1341332480404/shard0/data/
   [junit4]   2> 426 T1912 oasc.JmxMonitoredMap.<init> JMX monitoring is enabled. Adding Solr mbeans to JMX Server: com.sun.jmx.mbeanserver.JmxMBeanServer@845ca53
   [junit4]   2> 426 T1912 oasc.SolrCore.getNewIndexDir WARNING New index directory detected: old=null new=./org.apache.solr.handler.component.DistributedQueryElevationComponentTest-1341332480404/shard0/data/index/
   [junit4]   2> 426 T1912 oasc.SolrCore.initIndex WARNING [collection1] Solr index directory './org.apache.solr.handler.component.DistributedQueryElevationComponentTest-1341332480404/shard0/data/index' doesn't exist. Creating new index...
   [junit4]   2> 427 T1912 oasc.SolrDeletionPolicy.onCommit SolrDeletionPolicy.onCommit: commits:num=1
   [junit4]   2> 		commit{dir=MockDirWrapper(org.apache.lucene.store.RAMDirectory@722c0001 lockFactory=org.apache.lucene.store.SingleInstanceLockFactory@1346d114),segFN=segments_1,generation=1,filenames=[segments_1]
   [junit4]   2> 428 T1912 oasc.SolrDeletionPolicy.updateCommits newest commit = 1
   [junit4]   2> 428 T1912 oasc.RequestHandlers.initHandlersFromConfig created /update: solr.UpdateRequestHandler
   [junit4]   2> 429 T1912 oasc.RequestHandlers.initHandlersFromConfig created /elevate: org.apache.solr.handler.component.SearchHandler
   [junit4]   2> 429 T1912 oasc.RequestHandlers.initHandlersFromConfig created /dataElevate: org.apache.solr.handler.component.SearchHandler
   [junit4]   2> 429 T1912 oashl.XMLLoader.init xsltCacheLifetimeSeconds=60
   [junit4]   2> 429 T1912 oasc.RequestHandlers.initHandlersFromConfig WARNING no default request handler is registered (either '/select' or 'standard')
   [junit4]   2> 430 T1912 oasc.SolrCore.initDeprecatedSupport WARNING solrconfig.xml uses deprecated <admin/gettableFiles>, Please update your config to use the ShowFileRequestHandler.
   [junit4]   2> 431 T1912 oasc.SolrCore.initDeprecatedSupport WARNING adding ShowFileRequestHandler with hidden files: [STOPTYPES-1.TXT, BAD-SCHEMA-NOT-INDEXED-BUT-POS.XML, SCHEMA-NUMERIC.XML, SOLRCONFIG-PHRASESUGGEST.XML, SOLRCONFIG-TERMINDEX.XML, SOLRCONFIG-SOLR-749.XML, DA_UTF8.XML, SOLRCONFIG-QUERYSENDER-NOQUERY.XML, BAD-SCHEMA-DUP-FIELD.XML, SCHEMA11.XML, SOLRCONFIG-PROPINJECT-INDEXDEFAULT.XML, SOLRCONFIG-QUERYSENDER.XML, CURRENCY.XML, SCHEMA-REPLICATION2.XML, BAD-SCHEMA-EXTERNAL-FILEFIELD.XML, OPEN-EXCHANGE-RATES.JSON, BAD-SCHEMA-UNIQUEKEY-IS-COPYFIELD-DEST.XML, SCHEMA_CODEC.XML, SCHEMA-SIM.XML, SYNONYMS.TXT, SOLRCONFIG-DELPOLICY1.XML, STOP-2.TXT, BAD-SCHEMA-NONTEXT-ANALYZER.XML, BAD-SCHEMA-OMIT-TF-BUT-NOT-POS.XML, XSLT, BAD-SCHEMA-NOT-INDEXED-BUT-NORMS.XML, SOLRCONFIG-BASIC-LUCENEVERSION31.XML, BAD-SCHEMA-DUP-DYNAMICFIELD.XML, BAD-SCHEMA-SIM-GLOBAL-VS-FT-MISMATCH.XML, SOLRCONFIG-REQHANDLER.INCL, DA_COMPOUNDDICTIONARY.TXT, BAD_SOLRCONFIG.XML, SOLRCONFIG-TRANSFORMERS.XML, COMPOUNDDICTIONARY.TXT, SCHEMA-SPELLCHECKER.XML, SCHEMA-LMDIRICHLET.XML, SCHEMA-REPLICATION1.XML, STOP-1.TXT, SCHEMA-STOP-KEEP.XML, PHRASESUGGEST.TXT, SCHEMA-NOT-REQUIRED-UNIQUE-KEY.XML, SCHEMA-TFIDF.XML, SOLRCONFIG-SIMPLELOCK.XML, STOPWITHBOM.TXT, SOLRCONFIG-SPELLCHECKCOMPONENT.XML, SCHEMA-TRIE.XML, MAPPING-ISOLATIN1ACCENT.TXT, SCHEMA-PHRASESUGGEST.XML, BAD-SCHEMA-NOT-INDEXED-BUT-TF.XML, SOLRCONFIG-MASTER.XML, SOLRCONFIG-DELPOLICY2.XML, SOLRCONFIG-LAZYWRITER.XML, SOLRCONFIG-MASTER2.XML, SOLRCONFIG-REPEATER.XML, OLD_SYNONYMS.TXT, SOLRCONFIG_PERF.XML, PROTWORDS.TXT, SCHEMA-DFR.XML, SOLRCONFIG-SLAVE1.XML, SOLRCONFIG-TLOG.XML, SCHEMA-MINIMAL.XML, SCHEMA-COLLATEFILTER.XML, SCHEMA-COLLATE.XML, BAD-MP-SOLRCONFIG.XML, STOPWORDS.TXT, STOPWORDSWRONGENCODING.TXT, KEEP-2.TXT, SOLRCONFIG-SOLCOREPROPERTIES.XML, SOLRCONFIG-SPELLCHECKER.XML, SCHEMA-COPYFIELD-TEST.XML, SCHEMA15.XML, HUNSPELL-TEST.DIC, SOLRCONFIG-MERGEPOLICY.XML, SOLRCONFIG-UPDATE-PROCESSOR-CHAINS.XML, SOLRCONFIG-BASIC.XML, SOLRCONFIG-FUNCTIONQUERY.XML, SOLRCONFIG-HIGHLIGHT.XML, HUNSPELL-TEST.AFF, SCHEMA-BM25.XML, SOLRCONFIG-ELEVATE.XML, STOP-SNOWBALL.TXT, BAD-SCHEMA-DUP-FIELDTYPE.XML, SOLRCONFIG-MASTER1.XML, KEEP-1.TXT, SOLRCONFIG-PROPINJECT.XML, BAD-SCHEMA-UNIQUEKEY-USES-DEFAULT.XML, SCHEMA-REQUIRED-FIELDS.XML, SOLRCONFIG-XINCLUDE.XML, SCHEMA12.XML, SCHEMA-LMJELINEKMERCER.XML, SOLRCONFIG_CODEC.XML, HYPHENATION.DTD, SOLRCONFIG-CACHING.XML, WDFTYPES.TXT, SCHEMA-REVERSED.XML, FRENCHARTICLES.TXT, STEMDICT.TXT, SOLRCONFIG-SLAVE.XML, SCHEMA-FOLDING.XML, SOLRCONFIG-NATIVELOCK.XML, SOLRCONFIG-ENABLEPLUGIN.XML, SOLRCONFIG-MASTER1-KEEPONEBACKUP.XML, SCHEMA-BINARYFIELD.XML, SCHEMA-LUCENEMATCHVERSION.XML, STOPTYPES-2.TXT, SOLRCONFIG-MASTER3.XML, SCHEMA.XML, SOLRCONFIG-NOCACHE.XML, SOLRCONFIG-ALTDIRECTORY.XML, ELEVATE.XML, SCHEMASURROUND.XML, SCHEMA-IB.XML]
   [junit4]   2> 432 T1912 oass.SolrIndexSearcher.<init> Opening Searcher@307c93c4 main
   [junit4]   2> 432 T1912 oass.SolrIndexSearcher.<init> WARNING WARNING: Directory impl does not support setting indexDir: org.apache.lucene.store.MockDirectoryWrapper
   [junit4]   2> 432 T1912 oasu.CommitTracker.<init> Hard AutoCommit: disabled
   [junit4]   2> 433 T1912 oasu.CommitTracker.<init> Soft AutoCommit: disabled
   [junit4]   2> 433 T1912 oashc.QueryElevationComponent.inform Loading QueryElevation from: /mnt/ssd/jenkins/workspace/Lucene-Solr-4.x-Linux-Java8-64/checkout/solr/build/solr-core/test-files/solr/collection1/conf/elevate.xml
   [junit4]   2> 438 T1912 oashc.QueryElevationComponent.inform Loading QueryElevation from: /mnt/ssd/jenkins/workspace/Lucene-Solr-4.x-Linux-Java8-64/checkout/solr/build/solr-core/test-files/solr/collection1/conf/elevate.xml
   [junit4]   2> 443 T1932 oasc.SolrCore.registerSearcher [collection1] Registered new searcher Searcher@307c93c4 main{StandardDirectoryReader(segments_1:1)}
   [junit4]   2> 443 T1912 oasc.CoreContainer.register registering core: collection1
   [junit4]   2> 444 T1912 oass.SolrDispatchFilter.init user.dir=/mnt/ssd/jenkins/workspace/Lucene-Solr-4.x-Linux-Java8-64/checkout/solr/build/solr-core/test/J1
   [junit4]   2> 444 T1912 oass.SolrDispatchFilter.init SolrDispatchFilter.init() done
   [junit4]   2> 444 T1912 oascsi.HttpClientUtil.createClient Creating new http client, config:maxConnections=128&maxConnectionsPerHost=32&followRedirects=false
   [junit4]   2> 446 T1912 oejs.Server.doStart jetty-8.1.2.v20120308
   [junit4]   2> 448 T1912 oejs.AbstractConnector.doStart Started SocketConnector@0.0.0.0:40371
   [junit4]   2> 448 T1912 oasc.SolrResourceLoader.locateSolrHome JNDI not configured for solr (NoInitialContextEx)
   [junit4]   2> 448 T1912 oasc.SolrResourceLoader.locateSolrHome using system property solr.solr.home: /mnt/ssd/jenkins/workspace/Lucene-Solr-4.x-Linux-Java8-64/checkout/solr/build/solr-core/test-files/solr
   [junit4]   2> 448 T1912 oasc.SolrResourceLoader.<init> new SolrResourceLoader for deduced Solr Home: '/mnt/ssd/jenkins/workspace/Lucene-Solr-4.x-Linux-Java8-64/checkout/solr/build/solr-core/test-files/solr/'
   [junit4]   2> 451 T1912 oass.SolrDispatchFilter.init SolrDispatchFilter.init()
   [junit4]   2> 451 T1912 oasc.SolrResourceLoader.locateSolrHome JNDI not configured for solr (NoInitialContextEx)
   [junit4]   2> 451 T1912 oasc.SolrResourceLoader.locateSolrHome using system property solr.solr.home: /mnt/ssd/jenkins/workspace/Lucene-Solr-4.x-Linux-Java8-64/checkout/solr/build/solr-core/test-files/solr
   [junit4]   2> 451 T1912 oasc.CoreContainer$Initializer.initialize looking for solr.xml: /mnt/ssd/jenkins/workspace/Lucene-Solr-4.x-Linux-Java8-64/checkout/solr/build/solr-core/test-files/solr/solr.xml
   [junit4]   2> 452 T1912 oasc.CoreContainer.<init> New CoreContainer 1022234080
   [junit4]   2> 452 T1912 oasc.CoreContainer.load Loading CoreContainer using Solr Home: '/mnt/ssd/jenkins/workspace/Lucene-Solr-4.x-Linux-Java8-64/checkout/solr/build/solr-core/test-files/solr/'
   [junit4]   2> 452 T1912 oasc.SolrResourceLoader.<init> new SolrResourceLoader for directory: '/mnt/ssd/jenkins/workspace/Lucene-Solr-4.x-Linux-Java8-64/checkout/solr/build/solr-core/test-files/solr/'
   [junit4]   2> 456 T1912 oasc.CoreContainer.load Registering Log Listener
   [junit4]   2> 463 T1912 oashc.HttpShardHandlerFactory.getParameter Setting socketTimeout to: 0
   [junit4]   2> 463 T1912 oashc.HttpShardHandlerFactory.getParameter Setting urlScheme to: http://
   [junit4]   2> 463 T1912 oashc.HttpShardHandlerFactory.getParameter Setting connTimeout to: 0
   [junit4]   2> 463 T1912 oashc.HttpShardHandlerFactory.getParameter Setting maxConnectionsPerHost to: 20
   [junit4]   2> 464 T1912 oashc.HttpShardHandlerFactory.getParameter Setting corePoolSize to: 0
   [junit4]   2> 464 T1912 oashc.HttpShardHandlerFactory.getParameter Setting maximumPoolSize to: 2147483647
   [junit4]   2> 464 T1912 oashc.HttpShardHandlerFactory.getParameter Setting maxThreadIdleTime to: 5
   [junit4]   2> 464 T1912 oashc.HttpShardHandlerFactory.getParameter Setting sizeOfQueue to: -1
   [junit4]   2> 464 T1912 oashc.HttpShardHandlerFactory.getParameter Setting fairnessPolicy to: false
   [junit4]   2> 464 T1912 oascsi.HttpClientUtil.createClient Creating new http client, config:maxConnectionsPerHost=20&maxConnections=10000&socketTimeout=0&connTimeout=0&retry=false
   [junit4]   2> 468 T1912 oasc.CoreContainer.create Creating SolrCore 'collection1' using instanceDir: /mnt/ssd/jenkins/workspace/Lucene-Solr-4.x-Linux-Java8-64/checkout/solr/build/solr-core/test-files/solr/collection1
   [junit4]   2> 468 T1912 oasc.SolrResourceLoader.<init> new SolrResourceLoader for directory: '/mnt/ssd/jenkins/workspace/Lucene-Solr-4.x-Linux-Java8-64/checkout/solr/build/solr-core/test-files/solr/collection1/'
   [junit4]   2> 469 T1912 oasc.SolrResourceLoader.replaceClassLoader Adding 'file:/mnt/ssd/jenkins/workspace/Lucene-Solr-4.x-Linux-Java8-64/checkout/solr/build/solr-core/test-files/solr/collection1/lib/classes/' to classloader
   [junit4]   2> 469 T1912 oasc.SolrResourceLoader.replaceClassLoader Adding 'file:/mnt/ssd/jenkins/workspace/Lucene-Solr-4.x-Linux-Java8-64/checkout/solr/build/solr-core/test-files/solr/collection1/lib/README' to classloader
   [junit4]   2> 482 T1912 oasc.SolrConfig.<init> Using Lucene MatchVersion: LUCENE_40
   [junit4]   2> 509 T1912 oasc.SolrConfig.<init> Loaded SolrConfig: solrconfig-elevate.xml
   [junit4]   2> 509 T1912 oass.IndexSchema.readSchema Reading Solr Schema
   [junit4]   2> 512 T1912 oass.IndexSchema.readSchema Schema name=example
   [junit4]   2> 621 T1912 oass.IndexSchema.readSchema default search field in schema is text
   [junit4]   2> 623 T1912 oass.IndexSchema.readSchema unique key field: id
   [junit4]   2> 624 T1912 oasc.SolrCore.<init> [collection1] Opening new SolrCore at /mnt/ssd/jenkins/workspace/Lucene-Solr-4.x-Linux-Java8-64/checkout/solr/build/solr-core/test-files/solr/collection1/, dataDir=./org.apache.solr.handler.component.DistributedQueryElevationComponentTest-1341332480404/shard1/data/
   [junit4]   2> 625 T1912 oasc.JmxMonitoredMap.<init> JMX monitoring is enabled. Adding Solr mbeans to JMX Server: com.sun.jmx.mbeanserver.JmxMBeanServer@845ca53
   [junit4]   2> 625 T1912 oasc.SolrCore.getNewIndexDir WARNING New index directory detected: old=null new=./org.apache.solr.handler.component.DistributedQueryElevationComponentTest-1341332480404/shard1/data/index/
   [junit4]   2> 625 T1912 oasc.SolrCore.initIndex WARNING [collection1] Solr index directory './org.apache.solr.handler.component.DistributedQueryElevationComponentTest-1341332480404/shard1/data/index' doesn't exist. Creating new index...
   [junit4]   2> 626 T1912 oasc.SolrDeletionPolicy.onCommit SolrDeletionPolicy.onCommit: commits:num=1
   [junit4]   2> 		commit{dir=MockDirWrapper(org.apache.lucene.store.RAMDirectory@65244d9a lockFactory=org.apache.lucene.store.SingleInstanceLockFactory@7ccbc2f1),segFN=segments_1,generation=1,filenames=[segments_1]
   [junit4]   2> 627 T1912 oasc.SolrDeletionPolicy.updateCommits newest commit = 1
   [junit4]   2> 627 T1912 oasc.RequestHandlers.initHandlersFromConfig created /update: solr.UpdateRequestHandler
   [junit4]   2> 628 T1912 oasc.RequestHandlers.initHandlersFromConfig created /elevate: org.apache.solr.handler.component.SearchHandler
   [junit4]   2> 628 T1912 oasc.RequestHandlers.initHandlersFromConfig created /dataElevate: org.apache.solr.handler.component.SearchHandler
   [junit4]   2> 628 T1912 oashl.XMLLoader.init xsltCacheLifetimeSeconds=60
   [junit4]   2> 628 T1912 oasc.RequestHandlers.initHandlersFromConfig WARNING no default request handler is registered (either '/select' or 'standard')
   [junit4]   2> 629 T1912 oasc.SolrCore.initDeprecatedSupport WARNING solrconfig.xml uses deprecated <admin/gettableFiles>, Please update your config to use the ShowFileRequestHandler.
   [junit4]   2> 630 T1912 oasc.SolrCore.initDeprecatedSupport WARNING adding ShowFileRequestHandler with hidden files: [STOPTYPES-1.TXT, BAD-SCHEMA-NOT-INDEXED-BUT-POS.XML, SCHEMA-NUMERIC.XML, SOLRCONFIG-PHRASESUGGEST.XML, SOLRCONFIG-TERMINDEX.XML, SOLRCONFIG-SOLR-749.XML, DA_UTF8.XML, SOLRCONFIG-QUERYSENDER-NOQUERY.XML, BAD-SCHEMA-DUP-FIELD.XML, SCHEMA11.XML, SOLRCONFIG-PROPINJECT-INDEXDEFAULT.XML, SOLRCONFIG-QUERYSENDER.XML, CURRENCY.XML, SCHEMA-REPLICATION2.XML, BAD-SCHEMA-EXTERNAL-FILEFIELD.XML, OPEN-EXCHANGE-RATES.JSON, BAD-SCHEMA-UNIQUEKEY-IS-COPYFIELD-DEST.XML, SCHEMA_CODEC.XML, SCHEMA-SIM.XML, SYNONYMS.TXT, SOLRCONFIG-DELPOLICY1.XML, STOP-2.TXT, BAD-SCHEMA-NONTEXT-ANALYZER.XML, BAD-SCHEMA-OMIT-TF-BUT-NOT-POS.XML, XSLT, BAD-SCHEMA-NOT-INDEXED-BUT-NORMS.XML, SOLRCONFIG-BASIC-LUCENEVERSION31.XML, BAD-SCHEMA-DUP-DYNAMICFIELD.XML, BAD-SCHEMA-SIM-GLOBAL-VS-FT-MISMATCH.XML, SOLRCONFIG-REQHANDLER.INCL, DA_COMPOUNDDICTIONARY.TXT, BAD_SOLRCONFIG.XML, SOLRCONFIG-TRANSFORMERS.XML, COMPOUNDDICTIONARY.TXT, SCHEMA-SPELLCHECKER.XML, SCHEMA-LMDIRICHLET.XML, SCHEMA-REPLICATION1.XML, STOP-1.TXT, SCHEMA-STOP-KEEP.XML, PHRASESUGGEST.TXT, SCHEMA-NOT-REQUIRED-UNIQUE-KEY.XML, SCHEMA-TFIDF.XML, SOLRCONFIG-SIMPLELOCK.XML, STOPWITHBOM.TXT, SOLRCONFIG-SPELLCHECKCOMPONENT.XML, SCHEMA-TRIE.XML, MAPPING-ISOLATIN1ACCENT.TXT, SCHEMA-PHRASESUGGEST.XML, BAD-SCHEMA-NOT-INDEXED-BUT-TF.XML, SOLRCONFIG-MASTER.XML, SOLRCONFIG-DELPOLICY2.XML, SOLRCONFIG-LAZYWRITER.XML, SOLRCONFIG-MASTER2.XML, SOLRCONFIG-REPEATER.XML, OLD_SYNONYMS.TXT, SOLRCONFIG_PERF.XML, PROTWORDS.TXT, SCHEMA-DFR.XML, SOLRCONFIG-SLAVE1.XML, SOLRCONFIG-TLOG.XML, SCHEMA-MINIMAL.XML, SCHEMA-COLLATEFILTER.XML, SCHEMA-COLLATE.XML, BAD-MP-SOLRCONFIG.XML, STOPWORDS.TXT, STOPWORDSWRONGENCODING.TXT, KEEP-2.TXT, SOLRCONFIG-SOLCOREPROPERTIES.XML, SOLRCONFIG-SPELLCHECKER.XML, SCHEMA-COPYFIELD-TEST.XML, SCHEMA15.XML, HUNSPELL-TEST.DIC, SOLRCONFIG-MERGEPOLICY.XML, SOLRCONFIG-UPDATE-PROCESSOR-CHAINS.XML, SOLRCONFIG-BASIC.XML, SOLRCONFIG-FUNCTIONQUERY.XML, SOLRCONFIG-HIGHLIGHT.XML, HUNSPELL-TEST.AFF, SCHEMA-BM25.XML, SOLRCONFIG-ELEVATE.XML, STOP-SNOWBALL.TXT, BAD-SCHEMA-DUP-FIELDTYPE.XML, SOLRCONFIG-MASTER1.XML, KEEP-1.TXT, SOLRCONFIG-PROPINJECT.XML, BAD-SCHEMA-UNIQUEKEY-USES-DEFAULT.XML, SCHEMA-REQUIRED-FIELDS.XML, SOLRCONFIG-XINCLUDE.XML, SCHEMA12.XML, SCHEMA-LMJELINEKMERCER.XML, SOLRCONFIG_CODEC.XML, HYPHENATION.DTD, SOLRCONFIG-CACHING.XML, WDFTYPES.TXT, SCHEMA-REVERSED.XML, FRENCHARTICLES.TXT, STEMDICT.TXT, SOLRCONFIG-SLAVE.XML, SCHEMA-FOLDING.XML, SOLRCONFIG-NATIVELOCK.XML, SOLRCONFIG-ENABLEPLUGIN.XML, SOLRCONFIG-MASTER1-KEEPONEBACKUP.XML, SCHEMA-BINARYFIELD.XML, SCHEMA-LUCENEMATCHVERSION.XML, STOPTYPES-2.TXT, SOLRCONFIG-MASTER3.XML, SCHEMA.XML, SOLRCONFIG-NOCACHE.XML, SOLRCONFIG-ALTDIRECTORY.XML, ELEVATE.XML, SCHEMASURROUND.XML, SCHEMA-IB.XML]
   [junit4]   2> 631 T1912 oass.SolrIndexSearcher.<init> Opening Searcher@64fbdd47 main
   [junit4]   2> 631 T1912 oass.SolrIndexSearcher.<init> WARNING WARNING: Directory impl does not support setting indexDir: org.apache.lucene.store.MockDirectoryWrapper
   [junit4]   2> 632 T1912 oasu.CommitTracker.<init> Hard AutoCommit: disabled
   [junit4]   2> 632 T1912 oasu.CommitTracker.<init> Soft AutoCommit: disabled
   [junit4]   2> 632 T1912 oashc.QueryElevationComponent.inform Loading QueryElevation from: /mnt/ssd/jenkins/workspace/Lucene-Solr-4.x-Linux-Java8-64/checkout/solr/build/solr-core/test-files/solr/collection1/conf/elevate.xml
   [junit4]   2> 641 T1912 oashc.QueryElevationComponent.inform Loading QueryElevation from: /mnt/ssd/jenkins/workspace/Lucene-Solr-4.x-Linux-Java8-64/checkout/solr/build/solr-core/test-files/solr/collection1/conf/elevate.xml
   [junit4]   2> 647 T1942 oasc.SolrCore.registerSearcher [collection1] Registered new searcher Searcher@64fbdd47 main{StandardDirectoryReader(segments_1:1)}
   [junit4]   2> 647 T1912 oasc.CoreContainer.register registering core: collection1
   [junit4]   2> 647 T1912 oass.SolrDispatchFilter.init user.dir=/mnt/ssd/jenkins/workspace/Lucene-Solr-4.x-Linux-Java8-64/checkout/solr/build/solr-core/test/J1
   [junit4]   2> 648 T1912 oass.SolrDispatchFilter.init SolrDispatchFilter.init() done
   [junit4]   2> 648 T1912 oascsi.HttpClientUtil.createClient Creating new http client, config:maxConnections=128&maxConnectionsPerHost=32&followRedirects=false
   [junit4]   2> 651 T1912 oejs.Server.doStart jetty-8.1.2.v20120308
   [junit4]   2> 652 T1912 oejs.AbstractConnector.doStart Started SocketConnector@0.0.0.0:55566
   [junit4]   2> 652 T1912 oasc.SolrResourceLoader.locateSolrHome JNDI not configured for solr (NoInitialContextEx)
   [junit4]   2> 653 T1912 oasc.SolrResourceLoader.locateSolrHome using system property solr.solr.home: /mnt/ssd/jenkins/workspace/Lucene-Solr-4.x-Linux-Java8-64/checkout/solr/build/solr-core/test-files/solr
   [junit4]   2> 653 T1912 oasc.SolrResourceLoader.<init> new SolrResourceLoader for deduced Solr Home: '/mnt/ssd/jenkins/workspace/Lucene-Solr-4.x-Linux-Java8-64/checkout/solr/build/solr-core/test-files/solr/'
   [junit4]   2> 656 T1912 oass.SolrDispatchFilter.init SolrDispatchFilter.init()
   [junit4]   2> 656 T1912 oasc.SolrResourceLoader.locateSolrHome JNDI not configured for solr (NoInitialContextEx)
   [junit4]   2> 656 T1912 oasc.SolrResourceLoader.locateSolrHome using system property solr.solr.home: /mnt/ssd/jenkins/workspace/Lucene-Solr-4.x-Linux-Java8-64/checkout/solr/build/solr-core/test-files/solr
   [junit4]   2> 656 T1912 oasc.CoreContainer$Initializer.initialize looking for solr.xml: /mnt/ssd/jenkins/workspace/Lucene-Solr-4.x-Linux-Java8-64/checkout/solr/build/solr-core/test-files/solr/solr.xml
   [junit4]   2> 657 T1912 oasc.CoreContainer.<init> New CoreContainer 986151177
   [junit4]   2> 657 T1912 oasc.CoreContainer.load Loading CoreContainer using Solr Home: '/mnt/ssd/jenkins/workspace/Lucene-Solr-4.x-Linux-Java8-64/checkout/solr/build/solr-core/test-files/solr/'
   [junit4]   2> 657 T1912 oasc.SolrResourceLoader.<init> new SolrResourceLoader for directory: '/mnt/ssd/jenkins/workspace/Lucene-Solr-4.x-Linux-Java8-64/checkout/solr/build/solr-core/test-files/solr/'
   [junit4]   2> 664 T1912 oasc.CoreContainer.load Registering Log Listener
   [junit4]   2> 674 T1912 oashc.HttpShardHandlerFactory.getParameter Setting socketTimeout to: 0
   [junit4]   2> 674 T1912 oashc.HttpShardHandlerFactory.getParameter Setting urlScheme to: http://
   [junit4]   2> 675 T1912 oashc.HttpShardHandlerFactory.getParameter Setting connTimeout to: 0
   [junit4]   2> 675 T1912 oashc.HttpShardHandlerFactory.getParameter Setting maxConnectionsPerHost to: 20
   [junit4]   2> 675 T1912 oashc.HttpShardHandlerFactory.getParameter Setting corePoolSize to: 0
   [junit4]   2> 675 T1912 oashc.HttpShardHandlerFactory.getParameter Setting maximumPoolSize to: 2147483647
   [junit4]   2> 676 T1912 oashc.HttpShardHandlerFactory.getParameter Setting maxThreadIdleTime to: 5
   [junit4]   2> 676 T1912 oashc.HttpShardHandlerFactory.getParameter Setting sizeOfQueue to: -1
   [junit4]   2> 676 T1912 oashc.HttpShardHandlerFactory.getParameter Setting fairnessPolicy to: false
   [junit4]   2> 676 T1912 oascsi.HttpClientUtil.createClient Creating new http client, config:maxConnectionsPerHost=20&maxConnections=10000&socketTimeout=0&connTimeout=0&retry=false
   [junit4]   2> 683 T1912 oasc.CoreContainer.create Creating SolrCore 'collection1' using instanceDir: /mnt/ssd/jenkins/workspace/Lucene-Solr-4.x-Linux-Java8-64/checkout/solr/build/solr-core/test-files/solr/collection1
   [junit4]   2> 683 T1912 oasc.SolrResourceLoader.<init> new SolrResourceLoader for directory: '/mnt/ssd/jenkins/workspace/Lucene-Solr-4.x-Linux-Java8-64/checkout/solr/build/solr-core/test-files/solr/collection1/'
   [junit4]   2> 684 T1912 oasc.SolrResourceLoader.replaceClassLoader Adding 'file:/mnt/ssd/jenkins/workspace/Lucene-Solr-4.x-Linux-Java8-64/checkout/solr/build/solr-core/test-files/solr/collection1/lib/classes/' to classloader
   [junit4]   2> 684 T1912 oasc.SolrResourceLoader.replaceClassLoader Adding 'file:/mnt/ssd/jenkins/workspace/Lucene-Solr-4.x-Linux-Java8-64/checkout/solr/build/solr-core/test-files/solr/collection1/lib/README' to classloader
   [junit4]   2> 704 T1912 oasc.SolrConfig.<init> Using Lucene MatchVersion: LUCENE_40
   [junit4]   2> 736 T1912 oasc.SolrConfig.<init> Loaded SolrConfig: solrconfig-elevate.xml
   [junit4]   2> 737 T1912 oass.IndexSchema.readSchema Reading Solr Schema
   [junit4]   2> 739 T1912 oass.IndexSchema.readSchema Schema name=example
   [junit4]   2> 852 T1912 oass.IndexSchema.readSchema default search field in schema is text
   [junit4]   2> 853 T1912 oass.IndexSchema.readSchema unique key field: id
   [junit4]   2> 855 T1912 oasc.SolrCore.<init> [collection1] Opening new SolrCore at /mnt/ssd/jenkins/workspace/Lucene-Solr-4.x-Linux-Java8-64/checkout/solr/build/solr-core/test-files/solr/collection1/, dataDir=./org.apache.solr.handler.component.DistributedQueryElevationComponentTest-1341332480404/shard2/data/
   [junit4]   2> 856 T1912 oasc.JmxMonitoredMap.<init> JMX monitoring is enabled. Adding Solr mbeans to JMX Server: com.sun.jmx.mbeanserver.JmxMBeanServer@845ca53
   [junit4]   2> 856 T1912 oasc.SolrCore.getNewIndexDir WARNING New index directory detected: old=null new=./org.apache.solr.handler.component.DistributedQueryElevationComponentTest-1341332480404/shard2/data/index/
   [junit4]   2> 856 T1912 oasc.SolrCore.initIndex WARNING [collection1] Solr index directory './org.apache.solr.handler.component.DistributedQueryElevationComponentTest-1341332480404/shard2/data/index' doesn't exist. Creating new index...
   [junit4]   2> 857 T1912 oasc.SolrDeletionPolicy.onCommit SolrDeletionPolicy.onCommit: commits:num=1
   [junit4]   2> 		commit{dir=MockDirWrapper(org.apache.lucene.store.RAMDirectory@1edab280 lockFactory=org.apache.lucene.store.SingleInstanceLockFactory@536204a7),segFN=segments_1,generation=1,filenames=[segments_1]
   [junit4]   2> 858 T1912 oasc.SolrDeletionPolicy.updateCommits newest commit = 1
   [junit4]   2> 858 T1912 oasc.RequestHandlers.initHandlersFromConfig created /update: solr.UpdateRequestHandler
   [junit4]   2> 858 T1912 oasc.RequestHandlers.initHandlersFromConfig created /elevate: org.apache.solr.handler.component.SearchHandler
   [junit4]   2> 859 T1912 oasc.RequestHandlers.initHandlersFromConfig created /dataElevate: org.apache.solr.handler.component.SearchHandler
   [junit4]   2> 859 T1912 oashl.XMLLoader.init xsltCacheLifetimeSeconds=60
   [junit4]   2> 859 T1912 oasc.RequestHandlers.initHandlersFromConfig WARNING no default request handler is registered (either '/select' or 'standard')
   [junit4]   2> 860 T1912 oasc.SolrCore.initDeprecatedSupport WARNING solrconfig.xml uses deprecated <admin/gettableFiles>, Please update your config to use the ShowFileRequestHandler.
   [junit4]   2> 861 T1912 oasc.SolrCore.initDeprecatedSupport WARNING adding ShowFileRequestHandler with hidden files: [STOPTYPES-1.TXT, BAD-SCHEMA-NOT-INDEXED-BUT-POS.XML, SCHEMA-NUMERIC.XML, SOLRCONFIG-PHRASESUGGEST.XML, SOLRCONFIG-TERMINDEX.XML, SOLRCONFIG-SOLR-749.XML, DA_UTF8.XML, SOLRCONFIG-QUERYSENDER-NOQUERY.XML, BAD-SCHEMA-DUP-FIELD.XML, SCHEMA11.XML, SOLRCONFIG-PROPINJECT-INDEXDEFAULT.XML, SOLRCONFIG-QUERYSENDER.XML, CURRENCY.XML, SCHEMA-REPLICATION2.XML, BAD-SCHEMA-EXTERNAL-FILEFIELD.XML, OPEN-EXCHANGE-RATES.JSON, BAD-SCHEMA-UNIQUEKEY-IS-COPYFIELD-DEST.XML, SCHEMA_CODEC.XML, SCHEMA-SIM.XML, SYNONYMS.TXT, SOLRCONFIG-DELPOLICY1.XML, STOP-2.TXT, BAD-SCHEMA-NONTEXT-ANALYZER.XML, BAD-SCHEMA-OMIT-TF-BUT-NOT-POS.XML, XSLT, BAD-SCHEMA-NOT-INDEXED-BUT-NORMS.XML, SOLRCONFIG-BASIC-LUCENEVERSION31.XML, BAD-SCHEMA-DUP-DYNAMICFIELD.XML, BAD-SCHEMA-SIM-GLOBAL-VS-FT-MISMATCH.XML, SOLRCONFIG-REQHANDLER.INCL, DA_COMPOUNDDICTIONARY.TXT, BAD_SOLRCONFIG.XML, SOLRCONFIG-TRANSFORMERS.XML, COMPOUNDDICTIONARY.TXT, SCHEMA-SPELLCHECKER.XML, SCHEMA-LMDIRICHLET.XML, SCHEMA-REPLICATION1.XML, STOP-1.TXT, SCHEMA-STOP-KEEP.XML, PHRASESUGGEST.TXT, SCHEMA-NOT-REQUIRED-UNIQUE-KEY.XML, SCHEMA-TFIDF.XML, SOLRCONFIG-SIMPLELOCK.XML, STOPWITHBOM.TXT, SOLRCONFIG-SPELLCHECKCOMPONENT.XML, SCHEMA-TRIE.XML, MAPPING-ISOLATIN1ACCENT.TXT, SCHEMA-PHRASESUGGEST.XML, BAD-SCHEMA-NOT-INDEXED-BUT-TF.XML, SOLRCONFIG-MASTER.XML, SOLRCONFIG-DELPOLICY2.XML, SOLRCONFIG-LAZYWRITER.XML, SOLRCONFIG-MASTER2.XML, SOLRCONFIG-REPEATER.XML, OLD_SYNONYMS.TXT, SOLRCONFIG_PERF.XML, PROTWORDS.TXT, SCHEMA-DFR.XML, SOLRCONFIG-SLAVE1.XML, SOLRCONFIG-TLOG.XML, SCHEMA-MINIMAL.XML, SCHEMA-COLLATEFILTER.XML, SCHEMA-COLLATE.XML, BAD-MP-SOLRCONFIG.XML, STOPWORDS.TXT, STOPWORDSWRONGENCODING.TXT, KEEP-2.TXT, SOLRCONFIG-SOLCOREPROPERTIES.XML, SOLRCONFIG-SPELLCHECKER.XML, SCHEMA-COPYFIELD-TEST.XML, SCHEMA15.XML, HUNSPELL-TEST.DIC, SOLRCONFIG-MERGEPOLICY.XML, SOLRCONFIG-UPDATE-PROCESSOR-CHAINS.XML, SOLRCONFIG-BASIC.XML, SOLRCONFIG-FUNCTIONQUERY.XML, SOLRCONFIG-HIGHLIGHT.XML, HUNSPELL-TEST.AFF, SCHEMA-BM25.XML, SOLRCONFIG-ELEVATE.XML, STOP-SNOWBALL.TXT, BAD-SCHEMA-DUP-FIELDTYPE.XML, SOLRCONFIG-MASTER1.XML, KEEP-1.TXT, SOLRCONFIG-PROPINJECT.XML, BAD-SCHEMA-UNIQUEKEY-USES-DEFAULT.XML, SCHEMA-REQUIRED-FIELDS.XML, SOLRCONFIG-XINCLUDE.XML, SCHEMA12.XML, SCHEMA-LMJELINEKMERCER.XML, SOLRCONFIG_CODEC.XML, HYPHENATION.DTD, SOLRCONFIG-CACHING.XML, WDFTYPES.TXT, SCHEMA-REVERSED.XML, FRENCHARTICLES.TXT, STEMDICT.TXT, SOLRCONFIG-SLAVE.XML, SCHEMA-FOLDING.XML, SOLRCONFIG-NATIVELOCK.XML, SOLRCONFIG-ENABLEPLUGIN.XML, SOLRCONFIG-MASTER1-KEEPONEBACKUP.XML, SCHEMA-BINARYFIELD.XML, SCHEMA-LUCENEMATCHVERSION.XML, STOPTYPES-2.TXT, SOLRCONFIG-MASTER3.XML, SCHEMA.XML, SOLRCONFIG-NOCACHE.XML, SOLRCONFIG-ALTDIRECTORY.XML, ELEVATE.XML, SCHEMASURROUND.XML, SCHEMA-IB.XML]
   [junit4]   2> 862 T1912 oass.SolrIndexSearcher.<init> Opening Searcher@5019be2f main
   [junit4]   2> 862 T1912 oass.SolrIndexSearcher.<init> WARNING WARNING: Directory impl does not support setting indexDir: org.apache.lucene.store.MockDirectoryWrapper
   [junit4]   2> 862 T1912 oasu.CommitTracker.<init> Hard AutoCommit: disabled
   [junit4]   2> 863 T1912 oasu.CommitTracker.<init> Soft AutoCommit: disabled
   [junit4]   2> 863 T1912 oashc.QueryElevationComponent.inform Loading QueryElevation from: /mnt/ssd/jenkins/workspace/Lucene-Solr-4.x-Linux-Java8-64/checkout/solr/build/solr-core/test-files/solr/collection1/conf/elevate.xml
   [junit4]   2> 868 T1912 oashc.QueryElevationComponent.inform Loading QueryElevation from: /mnt/ssd/jenkins/workspace/Lucene-Solr-4.x-Linux-Java8-64/checkout/solr/build/solr-core/test-files/solr/collection1/conf/elevate.xml
   [junit4]   2> 873 T1952 oasc.SolrCore.registerSearcher [collection1] Registered new searcher Searcher@5019be2f main{StandardDirectoryReader(segments_1:1)}
   [junit4]   2> 873 T1912 oasc.CoreContainer.register registering core: collection1
   [junit4]   2> 874 T1912 oass.SolrDispatchFilter.init user.dir=/mnt/ssd/jenkins/workspace/Lucene-Solr-4.x-Linux-Java8-64/checkout/solr/build/solr-core/test/J1
   [junit4]   2> 874 T1912 oass.SolrDispatchFilter.init SolrDispatchFilter.init() done
   [junit4]   2> 874 T1912 oascsi.HttpClientUtil.createClient Creating new http client, config:maxConnections=128&maxConnectionsPerHost=32&followRedirects=false
   [junit4]   2> ASYNC  NEW_CORE C98 name=collection1 org.apache.solr.core.SolrCore@507f0245
   [junit4]   2> 885 T1915 C98 oasu.DirectUpdateHandler2.deleteAll [collection1] REMOVING ALL DOCUMENTS FROM INDEX
   [junit4]   2> 886 T1915 C98 oasc.SolrDeletionPolicy.onInit SolrDeletionPolicy.onInit: commits:num=1
   [junit4]   2> 		commit{dir=MockDirWrapper(org.apache.lucene.store.RAMDirectory@426e294c lockFactory=org.apache.lucene.store.SingleInstanceLockFactory@4d550c79),segFN=segments_1,generation=1,filenames=[segments_1]
   [junit4]   2> 887 T1915 C98 oasc.SolrDeletionPolicy.updateCommits newest commit = 1
   [junit4]   2> 887 T1915 C98 UPDATE [collection1] webapp=/solr path=/update params={wt=javabin&version=2} {deleteByQuery=*:*} 0 3
   [junit4]   2> ASYNC  NEW_CORE C99 name=collection1 org.apache.solr.core.SolrCore@531e6ba0
   [junit4]   2> 891 T1925 C99 oasu.DirectUpdateHandler2.deleteAll [collection1] REMOVING ALL DOCUMENTS FROM INDEX
   [junit4]   2> 892 T1925 C99 oasc.SolrDeletionPolicy.onInit SolrDeletionPolicy.onInit: commits:num=1
   [junit4]   2> 		commit{dir=MockDirWrapper(org.apache.lucene.store.RAMDirectory@722c0001 lockFactory=org.apache.lucene.store.SingleInstanceLockFactory@1346d114),segFN=segments_1,generation=1,filenames=[segments_1]
   [junit4]   2> 893 T1925 C99 oasc.SolrDeletionPolicy.updateCommits newest commit = 1
   [junit4]   2> 893 T1925 C99 UPDATE [collection1] webapp=/solr path=/update params={wt=javabin&version=2} {deleteByQuery=*:*} 0 3
   [junit4]   2> ASYNC  NEW_CORE C100 name=collection1 org.apache.solr.core.SolrCore@5306d373
   [junit4]   2> 896 T1935 C100 oasu.DirectUpdateHandler2.deleteAll [collection1] REMOVING ALL DOCUMENTS FROM INDEX
   [junit4]   2> 897 T1935 C100 oasc.SolrDeletionPolicy.onInit SolrDeletionPolicy.onInit: commits:num=1
   [junit4]   2> 		commit{dir=MockDirWrapper(org.apache.lucene.store.RAMDirectory@65244d9a lockFactory=org.apache.lucene.store.SingleInstanceLockFactory@7ccbc2f1),segFN=segments_1,generation=1,filenames=[segments_1]
   [junit4]   2> 898 T1935 C100 oasc.SolrDeletionPolicy.updateCommits newest commit = 1
   [junit4]   2> 898 T1935 C100 UPDATE [collection1] webapp=/solr path=/update params={wt=javabin&version=2} {deleteByQuery=*:*} 0 2
   [junit4]   2> ASYNC  NEW_CORE C101 name=collection1 org.apache.solr.core.SolrCore@36b8cdf9
   [junit4]   2> 905 T1945 C101 oasu.DirectUpdateHandler2.deleteAll [collection1] REMOVING ALL DOCUMENTS FROM INDEX
   [junit4]   2> 906 T1945 C101 oasc.SolrDeletionPolicy.onInit SolrDeletionPolicy.onInit: commits:num=1
   [junit4]   2> 		commit{dir=MockDirWrapper(org.apache.lucene.store.RAMDirectory@1edab280 lockFactory=org.apache.lucene.store.SingleInstanceLockFactory@536204a7),segFN=segments_1,generation=1,filenames=[segments_1]
   [junit4]   2> 907 T1945 C101 oasc.SolrDeletionPolicy.updateCommits newest commit = 1
   [junit4]   2> 907 T1945 C101 UPDATE [collection1] webapp=/solr path=/update params={wt=javabin&version=2} {deleteByQuery=*:*} 0 3
   [junit4]   2> 918 T1915 C98 UPDATE [collection1] webapp=/solr path=/update params={wt=javabin&version=2} {add=[1]} 0 1
   [junit4]   2> 920 T1925 C99 UPDATE [collection1] webapp=/solr path=/update params={wt=javabin&version=2} {add=[1]} 0 1
   [junit4]   2> 921 T1915 C98 UPDATE [collection1] webapp=/solr path=/update params={wt=javabin&version=2} {add=[2]} 0 0
   [junit4]   2> 923 T1935 C100 UPDATE [collection1] webapp=/solr path=/update params={wt=javabin&version=2} {add=[2]} 0 0
   [junit4]   2> 925 T1915 C98 UPDATE [collection1] webapp=/solr path=/update params={wt=javabin&version=2} {add=[3]} 0 1
   [junit4]   2> 926 T1945 C101 UPDATE [collection1] webapp=/solr path=/update params={wt=javabin&version=2} {add=[3]} 0 0
   [junit4]   2> 928 T1915 C98 UPDATE [collection1] webapp=/solr path=/update params={wt=javabin&version=2} {add=[4]} 0 0
   [junit4]   2> 929 T1925 C99 UPDATE [collection1] webapp=/solr path=/update params={wt=javabin&version=2} {add=[4]} 0 0
   [junit4]   2> 931 T1915 C98 UPDATE [collection1] webapp=/solr path=/update params={wt=javabin&version=2} {add=[5]} 0 0
   [junit4]   2> 932 T1935 C100 UPDATE [collection1] webapp=/solr path=/update params={wt=javabin&version=2} {add=[5]} 0 0
   [junit4]   2> 934 T1915 C98 UPDATE [collection1] webapp=/solr path=/update params={wt=javabin&version=2} {add=[6]} 0 0
   [junit4]   2> 935 T1945 C101 UPDATE [collection1] webapp=/solr path=/update params={wt=javabin&version=2} {add=[6]} 0 0
   [junit4]   2> 937 T1915 C98 UPDATE [collection1] webapp=/solr path=/update params={wt=javabin&version=2} {add=[7]} 0 0
   [junit4]   2> 938 T1945 C101 UPDATE [collection1] webapp=/solr path=/update params={wt=javabin&version=2} {add=[7]} 0 0
   [junit4]   2> 940 T1915 C98 oasu.DirectUpdateHandler2.commit start commit{flags=0,version=0,optimize=false,openSearcher=true,waitSearcher=true,expungeDeletes=false,softCommit=false}
   [junit4]   2> 941 T1915 C98 oasc.SolrDeletionPolicy.onCommit SolrDeletionPolicy.onCommit: commits:num=2
   [junit4]   2> 		commit{dir=MockDirWrapper(org.apache.lucene.store.RAMDirectory@426e294c lockFactory=org.apache.lucene.store.SingleInstanceLockFactory@4d550c79),segFN=segments_1,generation=1,filenames=[segments_1]
   [junit4]   2> 		commit{dir=MockDirWrapper(org.apache.lucene.store.RAMDirectory@426e294c lockFactory=org.apache.lucene.store.SingleInstanceLockFactory@4d550c79),segFN=segments_2,generation=2,filenames=[_0_Lucene40_0.tip, _0_nrm.cfe, _0_Lucene40_0.frq, _0_nrm.cfs, _0_Lucene40_0.tim, _0.si, _0.fdx, _0.fnm, _0.fdt, _0_Lucene40_0.prx, segments_2]
   [junit4]   2> 941 T1915 C98 oasc.SolrDeletionPolicy.updateCommits newest commit = 2
   [junit4]   2> 942 T1915 C98 oass.SolrIndexSearcher.<init> Opening Searcher@7b331e82 main
   [junit4]   2> 942 T1915 C98 oass.SolrIndexSearcher.<init> WARNING WARNING: Directory impl does not support setting indexDir: org.apache.lucene.store.MockDirectoryWrapper
   [junit4]   2> 942 T1915 C98 oasu.DirectUpdateHandler2.commit end_commit_flush
   [junit4]   2> 942 T1922 oasc.SolrCore.registerSearcher [collection1] Registered new searcher Searcher@7b331e82 main{StandardDirectoryReader(segments_2:4 _0(4.0):C7)}
   [junit4]   2> 943 T1915 C98 UPDATE [collection1] webapp=/solr path=/update params={softCommit=false&version=2&waitSearcher=true&wt=javabin&commit=true} {commit=} 0 3
   [junit4]   2> 944 T1925 C99 oasu.DirectUpdateHandler2.commit start commit{flags=0,version=0,optimize=false,openSearcher=true,waitSearcher=true,expungeDeletes=false,softCommit=false}
   [junit4]   2> 945 T1925 C99 oasc.SolrDeletionPolicy.onCommit SolrDeletionPolicy.onCommit: commits:num=2
   [junit4]   2> 		commit{dir=MockDirWrapper(org.apache.lucene.store.RAMDirectory@722c0001 lockFactory=org.apache.lucene.store.SingleInstanceLockFactory@1346d114),segFN=segments_1,generation=1,filenames=[segments_1]
   [junit4]   2> 		commit{dir=MockDirWrapper(org.apache.lucene.store.RAMDirectory@722c0001 lockFactory=org.apache.lucene.store.SingleInstanceLockFactory@1346d114),segFN=segments_2,generation=2,filenames=[_0_Lucene40_0.tip, _0_nrm.cfe, _0_Lucene40_0.frq, _0_nrm.cfs, _0_Lucene40_0.tim, _0.si, _0.fdx, _0.fnm, _0.fdt, _0_Lucene40_0.prx, segments_2]
   [junit4]   2> 945 T1925 C99 oasc.SolrDeletionPolicy.updateCommits newest commit = 2
   [junit4]   2> 946 T1925 C99 oass.SolrIndexSearcher.<init> Opening Searcher@6436afd6 main
   [junit4]   2> 946 T1925 C99 oass.SolrIndexSearcher.<init> WARNING WARNING: Directory impl does not support setting indexDir: org.apache.lucene.store.MockDirectoryWrapper
   [junit4]   2> 946 T1925 C99 oasu.DirectUpdateHandler2.commit end_commit_flush
   [junit4]   2> 946 T1932 oasc.SolrCore.registerSearcher [collection1] Registered new searcher Searcher@6436afd6 main{StandardDirectoryReader(segments_2:4 _0(4.0):C2)}
   [junit4]   2> 946 T1925 C99 UPDATE [collection1] webapp=/solr path=/update params={softCommit=false&version=2&waitSearcher=true&wt=javabin&commit=true} {commit=} 0 2
   [junit4]   2> 948 T1935 C100 oasu.DirectUpdateHandler2.commit start commit{flags=0,version=0,optimize=false,openSearcher=true,waitSearcher=true,expungeDeletes=false,softCommit=false}
   [junit4]   2> 949 T1935 C100 oasc.SolrDeletionPolicy.onCommit SolrDeletionPolicy.onCommit: commits:num=2
   [junit4]   2> 		commit{dir=MockDirWrapper(org.apache.lucene.store.RAMDirectory@65244d9a lockFactory=org.apache.lucene.store.SingleInstanceLockFactory@7ccbc2f1),segFN=segments_1,generation=1,filenames=[segments_1]
   [junit4]   2> 		commit{dir=MockDirWrapper(org.apache.lucene.store.RAMDirectory@65244d9a lockFactory=org.apache.lucene.store.SingleInstanceLockFactory@7ccbc2f1),segFN=segments_2,generation=2,filenames=[_0_Lucene40_0.tip, _0_nrm.cfe, _0_Lucene40_0.frq, _0_nrm.cfs, _0_Lucene40_0.tim, _0.si, _0.fdx, _0.fnm, _0.fdt, _0_Lucene40_0.prx, segments_2]
   [junit4]   2> 949 T1935 C100 oasc.SolrDeletionPolicy.updateCommits newest commit = 2
   [junit4]   2> 949 T1935 C100 oass.SolrIndexSearcher.<init> Opening Searcher@146df140 main
   [junit4]   2> 949 T1935 C100 oass.SolrIndexSearcher.<init> WARNING WARNING: Directory impl does not support setting indexDir: org.apache.lucene.store.MockDirectoryWrapper
   [junit4]   2> 950 T1935 C100 oasu.DirectUpdateHandler2.commit end_commit_flush
   [junit4]   2> 950 T1942 oasc.SolrCore.registerSearcher [collection1] Registered new searcher Searcher@146df140 main{StandardDirectoryReader(segments_2:4 _0(4.0):C2)}
   [junit4]   2> 950 T1935 C100 UPDATE [collection1] webapp=/solr path=/update params={softCommit=false&version=2&waitSearcher=true&wt=javabin&commit=true} {commit=} 0 2
   [junit4]   2> 952 T1945 C101 oasu.DirectUpdateHandler2.commit start commit{flags=0,version=0,optimize=false,openSearcher=true,waitSearcher=true,expungeDeletes=false,softCommit=false}
   [junit4]   2> 952 T1945 C101 oasc.SolrDeletionPolicy.onCommit SolrDeletionPolicy.onCommit: commits:num=2
   [junit4]   2> 		commit{dir=MockDirWrapper(org.apache.lucene.store.RAMDirectory@1edab280 lockFactory=org.apache.lucene.store.SingleInstanceLockFactory@536204a7),segFN=segments_1,generation=1,filenames=[segments_1]
   [junit4]   2> 		commit{dir=MockDirWrapper(org.apache.lucene.store.RAMDirectory@1edab280 lockFactory=org.apache.lucene.store.SingleInstanceLockFactory@536204a7),segFN=segments_2,generation=2,filenames=[_0_Lucene40_0.tip, _0_nrm.cfe, _0_Lucene40_0.frq, _0_nrm.cfs, _0_Lucene40_0.tim, _0.si, _0.fdx, _0.fnm, _0.fdt, _0_Lucene40_0.prx, segments_2]
   [junit4]   2> 952 T1945 C101 oasc.SolrDeletionPolicy.updateCommits newest commit = 2
   [junit4]   2> 953 T1945 C101 oass.SolrIndexSearcher.<init> Opening Searcher@19d7e6a6 main
   [junit4]   2> 953 T1945 C101 oass.SolrIndexSearcher.<init> WARNING WARNING: Directory impl does not support setting indexDir: org.apache.lucene.store.MockDirectoryWrapper
   [junit4]   2> 953 T1945 C101 oasu.DirectUpdateHandler2.commit end_commit_flush
   [junit4]   2> 953 T1952 oasc.SolrCore.registerSearcher [collection1] Registered new searcher Searcher@19d7e6a6 main{StandardDirectoryReader(segments_2:4 _0(4.0):C3)}
   [junit4]   2> 954 T1945 C101 UPDATE [collection1] webapp=/solr path=/update params={softCommit=false&version=2&waitSearcher=true&wt=javabin&commit=true} {commit=} 0 2
   [junit4]   2> 957 T1915 C98 REQ [collection1] webapp=/solr path=/elevate params={shards.qt=/elevate&sort=id+desc&wt=javabin&q=*:*&version=2&fl=id,+score,+[elevated]&distrib=false&rows=500&qt=/elevate} hits=7 status=0 QTime=2 
   [junit4]   2> 962 T1926 C99 REQ [collection1] webapp=/solr path=/elevate params={shards.qt=/elevate&shard.url=localhost:49551/solr&sort=id+desc&wt=javabin&isShard=true&NOW=1341332481362&rows=500&q=*:*&fsv=true&version=2&distrib=false&start=0&fl=id,score&qt=/elevate} hits=2 status=0 QTime=1 
   [junit4]   2> 962 T1936 C100 REQ [collection1] webapp=/solr path=/elevate params={shards.qt=/elevate&shard.url=localhost:40371/solr&sort=id+desc&wt=javabin&isShard=true&NOW=1341332481362&rows=500&q=*:*&fsv=true&version=2&distrib=false&start=0&fl=id,score&qt=/elevate} hits=2 status=0 QTime=1 
   [junit4]   2> 962 T1946 C101 REQ [collection1] webapp=/solr path=/elevate params={shards.qt=/elevate&shard.url=localhost:55566/solr|[::1]:33332/solr&sort=id+desc&wt=javabin&isShard=true&NOW=1341332481362&rows=500&q=*:*&fsv=true&version=2&distrib=false&start=0&fl=id,score&qt=/elevate} hits=3 status=0 QTime=0 
   [junit4]   2> 966 T1926 C99 REQ [collection1] webapp=/solr path=/elevate params={shards.qt=/elevate&shard.url=localhost:49551/solr&wt=javabin&isShard=true&ids=4.0,1.0&NOW=1341332481362&rows=500&q=*:*&version=2&fl=id,+score,+[elevated]&distrib=false&qt=/elevate} status=0 QTime=0 
   [junit4]   2> 967 T1936 C100 REQ [collection1] webapp=/solr path=/elevate params={shards.qt=/elevate&shard.url=localhost:40371/solr&wt=javabin&isShard=true&ids=5.0,2.0&NOW=1341332481362&rows=500&q=*:*&version=2&fl=id,+score,+[elevated]&distrib=false&qt=/elevate} status=0 QTime=1 
   [junit4]   2> 967 T1946 C101 REQ [collection1] webapp=/solr path=/elevate params={shards.qt=/elevate&shard.url=localhost:55566/solr|[::1]:33332/solr&wt=javabin&isShard=true&ids=6.0,3.0,7.0&NOW=1341332481362&rows=500&q=*:*&version=2&fl=id,+score,+[elevated]&distrib=false&qt=/elevate} status=0 QTime=1 
   [junit4]   2> 967 T1925 C99 REQ [collection1] webapp=/solr path=/elevate params={shards.qt=/elevate&sort=id+desc&wt=javabin&q=*:*&version=2&fl=id,+score,+[elevated]&rows=500&shards=localhost:49551/solr,localhost:40371/solr,localhost:55566/solr|[::1]:33332/solr&qt=/elevate} status=0 QTime=8 
   [junit4]   2> 968 T1912 oasc.CoreContainer.shutdown Shutting down CoreContainer instance=182211001
   [junit4]   2> 969 T1912 oasc.SolrCore.close [collection1]  CLOSING SolrCore org.apache.solr.core.SolrCore@507f0245
   [junit4]   2> 969 T1912 oasc.SolrCore.closeSearcher [collection1] Closing main searcher on request.
   [junit4]   2> 970 T1912 oasu.DirectUpdateHandler2.close closing DirectUpdateHandler2{commits=1,autocommits=0,soft autocommits=0,optimizes=0,rollbacks=0,expungeDeletes=0,docsPending=0,adds=0,deletesById=0,deletesByQuery=0,errors=0,cumulative_adds=7,cumulative_deletesById=0,cumulative_deletesByQuery=1,cumulative_errors=0}
   [junit4]   2> 972 T1912 oejsh.ContextHandler.doStop stopped o.e.j.s.ServletContextHandler{/solr,null}
   [junit4]   2> 1024 T1912 oasc.CoreContainer.shutdown Shutting down CoreContainer instance=155999841
   [junit4]   2> 1025 T1912 oasc.SolrCore.close [collection1]  CLOSING SolrCore org.apache.solr.core.SolrCore@531e6ba0
   [junit4]   2> 1026 T1912 oasc.SolrCore.closeSearcher [collection1] Closing main searcher on request.
   [junit4]   2> 1026 T1912 oasu.DirectUpdateHandler2.close closing DirectUpdateHandler2{commits=1,autocommits=0,soft autocommits=0,optimizes=0,rollbacks=0,expungeDeletes=0,docsPending=0,adds=0,deletesById=0,deletesByQuery=0,errors=0,cumulative_adds=2,cumulative_deletesById=0,cumulative_deletesByQuery=1,cumulative_errors=0}
   [junit4]   2> 1029 T1912 oejsh.ContextHandler.doStop stopped o.e.j.s.ServletContextHandler{/solr,null}
   [junit4]   2> 1081 T1912 oasc.CoreContainer.shutdown Shutting down CoreContainer instance=1022234080
   [junit4]   2> 1082 T1912 oasc.SolrCore.close [collection1]  CLOSING SolrCore org.apache.solr.core.SolrCore@5306d373
   [junit4]   2> 1082 T1912 oasc.SolrCore.closeSearcher [collection1] Closing main searcher on request.
   [junit4]   2> 1082 T1912 oasu.DirectUpdateHandler2.close closing DirectUpdateHandler2{commits=1,autocommits=0,soft autocommits=0,optimizes=0,rollbacks=0,expungeDeletes=0,docsPending=0,adds=0,deletesById=0,deletesByQuery=0,errors=0,cumulative_adds=2,cumulative_deletesById=0,cumulative_deletesByQuery=1,cumulative_errors=0}
   [junit4]   2> 1084 T1912 oejsh.ContextHandler.doStop stopped o.e.j.s.ServletContextHandler{/solr,null}
   [junit4]   2> 1135 T1912 oasc.CoreContainer.shutdown Shutting down CoreContainer instance=986151177
   [junit4]   2> 1136 T1912 oasc.SolrCore.close [collection1]  CLOSING SolrCore org.apache.solr.core.SolrCore@36b8cdf9
   [junit4]   2> 1136 T1912 oasc.SolrCore.closeSearcher [collection1] Closing main searcher on request.
   [junit4]   2> 1137 T1912 oasu.DirectUpdateHandler2.close closing DirectUpdateHandler2{commits=1,autocommits=0,soft autocommits=0,optimizes=0,rollbacks=0,expungeDeletes=0,docsPending=0,adds=0,deletesById=0,deletesByQuery=0,errors=0,cumulative_adds=3,cumulative_deletesById=0,cumulative_deletesByQuery=1,cumulative_errors=0}
   [junit4]   2> 1138 T1912 oejsh.ContextHandler.doStop stopped o.e.j.s.ServletContextHandler{/solr,null}
   [junit4]   2> 1190 T1912 oas.SolrTestCaseJ4.tearDown ###Ending testDistribSearch
   [junit4]   2> NOTE: reproduce with: ant test  -Dtestcase=DistributedQueryElevationComponentTest -Dtests.method=testDistribSearch -Dtests.seed=8B6B7A1149375073 -Dtests.multiplier=3 -Dtests.slow=true -Dtests.locale=lv_LV -Dtests.timezone=America/Indiana/Vincennes -Dargs="-Dfile.encoding=UTF-8"
   [junit4]   2>
   [junit4]    > (@AfterClass output)
   [junit4]   2> 1194 T1912 oas.SolrTestCaseJ4.deleteCore ###deleteCore
   [junit4]   2> NOTE: test params are: codec=Lucene40: {}, sim=RandomSimilarityProvider(queryNorm=true,coord=false): {}, locale=lv_LV, timezone=America/Indiana/Vincennes
   [junit4]   2> NOTE: Linux 2.6.32-41-server amd64/Oracle Corporation 1.8.0-ea (64-bit)/cpus=8,threads=1,free=202940152,total=312213504
   [junit4]   2> NOTE: All tests run in this JVM: [TestStopFilterFactory, ZkSolrClientTest, DocumentAnalysisRequestHandlerTest, TestEnglishMinimalStemFilterFactory, CommonGramsFilterFactoryTest, TestLMJelinekMercerSimilarityFactory, TestPseudoReturnFields, FileBasedSpellCheckerTest, DebugComponentTest, TestNGramFilters, JsonLoaderTest, SearchHandlerTest, SpellCheckComponentTest, TestWriterPerf, TestNorwegianMinimalStemFilterFactory, TestHindiFilters, TestKeywordMarkerFilterFactory, UniqFieldsUpdateProcessorFactoryTest, TestSort, TestQueryTypes, AlternateDirectoryTest, TestTrie, TestIndexSearcher, ReturnFieldsTest, PeerSyncTest, TestConfig, QueryParsingTest, SoftAutoCommitTest, TestRealTimeGet, SortByFunctionTest, TermVectorComponentTest, TestDefaultSimilarityFactory, CloudStateTest, MultiTermTest, TestXIncludeConfig, TestCoreContainer, TestPersianNormalizationFilterFactory, TestCSVResponseWriter, SolrPluginUtilsTest, SpellPossibilityIteratorTest, TestCzechStemFilterFactory, TestMultiWordSynonyms, LengthFilterTest, TestSynonymMap, TestTurkishLowerCaseFilterFactory, TestSolrDeletionPolicy1, XsltUpdateRequestHandlerTest, CSVRequestHandlerTest, TestBeiderMorseFilterFactory, TestLMDirichletSimilarityFactory, TimeZoneUtilsTest, RAMDirectoryFactoryTest, TestOmitPositions, TestRussianLightStemFilterFactory, TestKeepFilterFactory, SolrCoreTest, TestElisionFilterFactory, TestIBSimilarityFactory, TestShingleFilterFactory, TestCJKBigramFilterFactory, TestGalicianMinimalStemFilterFactory, ResourceLoaderTest, TestPluginEnable, TestChineseFilterFactory, UpdateParamsTest, LeaderElectionTest, OverseerTest, FullSolrCloudTest, TestJapaneseTokenizerFactory, IndexSchemaRuntimeFieldTest, TestJmxMonitoredMap, TestPorterStemFilterFactory, SpellingQueryConverterTest, DistanceFunctionTest, TestGroupingSearch, TestRemoteStreaming, TestFastLRUCache, TestLuceneMatchVersion, URLClassifyProcessorTest, TestHunspellStemFilterFactory, UUIDFieldTest, TestSolrXMLSerializer, TestLRUCache, TestDocSet, TestGermanMinimalStemFilterFactory, DocumentBuilderTest, TestHungarianLightStemFilterFactory, TestSuggestSpellingConverter, IndexSchemaTest, HighlighterConfigTest, NoCacheHeaderTest, TestGermanNormalizationFilterFactory, PrimUtilsTest, TestReverseStringFilterFactory, TestUAX29URLEmailTokenizerFactory, TestRecovery, PolyFieldTest, TestUtils, TestIndonesianStemFilterFactory, TestValueSourceCache, SignatureUpdateProcessorFactoryTest, FieldMutatingUpdateProcessorTest, CloudStateUpdateTest, TestCollationField, TestReplicationHandler, LeaderElectionIntegrationTest, SpellCheckCollatorTest, BasicZkTest, WordBreakSolrSpellCheckerTest, DistributedTermsComponentTest, TestRangeQuery, TestMultiCoreConfBootstrap, LukeRequestHandlerTest, BasicFunctionalityTest, SampleTest, CoreAdminHandlerTest, DirectSolrConnectionTest, QueryEqualityTest, DistributedQueryElevationComponentTest]
   [junit4]   2> 
   [junit4] Completed on J1 in 1.21s, 1 test, 1 error <<< FAILURES!

[...truncated 160 lines...]
BUILD FAILED
/mnt/ssd/jenkins/workspace/Lucene-Solr-4.x-Linux-Java8-64/checkout/build.xml:29: The following error occurred while executing this line:
/mnt/ssd/jenkins/workspace/Lucene-Solr-4.x-Linux-Java8-64/checkout/solr/build.xml:144: The following error occurred while executing this line:
/mnt/ssd/jenkins/workspace/Lucene-Solr-4.x-Linux-Java8-64/checkout/lucene/module-build.xml:62: The following error occurred while executing this line:
/mnt/ssd/jenkins/workspace/Lucene-Solr-4.x-Linux-Java8-64/checkout/lucene/common-build.xml:1047: The following error occurred while executing this line:
/mnt/ssd/jenkins/workspace/Lucene-Solr-4.x-Linux-Java8-64/checkout/lucene/common-build.xml:760: There were test failures: 290 suites, 1052 tests, 2 errors, 5 ignored

Total time: 23 minutes 56 seconds
Build step 'Execute shell' marked build as failure
Archiving artifacts
Recording test results
Email was triggered for: Failure
Sending email for trigger: Failure




Mime
View raw message