lucene-dev mailing list archives

Site index · List index
Message view « Date » · « Thread »
Top « Date » · « Thread »
From Policeman Jenkins Server <jenk...@sd-datasolutions.de>
Subject [JENKINS] Lucene-Solr-4.x-Linux-Java8-64 - Build # 23 - Failure!
Date Tue, 24 Jul 2012 16:07:19 GMT
Build: http://jenkins.sd-datasolutions.de/job/Lucene-Solr-4.x-Linux-Java8-64/23/

1 tests failed.
REGRESSION:  org.apache.solr.handler.component.SpellCheckComponentTest.testPerDictionary

Error Message:
mismatch: '0'!='2' @ spellcheck/suggestions/bar/startOffset

Stack Trace:
java.lang.RuntimeException: mismatch: '0'!='2' @ spellcheck/suggestions/bar/startOffset
	at __randomizedtesting.SeedInfo.seed([ABEA617B5A60B879:6CE495D3520CAD31]:0)
	at org.apache.solr.SolrTestCaseJ4.assertJQ(SolrTestCaseJ4.java:572)
	at org.apache.solr.SolrTestCaseJ4.assertJQ(SolrTestCaseJ4.java:520)
	at org.apache.solr.handler.component.SpellCheckComponentTest.testPerDictionary(SpellCheckComponentTest.java:102)
	at sun.reflect.NativeMethodAccessorImpl.invoke0(Native Method)
	at sun.reflect.NativeMethodAccessorImpl.invoke(NativeMethodAccessorImpl.java:57)
	at sun.reflect.DelegatingMethodAccessorImpl.invoke(DelegatingMethodAccessorImpl.java:43)
	at java.lang.reflect.Method.invoke(Method.java:474)
	at com.carrotsearch.randomizedtesting.RandomizedRunner.invoke(RandomizedRunner.java:1995)
	at com.carrotsearch.randomizedtesting.RandomizedRunner.access$1100(RandomizedRunner.java:132)
	at com.carrotsearch.randomizedtesting.RandomizedRunner$6.evaluate(RandomizedRunner.java:818)
	at com.carrotsearch.randomizedtesting.RandomizedRunner$7.evaluate(RandomizedRunner.java:877)
	at com.carrotsearch.randomizedtesting.RandomizedRunner$8.evaluate(RandomizedRunner.java:891)
	at com.carrotsearch.randomizedtesting.rules.SystemPropertiesRestoreRule$1.evaluate(SystemPropertiesRestoreRule.java:53)
	at org.apache.lucene.util.TestRuleSetupTeardownChained$1.evaluate(TestRuleSetupTeardownChained.java:50)
	at org.apache.lucene.util.TestRuleFieldCacheSanity$1.evaluate(TestRuleFieldCacheSanity.java:32)
	at org.apache.lucene.util.AbstractBeforeAfterRule$1.evaluate(AbstractBeforeAfterRule.java:45)
	at com.carrotsearch.randomizedtesting.rules.SystemPropertiesInvariantRule$1.evaluate(SystemPropertiesInvariantRule.java:55)
	at org.apache.lucene.util.TestRuleReportUncaughtExceptions$1.evaluate(TestRuleReportUncaughtExceptions.java:68)
	at org.apache.lucene.util.TestRuleThreadAndTestName$1.evaluate(TestRuleThreadAndTestName.java:48)
	at org.apache.lucene.util.TestRuleIgnoreAfterMaxFailures$1.evaluate(TestRuleIgnoreAfterMaxFailures.java:70)
	at org.apache.lucene.util.TestRuleMarkFailure$1.evaluate(TestRuleMarkFailure.java:48)
	at com.carrotsearch.randomizedtesting.RandomizedRunner.runSingleTest(RandomizedRunner.java:825)
	at com.carrotsearch.randomizedtesting.RandomizedRunner.access$700(RandomizedRunner.java:132)
	at com.carrotsearch.randomizedtesting.RandomizedRunner$3$1.run(RandomizedRunner.java:671)
	at com.carrotsearch.randomizedtesting.RandomizedRunner$3.evaluate(RandomizedRunner.java:697)
	at com.carrotsearch.randomizedtesting.RandomizedRunner$4.evaluate(RandomizedRunner.java:736)
	at com.carrotsearch.randomizedtesting.RandomizedRunner$5.evaluate(RandomizedRunner.java:747)
	at com.carrotsearch.randomizedtesting.rules.SystemPropertiesRestoreRule$1.evaluate(SystemPropertiesRestoreRule.java:53)
	at org.apache.lucene.util.AbstractBeforeAfterRule$1.evaluate(AbstractBeforeAfterRule.java:45)
	at org.apache.lucene.util.TestRuleReportUncaughtExceptions$1.evaluate(TestRuleReportUncaughtExceptions.java:68)
	at org.apache.lucene.util.TestRuleStoreClassName$1.evaluate(TestRuleStoreClassName.java:38)
	at org.apache.lucene.util.TestRuleIcuHack$1.evaluate(TestRuleIcuHack.java:51)
	at com.carrotsearch.randomizedtesting.rules.SystemPropertiesInvariantRule$1.evaluate(SystemPropertiesInvariantRule.java:55)
	at org.apache.lucene.util.TestRuleNoInstanceHooksOverrides$1.evaluate(TestRuleNoInstanceHooksOverrides.java:53)
	at org.apache.lucene.util.TestRuleNoStaticHooksShadowing$1.evaluate(TestRuleNoStaticHooksShadowing.java:52)
	at org.apache.lucene.util.TestRuleAssertionsRequired$1.evaluate(TestRuleAssertionsRequired.java:36)
	at org.apache.lucene.util.TestRuleMarkFailure$1.evaluate(TestRuleMarkFailure.java:48)
	at org.apache.lucene.util.TestRuleIgnoreAfterMaxFailures$1.evaluate(TestRuleIgnoreAfterMaxFailures.java:70)
	at org.apache.lucene.util.TestRuleIgnoreTestSuites$1.evaluate(TestRuleIgnoreTestSuites.java:55)
	at com.carrotsearch.randomizedtesting.RandomizedRunner.runSuite(RandomizedRunner.java:605)
	at com.carrotsearch.randomizedtesting.RandomizedRunner.access$400(RandomizedRunner.java:132)
	at com.carrotsearch.randomizedtesting.RandomizedRunner$2.run(RandomizedRunner.java:551)




Build Log:
[...truncated 7396 lines...]
[junit4:junit4] Suite: org.apache.solr.handler.component.SpellCheckComponentTest
[junit4:junit4]    > (@BeforeClass output)
[junit4:junit4]   2> 0 T4428 oas.SolrTestCaseJ4.initCore ####initCore
[junit4:junit4]   2> Creating dataDir: /mnt/ssd/jenkins/workspace/Lucene-Solr-4.x-Linux-Java8-64/checkout/solr/build/solr-core/test/J0/./solrtest-SpellCheckComponentTest-1343145865378
[junit4:junit4]   2> 1 T4428 oasc.SolrResourceLoader.<init> new SolrResourceLoader
for directory: '/mnt/ssd/jenkins/workspace/Lucene-Solr-4.x-Linux-Java8-64/checkout/solr/build/solr-core/test-files/solr/collection1/'
[junit4:junit4]   2> 1 T4428 oasc.SolrResourceLoader.replaceClassLoader Adding 'file:/mnt/ssd/jenkins/workspace/Lucene-Solr-4.x-Linux-Java8-64/checkout/solr/build/solr-core/test-files/solr/collection1/lib/README'
to classloader
[junit4:junit4]   2> 1 T4428 oasc.SolrResourceLoader.replaceClassLoader Adding 'file:/mnt/ssd/jenkins/workspace/Lucene-Solr-4.x-Linux-Java8-64/checkout/solr/build/solr-core/test-files/solr/collection1/lib/classes/'
to classloader
[junit4:junit4]   2> 13 T4428 oasc.SolrConfig.<init> Using Lucene MatchVersion: LUCENE_40
[junit4:junit4]   2> 37 T4428 oasc.SolrConfig.<init> Loaded SolrConfig: solrconfig-spellcheckcomponent.xml
[junit4:junit4]   2> 37 T4428 oass.IndexSchema.readSchema Reading Solr Schema
[junit4:junit4]   2> 39 T4428 oass.IndexSchema.readSchema Schema name=test
[junit4:junit4]   2> 305 T4428 oass.OpenExchangeRatesOrgProvider.init Initialized with
rates=open-exchange-rates.json, refreshInterval=1440.
[junit4:junit4]   2> 309 T4428 oass.IndexSchema.readSchema default search field in schema
is text
[junit4:junit4]   2> 311 T4428 oass.IndexSchema.readSchema unique key field: id
[junit4:junit4]   2> 314 T4428 oass.FileExchangeRateProvider.reload Reloading exchange
rates from file currency.xml
[junit4:junit4]   2> 316 T4428 oass.FileExchangeRateProvider.reload Reloading exchange
rates from file currency.xml
[junit4:junit4]   2> 317 T4428 oass.OpenExchangeRatesOrgProvider.reload Reloading exchange
rates from open-exchange-rates.json
[junit4:junit4]   2> 317 T4428 oass.OpenExchangeRatesOrgProvider.reload Reloading exchange
rates from open-exchange-rates.json
[junit4:junit4]   2> 318 T4428 oasc.SolrResourceLoader.locateSolrHome JNDI not configured
for solr (NoInitialContextEx)
[junit4:junit4]   2> 318 T4428 oasc.SolrResourceLoader.locateSolrHome using system property
solr.solr.home: /mnt/ssd/jenkins/workspace/Lucene-Solr-4.x-Linux-Java8-64/checkout/solr/build/solr-core/test-files/solr
[junit4:junit4]   2> 318 T4428 oasc.SolrResourceLoader.<init> new SolrResourceLoader
for directory: '/mnt/ssd/jenkins/workspace/Lucene-Solr-4.x-Linux-Java8-64/checkout/solr/build/solr-core/test-files/solr/'
[junit4:junit4]   2> 318 T4428 oasc.CoreContainer.<init> New CoreContainer 258859307
[junit4:junit4]   2> 318 T4428 oasc.SolrCore.<init> [collection1] Opening new SolrCore
at /mnt/ssd/jenkins/workspace/Lucene-Solr-4.x-Linux-Java8-64/checkout/solr/build/solr-core/test-files/solr/collection1/,
dataDir=/mnt/ssd/jenkins/workspace/Lucene-Solr-4.x-Linux-Java8-64/checkout/solr/build/solr-core/test/J0/./solrtest-SpellCheckComponentTest-1343145865378/
[junit4:junit4]   2> 318 T4428 oasc.SolrCore.<init> JMX monitoring not detected for
core: collection1
[junit4:junit4]   2> 319 T4428 oasc.SolrCore.getNewIndexDir WARNING New index directory
detected: old=null new=/mnt/ssd/jenkins/workspace/Lucene-Solr-4.x-Linux-Java8-64/checkout/solr/build/solr-core/test/J0/./solrtest-SpellCheckComponentTest-1343145865378/index/
[junit4:junit4]   2> 319 T4428 oasc.SolrCore.initIndex WARNING [collection1] Solr index
directory '/mnt/ssd/jenkins/workspace/Lucene-Solr-4.x-Linux-Java8-64/checkout/solr/build/solr-core/test/J0/./solrtest-SpellCheckComponentTest-1343145865378/index'
doesn't exist. Creating new index...
[junit4:junit4]   2> 321 T4428 oasc.SolrDeletionPolicy.onCommit SolrDeletionPolicy.onCommit:
commits:num=1
[junit4:junit4]   2> 		commit{dir=MockDirWrapper(org.apache.lucene.store.RAMDirectory@576e466f
lockFactory=org.apache.lucene.store.NativeFSLockFactory@270f91ed),segFN=segments_1,generation=1,filenames=[segments_1]
[junit4:junit4]   2> 321 T4428 oasc.SolrDeletionPolicy.updateCommits newest commit = 1
[junit4:junit4]   2> 322 T4428 oasc.RequestHandlers.initHandlersFromConfig created standard:
solr.StandardRequestHandler
[junit4:junit4]   2> 322 T4428 oasc.RequestHandlers.initHandlersFromConfig created spellCheckCompRH:
org.apache.solr.handler.component.SearchHandler
[junit4:junit4]   2> 322 T4428 oasc.RequestHandlers.initHandlersFromConfig created spellCheckCompRH1:
org.apache.solr.handler.component.SearchHandler
[junit4:junit4]   2> 322 T4428 oasc.RequestHandlers.initHandlersFromConfig created spellCheckWithWordbreak:
org.apache.solr.handler.component.SearchHandler
[junit4:junit4]   2> 325 T4428 oass.SolrIndexSearcher.<init> Opening Searcher@3a54c36d
main
[junit4:junit4]   2> 325 T4428 oass.SolrIndexSearcher.getIndexDir WARNING WARNING: Directory
impl does not support setting indexDir: org.apache.lucene.store.MockDirectoryWrapper
[junit4:junit4]   2> 325 T4428 oasu.CommitTracker.<init> Hard AutoCommit: disabled
[junit4:junit4]   2> 325 T4428 oasu.CommitTracker.<init> Soft AutoCommit: disabled
[junit4:junit4]   2> 326 T4428 oashc.SpellCheckComponent.inform Initializing spell checkers
[junit4:junit4]   2> 329 T4428 oashc.SpellCheckComponent.inform Registering newSearcher
listener for spellchecker: default
[junit4:junit4]   2> 332 T4428 oashc.SpellCheckComponent.inform Registering newSearcher
listener for spellchecker: default_teststop
[junit4:junit4]   2> 332 T4428 oass.DirectSolrSpellChecker.init init: {name=direct,classname=solr.DirectSolrSpellChecker,minQueryLength=3,maxQueryFrequency=100.0,field=teststop}
[junit4:junit4]   2> 332 T4428 oass.DirectSolrSpellChecker.init init: {name=direct_lowerfilt,classname=solr.DirectSolrSpellChecker,minQueryLength=3,maxQueryFrequency=100.0,field=lowerfilt}
[junit4:junit4]   2> 338 T4428 oashc.SpellCheckComponent.inform Registering newSearcher
listener for spellchecker: threshold
[junit4:junit4]   2> 338 T4428 oass.DirectSolrSpellChecker.init init: {name=threshold_direct,classname=solr.DirectSolrSpellChecker,field=lowerfilt,spellcheckIndexDir=spellcheckerThreshold,buildOnCommit=true,thresholdTokenFrequency=0.29}
[junit4:junit4]   2> 339 T4428 oashc.SpellCheckComponent.inform Registering newSearcher
listener for spellchecker: threshold_direct
[junit4:junit4]   2> 341 T4428 oashc.SpellCheckComponent.inform Registering newSearcher
listener for spellchecker: multipleFields
[junit4:junit4]   2> 349 T4428 oashc.SpellCheckComponent.inform Registering newSearcher
listener for spellchecker: freq
[junit4:junit4]   2> 351 T4428 oashc.SpellCheckComponent.inform Registering newSearcher
listener for spellchecker: fqcn
[junit4:junit4]   2> 352 T4428 oashc.HttpShardHandlerFactory.getParameter Setting socketTimeout
to: 0
[junit4:junit4]   2> 352 T4428 oashc.HttpShardHandlerFactory.getParameter Setting urlScheme
to: http://
[junit4:junit4]   2> 352 T4428 oashc.HttpShardHandlerFactory.getParameter Setting connTimeout
to: 0
[junit4:junit4]   2> 352 T4428 oashc.HttpShardHandlerFactory.getParameter Setting maxConnectionsPerHost
to: 20
[junit4:junit4]   2> 352 T4428 oashc.HttpShardHandlerFactory.getParameter Setting corePoolSize
to: 0
[junit4:junit4]   2> 352 T4428 oashc.HttpShardHandlerFactory.getParameter Setting maximumPoolSize
to: 2147483647
[junit4:junit4]   2> 353 T4428 oashc.HttpShardHandlerFactory.getParameter Setting maxThreadIdleTime
to: 5
[junit4:junit4]   2> 353 T4428 oashc.HttpShardHandlerFactory.getParameter Setting sizeOfQueue
to: -1
[junit4:junit4]   2> 353 T4428 oashc.HttpShardHandlerFactory.getParameter Setting fairnessPolicy
to: false
[junit4:junit4]   2> 353 T4428 oascsi.HttpClientUtil.createClient Creating new http client,
config:maxConnectionsPerHost=20&maxConnections=10000&socketTimeout=0&connTimeout=0&retry=false
[junit4:junit4]   2> 356 T4429 oasc.SolrCore.registerSearcher [collection1] Registered
new searcher Searcher@3a54c36d main{StandardDirectoryReader(segments_1:1)}
[junit4:junit4]   2> 356 T4428 oasc.CoreContainer.register registering core: collection1
[junit4:junit4]   2> 356 T4428 oas.SolrTestCaseJ4.initCore ####initCore end
[junit4:junit4]   2> 
[junit4:junit4] ERROR   0.53s J0 | SpellCheckComponentTest.testPerDictionary
[junit4:junit4]    > Throwable #1: java.lang.RuntimeException: mismatch: '0'!='2' @ spellcheck/suggestions/bar/startOffset
[junit4:junit4]    > 	at __randomizedtesting.SeedInfo.seed([ABEA617B5A60B879:6CE495D3520CAD31]:0)
[junit4:junit4]    > 	at org.apache.solr.SolrTestCaseJ4.assertJQ(SolrTestCaseJ4.java:572)
[junit4:junit4]    > 	at org.apache.solr.SolrTestCaseJ4.assertJQ(SolrTestCaseJ4.java:520)
[junit4:junit4]    > 	at org.apache.solr.handler.component.SpellCheckComponentTest.testPerDictionary(SpellCheckComponentTest.java:102)
[junit4:junit4]    > 	at sun.reflect.NativeMethodAccessorImpl.invoke0(Native Method)
[junit4:junit4]    > 	at sun.reflect.NativeMethodAccessorImpl.invoke(NativeMethodAccessorImpl.java:57)
[junit4:junit4]    > 	at sun.reflect.DelegatingMethodAccessorImpl.invoke(DelegatingMethodAccessorImpl.java:43)
[junit4:junit4]    > 	at java.lang.reflect.Method.invoke(Method.java:474)
[junit4:junit4]    > 	at com.carrotsearch.randomizedtesting.RandomizedRunner.invoke(RandomizedRunner.java:1995)
[junit4:junit4]    > 	at com.carrotsearch.randomizedtesting.RandomizedRunner.access$1100(RandomizedRunner.java:132)
[junit4:junit4]    > 	at com.carrotsearch.randomizedtesting.RandomizedRunner$6.evaluate(RandomizedRunner.java:818)
[junit4:junit4]    > 	at com.carrotsearch.randomizedtesting.RandomizedRunner$7.evaluate(RandomizedRunner.java:877)
[junit4:junit4]    > 	at com.carrotsearch.randomizedtesting.RandomizedRunner$8.evaluate(RandomizedRunner.java:891)
[junit4:junit4]    > 	at com.carrotsearch.randomizedtesting.rules.SystemPropertiesRestoreRule$1.evaluate(SystemPropertiesRestoreRule.java:53)
[junit4:junit4]    > 	at org.apache.lucene.util.TestRuleSetupTeardownChained$1.evaluate(TestRuleSetupTeardownChained.java:50)
[junit4:junit4]    > 	at org.apache.lucene.util.TestRuleFieldCacheSanity$1.evaluate(TestRuleFieldCacheSanity.java:32)
[junit4:junit4]    > 	at org.apache.lucene.util.AbstractBeforeAfterRule$1.evaluate(AbstractBeforeAfterRule.java:45)
[junit4:junit4]    > 	at com.carrotsearch.randomizedtesting.rules.SystemPropertiesInvariantRule$1.evaluate(SystemPropertiesInvariantRule.java:55)
[junit4:junit4]    > 	at org.apache.lucene.util.TestRuleReportUncaughtExceptions$1.evaluate(TestRuleReportUncaughtExceptions.java:68)
[junit4:junit4]    > 	at org.apache.lucene.util.TestRuleThreadAndTestName$1.evaluate(TestRuleThreadAndTestName.java:48)
[junit4:junit4]    > 	at org.apache.lucene.util.TestRuleIgnoreAfterMaxFailures$1.evaluate(TestRuleIgnoreAfterMaxFailures.java:70)
[junit4:junit4]    > 	at org.apache.lucene.util.TestRuleMarkFailure$1.evaluate(TestRuleMarkFailure.java:48)
[junit4:junit4]    > 	at com.carrotsearch.randomizedtesting.RandomizedRunner.runSingleTest(RandomizedRunner.java:825)
[junit4:junit4]    > 	at com.carrotsearch.randomizedtesting.RandomizedRunner.access$700(RandomizedRunner.java:132)
[junit4:junit4]    > 	at com.carrotsearch.randomizedtesting.RandomizedRunner$3$1.run(RandomizedRunner.java:671)
[junit4:junit4]    > 	at com.carrotsearch.randomizedtesting.RandomizedRunner$3.evaluate(RandomizedRunner.java:697)
[junit4:junit4]    > 	at com.carrotsearch.randomizedtesting.RandomizedRunner$4.evaluate(RandomizedRunner.java:736)
[junit4:junit4]    > 	at com.carrotsearch.randomizedtesting.RandomizedRunner$5.evaluate(RandomizedRunner.java:747)
[junit4:junit4]    > 	at com.carrotsearch.randomizedtesting.rules.SystemPropertiesRestoreRule$1.evaluate(SystemPropertiesRestoreRule.java:53)
[junit4:junit4]    > 	at org.apache.lucene.util.AbstractBeforeAfterRule$1.evaluate(AbstractBeforeAfterRule.java:45)
[junit4:junit4]    > 	at org.apache.lucene.util.TestRuleReportUncaughtExceptions$1.evaluate(TestRuleReportUncaughtExceptions.java:68)
[junit4:junit4]    > 	at org.apache.lucene.util.TestRuleStoreClassName$1.evaluate(TestRuleStoreClassName.java:38)
[junit4:junit4]    > 	at org.apache.lucene.util.TestRuleIcuHack$1.evaluate(TestRuleIcuHack.java:51)
[junit4:junit4]    > 	at com.carrotsearch.randomizedtesting.rules.SystemPropertiesInvariantRule$1.evaluate(SystemPropertiesInvariantRule.java:55)
[junit4:junit4]    > 	at org.apache.lucene.util.TestRuleNoInstanceHooksOverrides$1.evaluate(TestRuleNoInstanceHooksOverrides.java:53)
[junit4:junit4]    > 	at org.apache.lucene.util.TestRuleNoStaticHooksShadowing$1.evaluate(TestRuleNoStaticHooksShadowing.java:52)
[junit4:junit4]    > 	at org.apache.lucene.util.TestRuleAssertionsRequired$1.evaluate(TestRuleAssertionsRequired.java:36)
[junit4:junit4]    > 	at org.apache.lucene.util.TestRuleMarkFailure$1.evaluate(TestRuleMarkFailure.java:48)
[junit4:junit4]    > 	at org.apache.lucene.util.TestRuleIgnoreAfterMaxFailures$1.evaluate(TestRuleIgnoreAfterMaxFailures.java:70)
[junit4:junit4]    > 	at org.apache.lucene.util.TestRuleIgnoreTestSuites$1.evaluate(TestRuleIgnoreTestSuites.java:55)
[junit4:junit4]    > 	at com.carrotsearch.randomizedtesting.RandomizedRunner.runSuite(RandomizedRunner.java:605)
[junit4:junit4]    > 	at com.carrotsearch.randomizedtesting.RandomizedRunner.access$400(RandomizedRunner.java:132)
[junit4:junit4]    > 	at com.carrotsearch.randomizedtesting.RandomizedRunner$2.run(RandomizedRunner.java:551)
[junit4:junit4]    > 
[junit4:junit4]   2> 866 T4428 oas.SolrTestCaseJ4.setUp ###Starting testPerDictionary
[junit4:junit4]   2> 868 T4428 C51 UPDATE [collection1] webapp=null path=null params={}
{add=[0]} 0 0
[junit4:junit4]   2> 875 T4428 C51 UPDATE [collection1] webapp=null path=null params={}
{add=[1]} 0 0
[junit4:junit4]   2> 878 T4428 C51 UPDATE [collection1] webapp=null path=null params={}
{add=[2]} 0 0
[junit4:junit4]   2> 881 T4428 C51 UPDATE [collection1] webapp=null path=null params={}
{add=[3]} 0 0
[junit4:junit4]   2> 884 T4428 C51 UPDATE [collection1] webapp=null path=null params={}
{add=[4]} 0 0
[junit4:junit4]   2> 886 T4428 C51 UPDATE [collection1] webapp=null path=null params={}
{add=[5]} 0 0
[junit4:junit4]   2> 889 T4428 C51 UPDATE [collection1] webapp=null path=null params={}
{add=[6]} 0 0
[junit4:junit4]   2> 892 T4428 C51 UPDATE [collection1] webapp=null path=null params={}
{add=[7]} 0 0
[junit4:junit4]   2> 895 T4428 C51 UPDATE [collection1] webapp=null path=null params={}
{add=[8]} 0 0
[junit4:junit4]   2> 898 T4428 C51 UPDATE [collection1] webapp=null path=null params={}
{add=[9]} 0 1
[junit4:junit4]   2> 900 T4428 C51 oasu.DirectUpdateHandler2.commit start commit{flags=0,_version_=0,optimize=false,openSearcher=true,waitSearcher=true,expungeDeletes=false,softCommit=false}
[junit4:junit4]   2> 902 T4428 C51 oasc.SolrDeletionPolicy.onCommit SolrDeletionPolicy.onCommit:
commits:num=2
[junit4:junit4]   2> 		commit{dir=MockDirWrapper(org.apache.lucene.store.RAMDirectory@576e466f
lockFactory=org.apache.lucene.store.NativeFSLockFactory@270f91ed),segFN=segments_3,generation=3,filenames=[segments_3]
[junit4:junit4]   2> 		commit{dir=MockDirWrapper(org.apache.lucene.store.RAMDirectory@576e466f
lockFactory=org.apache.lucene.store.NativeFSLockFactory@270f91ed),segFN=segments_4,generation=4,filenames=[_1_Lucene40WithOrds_0.frq,
_1_Lucene40WithOrds_0.tib, _1.fdx, _1_Lucene40WithOrds_0.prx, _1.fdt, _1_nrm.cfe, _1_nrm.cfs,
segments_4, _1_Memory_0.ram, _1.fnm, _1_Lucene40WithOrds_0.tii, _1_Memory_1.ram, _1.si]
[junit4:junit4]   2> 902 T4428 C51 oasc.SolrDeletionPolicy.updateCommits newest commit
= 4
[junit4:junit4]   2> 903 T4428 C51 oass.SolrIndexSearcher.<init> Opening Searcher@3ca66308
main
[junit4:junit4]   2> 903 T4428 C51 oass.SolrIndexSearcher.getIndexDir WARNING WARNING:
Directory impl does not support setting indexDir: org.apache.lucene.store.MockDirectoryWrapper
[junit4:junit4]   2> 903 T4429 oashc.SpellCheckComponent$SpellCheckerListener.buildSpellIndex
Building spell index for spell checker: default
[junit4:junit4]   2> 903 T4428 C51 oasu.DirectUpdateHandler2.commit end_commit_flush
[junit4:junit4]   2> 934 T4429 oashc.SpellCheckComponent$SpellCheckerListener.buildSpellIndex
Building spell index for spell checker: default_teststop
[junit4:junit4]   2> 955 T4429 oashc.SpellCheckComponent$SpellCheckerListener.buildSpellIndex
Building spell index for spell checker: threshold
[junit4:junit4]   2> 994 T4429 oashc.SpellCheckComponent$SpellCheckerListener.buildSpellIndex
Building spell index for spell checker: threshold_direct
[junit4:junit4]   2> 995 T4429 oashc.SpellCheckComponent$SpellCheckerListener.buildSpellIndex
Building spell index for spell checker: multipleFields
[junit4:junit4]   2> 1034 T4429 oashc.SpellCheckComponent$SpellCheckerListener.buildSpellIndex
Building spell index for spell checker: freq
[junit4:junit4]   2> 1074 T4429 oashc.SpellCheckComponent$SpellCheckerListener.buildSpellIndex
Building spell index for spell checker: fqcn
[junit4:junit4]   2> 1114 T4429 oasc.SolrCore.registerSearcher [collection1] Registered
new searcher Searcher@3ca66308 main{StandardDirectoryReader(segments_4:6 _1(4.0.0.1):C10)}
[junit4:junit4]   2> 1115 T4428 C51 UPDATE [collection1] webapp=null path=null params={}
{commit=} 0 215
[junit4:junit4]   2> 1116 T4428 C51 REQ [collection1] webapp=null path=null params={qt=spellCheckCompRH&spellcheck..perDict.foo=bar&json.nl=map&spellcheck..perDict.bar=foo&q=documemt&spellcheck=true&spellcheck.dictionary=perDict&spellcheck.build=true}
hits=0 status=0 QTime=0 
[junit4:junit4]   2> 1117 T4428 oas.SolrTestCaseJ4.assertJQ SEVERE query failed JSON validation.
error=mismatch: '0'!='2' @ spellcheck/suggestions/bar/startOffset
[junit4:junit4]   2> 	 expected =/spellcheck/suggestions/bar=={"numFound":1, "startOffset":0,
"endOffset":1, "suggestion":["foo"]}
[junit4:junit4]   2> 	 response = {
[junit4:junit4]   2> 	  "responseHeader":{
[junit4:junit4]   2> 	    "status":0,
[junit4:junit4]   2> 	    "QTime":0},
[junit4:junit4]   2> 	  "command":"build",
[junit4:junit4]   2> 	  "response":{"numFound":0,"start":0,"docs":[]
[junit4:junit4]   2> 	  },
[junit4:junit4]   2> 	  "spellcheck":{
[junit4:junit4]   2> 	    "suggestions":{
[junit4:junit4]   2> 	      "foo":{
[junit4:junit4]   2> 	        "numFound":1,
[junit4:junit4]   2> 	        "startOffset":0,
[junit4:junit4]   2> 	        "endOffset":1,
[junit4:junit4]   2> 	        "suggestion":["bar"]},
[junit4:junit4]   2> 	      "bar":{
[junit4:junit4]   2> 	        "numFound":1,
[junit4:junit4]   2> 	        "startOffset":2,
[junit4:junit4]   2> 	        "endOffset":3,
[junit4:junit4]   2> 	        "suggestion":["foo"]}}}}
[junit4:junit4]   2> 	
[junit4:junit4]   2> 	 request = qt=spellCheckCompRH&spellcheck..perDict.foo=bar&json.nl=map&spellcheck..perDict.bar=foo&q=documemt&spellcheck=true&spellcheck.dictionary=perDict&spellcheck.build=true
[junit4:junit4]   2> 1117 T4428 oas.SolrTestCaseJ4.tearDown ###Ending testPerDictionary
[junit4:junit4]   2> 1119 T4428 C51 oasu.DirectUpdateHandler2.deleteAll [collection1] REMOVING
ALL DOCUMENTS FROM INDEX
[junit4:junit4]   2> 1119 T4428 C51 UPDATE [collection1] webapp=null path=null params={}
{deleteByQuery=*:*} 0 0
[junit4:junit4]   2> 1122 T4428 C51 oasu.DirectUpdateHandler2.commit start commit{flags=0,_version_=0,optimize=false,openSearcher=true,waitSearcher=true,expungeDeletes=false,softCommit=false}
[junit4:junit4]   2> 1122 T4428 C51 oasc.SolrDeletionPolicy.onCommit SolrDeletionPolicy.onCommit:
commits:num=2
[junit4:junit4]   2> 		commit{dir=MockDirWrapper(org.apache.lucene.store.RAMDirectory@576e466f
lockFactory=org.apache.lucene.store.NativeFSLockFactory@270f91ed),segFN=segments_4,generation=4,filenames=[_1_Lucene40WithOrds_0.frq,
_1_Lucene40WithOrds_0.tib, _1.fdx, _1_Lucene40WithOrds_0.prx, _1.fdt, _1_nrm.cfe, _1_nrm.cfs,
segments_4, _1_Memory_0.ram, _1.fnm, _1_Lucene40WithOrds_0.tii, _1_Memory_1.ram, _1.si]
[junit4:junit4]   2> 		commit{dir=MockDirWrapper(org.apache.lucene.store.RAMDirectory@576e466f
lockFactory=org.apache.lucene.store.NativeFSLockFactory@270f91ed),segFN=segments_5,generation=5,filenames=[segments_5]
[junit4:junit4]   2> 1122 T4428 C51 oasc.SolrDeletionPolicy.updateCommits newest commit
= 5
[junit4:junit4]   2> 1123 T4428 C51 oass.SolrIndexSearcher.<init> Opening Searcher@77836e6b
main
[junit4:junit4]   2> 1123 T4428 C51 oass.SolrIndexSearcher.getIndexDir WARNING WARNING:
Directory impl does not support setting indexDir: org.apache.lucene.store.MockDirectoryWrapper
[junit4:junit4]   2> 1123 T4429 oashc.SpellCheckComponent$SpellCheckerListener.buildSpellIndex
Building spell index for spell checker: default
[junit4:junit4]   2> 1123 T4428 C51 oasu.DirectUpdateHandler2.commit end_commit_flush
[junit4:junit4]   2> 1145 T4429 oashc.SpellCheckComponent$SpellCheckerListener.buildSpellIndex
Building spell index for spell checker: default_teststop
[junit4:junit4]   2> 1168 T4429 oashc.SpellCheckComponent$SpellCheckerListener.buildSpellIndex
Building spell index for spell checker: threshold
[junit4:junit4]   2> 1195 T4429 oashc.SpellCheckComponent$SpellCheckerListener.buildSpellIndex
Building spell index for spell checker: threshold_direct
[junit4:junit4]   2> 1195 T4429 oashc.SpellCheckComponent$SpellCheckerListener.buildSpellIndex
Building spell index for spell checker: multipleFields
[junit4:junit4]   2> 1227 T4429 oashc.SpellCheckComponent$SpellCheckerListener.buildSpellIndex
Building spell index for spell checker: freq
[junit4:junit4]   2> 1315 T4429 oashc.SpellCheckComponent$SpellCheckerListener.buildSpellIndex
Building spell index for spell checker: fqcn
[junit4:junit4]   2> 1356 T4429 oasc.SolrCore.registerSearcher [collection1] Registered
new searcher Searcher@77836e6b main{StandardDirectoryReader(segments_5:7)}
[junit4:junit4]   2> 1356 T4428 C51 UPDATE [collection1] webapp=null path=null params={}
{commit=} 0 234
[junit4:junit4]   2> NOTE: reproduce with: ant test  -Dtestcase=SpellCheckComponentTest
-Dtests.method=testPerDictionary -Dtests.seed=ABEA617B5A60B879 -Dtests.multiplier=3 -Dtests.slow=true
-Dtests.locale=cs_CZ -Dtests.timezone=Pacific/Norfolk -Dtests.file.encoding=ISO-8859-1
[junit4:junit4]   2>
[junit4:junit4]    > (@AfterClass output)
[junit4:junit4]   2> 5673 T4428 oas.SolrTestCaseJ4.deleteCore ###deleteCore
[junit4:junit4]   2> 5674 T4428 oasc.CoreContainer.shutdown Shutting down CoreContainer
instance=258859307
[junit4:junit4]   2> 5674 T4428 oasc.SolrCore.close [collection1]  CLOSING SolrCore org.apache.solr.core.SolrCore@33d1e791
[junit4:junit4]   2> 5674 T4428 oasc.SolrCore.closeSearcher [collection1] Closing main
searcher on request.
[junit4:junit4]   2> 5674 T4428 oasu.DirectUpdateHandler2.close closing DirectUpdateHandler2{commits=20,autocommits=0,soft
autocommits=0,optimizes=0,rollbacks=0,expungeDeletes=0,docsPending=0,adds=0,deletesById=0,deletesByQuery=0,errors=0,cumulative_adds=92,cumulative_deletesById=0,cumulative_deletesByQuery=9,cumulative_errors=0}
[junit4:junit4]   2> NOTE: test params are: codec=Lucene40: {gram1=PostingsFormat(name=Memory
doPackFST= false), timestamp=PostingsFormat(name=Memory doPackFST= false), end1=PostingsFormat(name=Memory
doPackFST= false), word=PostingsFormat(name=Memory doPackFST= false), range_facet_si=PostingsFormat(name=Memory
doPackFST= false), intDefault=PostingsFormat(name=Memory doPackFST= true), lowerfilt=PostingsFormat(name=Memory
doPackFST= false), start4=PostingsFormat(name=Memory doPackFST= true), id=PostingsFormat(name=Lucene40WithOrds),
end4=PostingsFormat(name=MockSep), multiDefault=PostingsFormat(name=Memory doPackFST= false),
range_facet_sl=PostingsFormat(name=Lucene40WithOrds), gram2=PostingsFormat(name=Lucene40WithOrds),
start2=PostingsFormat(name=Memory doPackFST= false), gram3=PostingsFormat(name=Memory doPackFST=
true), range_facet_l=PostingsFormat(name=Memory doPackFST= false), start3=PostingsFormat(name=MockSep),
lowerfilt1and2=PostingsFormat(name=Memory doPackFST= false), end2=PostingsFormat(name=Lucene40WithOrds),
gram4=PostingsFormat(name=MockSep), start1=PostingsFormat(name=Lucene40WithOrds), end3=PostingsFormat(name=Memory
doPackFST= true)}, sim=DefaultSimilarity, locale=cs_CZ, timezone=Pacific/Norfolk
[junit4:junit4]   2> NOTE: Linux 3.2.0-26-generic amd64/Oracle Corporation 1.8.0-ea (64-bit)/cpus=8,threads=1,free=224578752,total=298319872
[junit4:junit4]   2> NOTE: All tests run in this JVM: [TestSolrCoreProperties, TestMergePolicyConfig,
CoreAdminHandlerTest, CacheHeaderTest, DistributedQueryElevationComponentTest, PrimitiveFieldTypeTest,
TestFaceting, SOLR749Test, NumericFieldsTest, OpenExchangeRatesOrgProviderTest, TestHyphenationCompoundWordTokenFilterFactory,
TestRandomFaceting, XmlUpdateRequestHandlerTest, SolrIndexConfigTest, DefaultValueUpdateProcessorTest,
SyncSliceTest, TestJmxIntegration, PingRequestHandlerTest, StatelessScriptUpdateProcessorFactoryTest,
TestPatternTokenizerFactory, TestCSVLoader, SolrCoreCheckLockOnStartupTest, PluginInfoTest,
TestCodecSupport, TestFinnishLightStemFilterFactory, DirectUpdateHandlerOptimizeTest, FastVectorHighlighterTest,
SolrCmdDistributorTest, RequestHandlersTest, TestStressVersions, TestDFRSimilarityFactory,
TestGermanStemFilterFactory, SolrRequestParserTest, TestNorwegianLightStemFilterFactory, TestChineseFilterFactory,
TestStandardFactories, TestSearchPerf, ConvertedLegacyTest, TestTrimFilterFactory, SimpleFacetsTest,
TestReversedWildcardFilterFactory, TestSwedishLightStemFilterFactory, RecoveryZkTest, TestIrishLowerCaseFilterFactory,
OutputWriterTest, ShowFileRequestHandlerTest, TestJapaneseBaseFormFilterFactory, TestCapitalizationFilterFactory,
TestPatternReplaceCharFilterFactory, TestSlowSynonymFilter, DateFieldTest, TestMappingCharFilterFactory,
TestCJKTokenizerFactory, TestPhoneticFilterFactory, TestJoin, FileUtilsTest, HighlighterTest,
TestBM25SimilarityFactory, BinaryUpdateRequestHandlerTest, TestFrenchLightStemFilterFactory,
QueryElevationComponentTest, TestBadConfig, DisMaxRequestHandlerTest, CurrencyFieldTest, DoubleMetaphoneFilterFactoryTest,
DistributedSpellCheckComponentTest, TestLFUCache, TestFrenchMinimalStemFilterFactory, TestStressRecovery,
DateMathParserTest, ZkNodePropsTest, TestHashPartitioner, TestPerFieldSimilarity, TestGermanLightStemFilterFactory,
SpellCheckComponentTest]
[junit4:junit4]   2> 
[junit4:junit4] Completed on J0 in 5.78s, 9 tests, 1 error <<< FAILURES!

[...truncated 456 lines...]
BUILD FAILED
/mnt/ssd/jenkins/workspace/Lucene-Solr-4.x-Linux-Java8-64/checkout/build.xml:29: The following
error occurred while executing this line:
/mnt/ssd/jenkins/workspace/Lucene-Solr-4.x-Linux-Java8-64/checkout/solr/build.xml:144: The
following error occurred while executing this line:
/mnt/ssd/jenkins/workspace/Lucene-Solr-4.x-Linux-Java8-64/checkout/lucene/module-build.xml:62:
The following error occurred while executing this line:
/mnt/ssd/jenkins/workspace/Lucene-Solr-4.x-Linux-Java8-64/checkout/lucene/common-build.xml:1094:
The following error occurred while executing this line:
/mnt/ssd/jenkins/workspace/Lucene-Solr-4.x-Linux-Java8-64/checkout/lucene/common-build.xml:789:
There were test failures: 305 suites, 1085 tests, 1 error, 5 ignored

Total time: 18 minutes 35 seconds
Build step 'Execute shell' marked build as failure
Archiving artifacts
Recording test results
Email was triggered for: Failure
Sending email for trigger: Failure




Mime
View raw message