lucene-dev mailing list archives

Site index · List index
Message view « Date » · « Thread »
Top « Date » · « Thread »
From Policeman Jenkins Server <jenk...@sd-datasolutions.de>
Subject [JENKINS] Lucene-Solr-4.x-Linux-Java6-64 - Build # 658 - Failure!
Date Sat, 28 Jul 2012 00:39:41 GMT
Build: http://jenkins.sd-datasolutions.de/job/Lucene-Solr-4.x-Linux-Java6-64/658/

1 tests failed.
FAILED:  org.apache.solr.core.CoreContainerCoreInitFailuresTest.testFlowBadFromStart

Error Message:
init failure doesn't mention problem: org.xml.sax.SAXParseException: Content is not allowed
in prolog.

Stack Trace:
java.lang.AssertionError: init failure doesn't mention problem: org.xml.sax.SAXParseException:
Content is not allowed in prolog.
	at __randomizedtesting.SeedInfo.seed([3077B16E40EBB0A8:AA8D7A96A4143EAC]:0)
	at org.junit.Assert.fail(Assert.java:93)
	at org.junit.Assert.assertTrue(Assert.java:43)
	at org.apache.solr.core.CoreContainerCoreInitFailuresTest.testFlowBadFromStart(CoreContainerCoreInitFailuresTest.java:279)
	at sun.reflect.NativeMethodAccessorImpl.invoke0(Native Method)
	at sun.reflect.NativeMethodAccessorImpl.invoke(NativeMethodAccessorImpl.java:39)
	at sun.reflect.DelegatingMethodAccessorImpl.invoke(DelegatingMethodAccessorImpl.java:25)
	at java.lang.reflect.Method.invoke(Method.java:597)
	at com.carrotsearch.randomizedtesting.RandomizedRunner.invoke(RandomizedRunner.java:1995)
	at com.carrotsearch.randomizedtesting.RandomizedRunner.access$1100(RandomizedRunner.java:132)
	at com.carrotsearch.randomizedtesting.RandomizedRunner$6.evaluate(RandomizedRunner.java:818)
	at com.carrotsearch.randomizedtesting.RandomizedRunner$7.evaluate(RandomizedRunner.java:877)
	at com.carrotsearch.randomizedtesting.RandomizedRunner$8.evaluate(RandomizedRunner.java:891)
	at com.carrotsearch.randomizedtesting.rules.SystemPropertiesRestoreRule$1.evaluate(SystemPropertiesRestoreRule.java:53)
	at org.apache.lucene.util.TestRuleSetupTeardownChained$1.evaluate(TestRuleSetupTeardownChained.java:50)
	at org.apache.lucene.util.TestRuleFieldCacheSanity$1.evaluate(TestRuleFieldCacheSanity.java:32)
	at org.apache.lucene.util.AbstractBeforeAfterRule$1.evaluate(AbstractBeforeAfterRule.java:45)
	at com.carrotsearch.randomizedtesting.rules.SystemPropertiesInvariantRule$1.evaluate(SystemPropertiesInvariantRule.java:55)
	at org.apache.lucene.util.TestRuleReportUncaughtExceptions$1.evaluate(TestRuleReportUncaughtExceptions.java:68)
	at org.apache.lucene.util.TestRuleThreadAndTestName$1.evaluate(TestRuleThreadAndTestName.java:48)
	at org.apache.lucene.util.TestRuleIgnoreAfterMaxFailures$1.evaluate(TestRuleIgnoreAfterMaxFailures.java:70)
	at org.apache.lucene.util.TestRuleMarkFailure$1.evaluate(TestRuleMarkFailure.java:48)
	at com.carrotsearch.randomizedtesting.RandomizedRunner.runSingleTest(RandomizedRunner.java:825)
	at com.carrotsearch.randomizedtesting.RandomizedRunner.access$700(RandomizedRunner.java:132)
	at com.carrotsearch.randomizedtesting.RandomizedRunner$3$1.run(RandomizedRunner.java:671)
	at com.carrotsearch.randomizedtesting.RandomizedRunner$3.evaluate(RandomizedRunner.java:697)
	at com.carrotsearch.randomizedtesting.RandomizedRunner$4.evaluate(RandomizedRunner.java:736)
	at com.carrotsearch.randomizedtesting.RandomizedRunner$5.evaluate(RandomizedRunner.java:747)
	at com.carrotsearch.randomizedtesting.rules.SystemPropertiesRestoreRule$1.evaluate(SystemPropertiesRestoreRule.java:53)
	at org.apache.lucene.util.AbstractBeforeAfterRule$1.evaluate(AbstractBeforeAfterRule.java:45)
	at org.apache.lucene.util.TestRuleReportUncaughtExceptions$1.evaluate(TestRuleReportUncaughtExceptions.java:68)
	at org.apache.lucene.util.TestRuleStoreClassName$1.evaluate(TestRuleStoreClassName.java:38)
	at com.carrotsearch.randomizedtesting.rules.SystemPropertiesInvariantRule$1.evaluate(SystemPropertiesInvariantRule.java:55)
	at org.apache.lucene.util.TestRuleNoInstanceHooksOverrides$1.evaluate(TestRuleNoInstanceHooksOverrides.java:53)
	at org.apache.lucene.util.TestRuleNoStaticHooksShadowing$1.evaluate(TestRuleNoStaticHooksShadowing.java:52)
	at org.apache.lucene.util.TestRuleAssertionsRequired$1.evaluate(TestRuleAssertionsRequired.java:36)
	at org.apache.lucene.util.TestRuleMarkFailure$1.evaluate(TestRuleMarkFailure.java:48)
	at org.apache.lucene.util.TestRuleIgnoreAfterMaxFailures$1.evaluate(TestRuleIgnoreAfterMaxFailures.java:70)
	at org.apache.lucene.util.TestRuleIgnoreTestSuites$1.evaluate(TestRuleIgnoreTestSuites.java:55)
	at com.carrotsearch.randomizedtesting.RandomizedRunner.runSuite(RandomizedRunner.java:605)
	at com.carrotsearch.randomizedtesting.RandomizedRunner.access$400(RandomizedRunner.java:132)
	at com.carrotsearch.randomizedtesting.RandomizedRunner$2.run(RandomizedRunner.java:551)




Build Log:
[...truncated 6508 lines...]
[junit4:junit4] Suite: org.apache.solr.core.CoreContainerCoreInitFailuresTest
[junit4:junit4] FAILURE 0.34s J0 | CoreContainerCoreInitFailuresTest.testFlowBadFromStart
[junit4:junit4]    > Throwable #1: java.lang.AssertionError: init failure doesn't mention
problem: org.xml.sax.SAXParseException: Content is not allowed in prolog.
[junit4:junit4]    > 	at __randomizedtesting.SeedInfo.seed([3077B16E40EBB0A8:AA8D7A96A4143EAC]:0)
[junit4:junit4]    > 	at org.junit.Assert.fail(Assert.java:93)
[junit4:junit4]    > 	at org.junit.Assert.assertTrue(Assert.java:43)
[junit4:junit4]    > 	at org.apache.solr.core.CoreContainerCoreInitFailuresTest.testFlowBadFromStart(CoreContainerCoreInitFailuresTest.java:279)
[junit4:junit4]    > 	at sun.reflect.NativeMethodAccessorImpl.invoke0(Native Method)
[junit4:junit4]    > 	at sun.reflect.NativeMethodAccessorImpl.invoke(NativeMethodAccessorImpl.java:39)
[junit4:junit4]    > 	at sun.reflect.DelegatingMethodAccessorImpl.invoke(DelegatingMethodAccessorImpl.java:25)
[junit4:junit4]    > 	at java.lang.reflect.Method.invoke(Method.java:597)
[junit4:junit4]    > 	at com.carrotsearch.randomizedtesting.RandomizedRunner.invoke(RandomizedRunner.java:1995)
[junit4:junit4]    > 	at com.carrotsearch.randomizedtesting.RandomizedRunner.access$1100(RandomizedRunner.java:132)
[junit4:junit4]    > 	at com.carrotsearch.randomizedtesting.RandomizedRunner$6.evaluate(RandomizedRunner.java:818)
[junit4:junit4]    > 	at com.carrotsearch.randomizedtesting.RandomizedRunner$7.evaluate(RandomizedRunner.java:877)
[junit4:junit4]    > 	at com.carrotsearch.randomizedtesting.RandomizedRunner$8.evaluate(RandomizedRunner.java:891)
[junit4:junit4]    > 	at com.carrotsearch.randomizedtesting.rules.SystemPropertiesRestoreRule$1.evaluate(SystemPropertiesRestoreRule.java:53)
[junit4:junit4]    > 	at org.apache.lucene.util.TestRuleSetupTeardownChained$1.evaluate(TestRuleSetupTeardownChained.java:50)
[junit4:junit4]    > 	at org.apache.lucene.util.TestRuleFieldCacheSanity$1.evaluate(TestRuleFieldCacheSanity.java:32)
[junit4:junit4]    > 	at org.apache.lucene.util.AbstractBeforeAfterRule$1.evaluate(AbstractBeforeAfterRule.java:45)
[junit4:junit4]    > 	at com.carrotsearch.randomizedtesting.rules.SystemPropertiesInvariantRule$1.evaluate(SystemPropertiesInvariantRule.java:55)
[junit4:junit4]    > 	at org.apache.lucene.util.TestRuleReportUncaughtExceptions$1.evaluate(TestRuleReportUncaughtExceptions.java:68)
[junit4:junit4]    > 	at org.apache.lucene.util.TestRuleThreadAndTestName$1.evaluate(TestRuleThreadAndTestName.java:48)
[junit4:junit4]    > 	at org.apache.lucene.util.TestRuleIgnoreAfterMaxFailures$1.evaluate(TestRuleIgnoreAfterMaxFailures.java:70)
[junit4:junit4]    > 	at org.apache.lucene.util.TestRuleMarkFailure$1.evaluate(TestRuleMarkFailure.java:48)
[junit4:junit4]    > 	at com.carrotsearch.randomizedtesting.RandomizedRunner.runSingleTest(RandomizedRunner.java:825)
[junit4:junit4]    > 	at com.carrotsearch.randomizedtesting.RandomizedRunner.access$700(RandomizedRunner.java:132)
[junit4:junit4]    > 	at com.carrotsearch.randomizedtesting.RandomizedRunner$3$1.run(RandomizedRunner.java:671)
[junit4:junit4]    > 	at com.carrotsearch.randomizedtesting.RandomizedRunner$3.evaluate(RandomizedRunner.java:697)
[junit4:junit4]    > 	at com.carrotsearch.randomizedtesting.RandomizedRunner$4.evaluate(RandomizedRunner.java:736)
[junit4:junit4]    > 	at com.carrotsearch.randomizedtesting.RandomizedRunner$5.evaluate(RandomizedRunner.java:747)
[junit4:junit4]    > 	at com.carrotsearch.randomizedtesting.rules.SystemPropertiesRestoreRule$1.evaluate(SystemPropertiesRestoreRule.java:53)
[junit4:junit4]    > 	at org.apache.lucene.util.AbstractBeforeAfterRule$1.evaluate(AbstractBeforeAfterRule.java:45)
[junit4:junit4]    > 	at org.apache.lucene.util.TestRuleReportUncaughtExceptions$1.evaluate(TestRuleReportUncaughtExceptions.java:68)
[junit4:junit4]    > 	at org.apache.lucene.util.TestRuleStoreClassName$1.evaluate(TestRuleStoreClassName.java:38)
[junit4:junit4]    > 	at com.carrotsearch.randomizedtesting.rules.SystemPropertiesInvariantRule$1.evaluate(SystemPropertiesInvariantRule.java:55)
[junit4:junit4]    > 	at org.apache.lucene.util.TestRuleNoInstanceHooksOverrides$1.evaluate(TestRuleNoInstanceHooksOverrides.java:53)
[junit4:junit4]    > 	at org.apache.lucene.util.TestRuleNoStaticHooksShadowing$1.evaluate(TestRuleNoStaticHooksShadowing.java:52)
[junit4:junit4]    > 	at org.apache.lucene.util.TestRuleAssertionsRequired$1.evaluate(TestRuleAssertionsRequired.java:36)
[junit4:junit4]    > 	at org.apache.lucene.util.TestRuleMarkFailure$1.evaluate(TestRuleMarkFailure.java:48)
[junit4:junit4]    > 	at org.apache.lucene.util.TestRuleIgnoreAfterMaxFailures$1.evaluate(TestRuleIgnoreAfterMaxFailures.java:70)
[junit4:junit4]    > 	at org.apache.lucene.util.TestRuleIgnoreTestSuites$1.evaluate(TestRuleIgnoreTestSuites.java:55)
[junit4:junit4]    > 	at com.carrotsearch.randomizedtesting.RandomizedRunner.runSuite(RandomizedRunner.java:605)
[junit4:junit4]    > 	at com.carrotsearch.randomizedtesting.RandomizedRunner.access$400(RandomizedRunner.java:132)
[junit4:junit4]    > 	at com.carrotsearch.randomizedtesting.RandomizedRunner$2.run(RandomizedRunner.java:551)
[junit4:junit4]    > 
[junit4:junit4]   2> 2 T236 oas.SolrTestCaseJ4.setUp ###Starting testFlowBadFromStart
[junit4:junit4]   2> 3 T236 oasc.CoreContainer.<init> New CoreContainer 704415906
[junit4:junit4]   2> 5 T236 oasc.CoreContainer.load Loading CoreContainer using Solr Home:
'/mnt/ssd/jenkins/workspace/Lucene-Solr-4.x-Linux-Java6-64/checkout/solr/build/solr-core/test/J0/./org.apache.solr.core.CoreContainerCoreInitFailuresTest_bad_flow'
[junit4:junit4]   2> 5 T236 oasc.SolrResourceLoader.<init> new SolrResourceLoader
for directory: '/mnt/ssd/jenkins/workspace/Lucene-Solr-4.x-Linux-Java6-64/checkout/solr/build/solr-core/test/J0/./org.apache.solr.core.CoreContainerCoreInitFailuresTest_bad_flow/'
[junit4:junit4]   2> 17 T236 oasc.CoreContainer.load Registering Log Listener
[junit4:junit4]   2> 32 T236 oasc.CoreContainer.create Creating SolrCore 'col_ok' using
instanceDir: /mnt/ssd/jenkins/workspace/Lucene-Solr-4.x-Linux-Java6-64/checkout/solr/build/solr-core/test/J0/./org.apache.solr.core.CoreContainerCoreInitFailuresTest_bad_flow/col_ok
[junit4:junit4]   2> 33 T236 oasc.SolrResourceLoader.<init> new SolrResourceLoader
for directory: '/mnt/ssd/jenkins/workspace/Lucene-Solr-4.x-Linux-Java6-64/checkout/solr/build/solr-core/test/J0/./org.apache.solr.core.CoreContainerCoreInitFailuresTest_bad_flow/col_ok/'
[junit4:junit4]   2> 54 T236 oasc.SolrConfig.<init> Using Lucene MatchVersion: LUCENE_40
[junit4:junit4]   2> 78 T236 oasc.SolrConfig.<init> Loaded SolrConfig: solrconfig.xml
[junit4:junit4]   2> 79 T236 oass.IndexSchema.readSchema Reading Solr Schema
[junit4:junit4]   2> 81 T236 oass.IndexSchema.readSchema Schema name=minimal
[junit4:junit4]   2> 92 T236 oass.IndexSchema.readSchema WARNING no uniqueKey specified
in schema.
[junit4:junit4]   2> 93 T236 oasc.SolrCore.<init> [col_ok] Opening new SolrCore at
/mnt/ssd/jenkins/workspace/Lucene-Solr-4.x-Linux-Java6-64/checkout/solr/build/solr-core/test/J0/./org.apache.solr.core.CoreContainerCoreInitFailuresTest_bad_flow/col_ok/,
dataDir=/mnt/ssd/jenkins/workspace/Lucene-Solr-4.x-Linux-Java6-64/checkout/solr/build/solr-core/test/J0/./org.apache.solr.core.CoreContainerCoreInitFailuresTest_bad_flow/col_ok/data/
[junit4:junit4]   2> 93 T236 oasc.SolrCore.<init> JMX monitoring not detected for
core: col_ok
[junit4:junit4]   2> 93 T236 oasc.SolrCore.getNewIndexDir WARNING New index directory detected:
old=null new=/mnt/ssd/jenkins/workspace/Lucene-Solr-4.x-Linux-Java6-64/checkout/solr/build/solr-core/test/J0/./org.apache.solr.core.CoreContainerCoreInitFailuresTest_bad_flow/col_ok/data/index/
[junit4:junit4]   2> 94 T236 oasc.SolrCore.initIndex WARNING [col_ok] Solr index directory
'/mnt/ssd/jenkins/workspace/Lucene-Solr-4.x-Linux-Java6-64/checkout/solr/build/solr-core/test/J0/./org.apache.solr.core.CoreContainerCoreInitFailuresTest_bad_flow/col_ok/data/index'
doesn't exist. Creating new index...
[junit4:junit4]   2> 95 T236 oasc.SolrDeletionPolicy.onCommit SolrDeletionPolicy.onCommit:
commits:num=1
[junit4:junit4]   2> 		commit{dir=BaseDirectoryWrapper(org.apache.lucene.store.RAMDirectory@1ba1d394
lockFactory=org.apache.lucene.store.NativeFSLockFactory@4ea2300d),segFN=segments_1,generation=1,filenames=[segments_1]
[junit4:junit4]   2> 95 T236 oasc.SolrDeletionPolicy.updateCommits newest commit = 1
[junit4:junit4]   2> 96 T236 oasc.RequestHandlers.initHandlersFromConfig created standard:
solr.StandardRequestHandler
[junit4:junit4]   2> 98 T236 oass.SolrIndexSearcher.<init> Opening Searcher@29264cac
main
[junit4:junit4]   2> 98 T236 oass.SolrIndexSearcher.getIndexDir WARNING WARNING: Directory
impl does not support setting indexDir: org.apache.lucene.store.BaseDirectoryWrapper
[junit4:junit4]   2> 98 T236 oasu.CommitTracker.<init> Hard AutoCommit: disabled
[junit4:junit4]   2> 99 T236 oasu.CommitTracker.<init> Soft AutoCommit: disabled
[junit4:junit4]   2> 99 T236 oashc.HttpShardHandlerFactory.getParameter Setting socketTimeout
to: 0
[junit4:junit4]   2> 99 T236 oashc.HttpShardHandlerFactory.getParameter Setting urlScheme
to: http://
[junit4:junit4]   2> 99 T236 oashc.HttpShardHandlerFactory.getParameter Setting connTimeout
to: 0
[junit4:junit4]   2> 100 T236 oashc.HttpShardHandlerFactory.getParameter Setting maxConnectionsPerHost
to: 20
[junit4:junit4]   2> 100 T236 oashc.HttpShardHandlerFactory.getParameter Setting corePoolSize
to: 0
[junit4:junit4]   2> 100 T236 oashc.HttpShardHandlerFactory.getParameter Setting maximumPoolSize
to: 2147483647
[junit4:junit4]   2> 100 T236 oashc.HttpShardHandlerFactory.getParameter Setting maxThreadIdleTime
to: 5
[junit4:junit4]   2> 101 T236 oashc.HttpShardHandlerFactory.getParameter Setting sizeOfQueue
to: -1
[junit4:junit4]   2> 101 T236 oashc.HttpShardHandlerFactory.getParameter Setting fairnessPolicy
to: false
[junit4:junit4]   2> 101 T236 oascsi.HttpClientUtil.createClient Creating new http client,
config:maxConnectionsPerHost=20&maxConnections=10000&socketTimeout=0&connTimeout=0&retry=false
[junit4:junit4]   2> 103 T236 oasc.CoreContainer.register registering core: col_ok
[junit4:junit4]   2> 104 T237 oasc.SolrCore.registerSearcher [col_ok] Registered new searcher
Searcher@29264cac main{StandardDirectoryReader(segments_1:1)}
[junit4:junit4]   2> 105 T236 oasc.CoreContainer.create Creating SolrCore 'col_bad' using
instanceDir: /mnt/ssd/jenkins/workspace/Lucene-Solr-4.x-Linux-Java6-64/checkout/solr/build/solr-core/test/J0/./org.apache.solr.core.CoreContainerCoreInitFailuresTest_bad_flow/col_bad
[junit4:junit4]   2> 105 T236 oasc.SolrResourceLoader.<init> new SolrResourceLoader
for directory: '/mnt/ssd/jenkins/workspace/Lucene-Solr-4.x-Linux-Java6-64/checkout/solr/build/solr-core/test/J0/./org.apache.solr.core.CoreContainerCoreInitFailuresTest_bad_flow/col_bad/'
[junit4:junit4]   2> 126 T236 oasc.SolrConfig.<init> Using Lucene MatchVersion: LUCENE_40
[junit4:junit4]   2> 151 T236 oasc.SolrConfig.<init> Loaded SolrConfig: solrconfig.xml
[junit4:junit4]   2> 151 T236 oass.IndexSchema.readSchema Reading Solr Schema
[junit4:junit4]   2> 153 T236 oass.IndexSchema.readSchema Schema name=minimal
[junit4:junit4]   2> 160 T236 oass.IndexSchema.readSchema WARNING no uniqueKey specified
in schema.
[junit4:junit4]   2> 161 T236 oasc.SolrCore.<init> [col_bad] Opening new SolrCore
at /mnt/ssd/jenkins/workspace/Lucene-Solr-4.x-Linux-Java6-64/checkout/solr/build/solr-core/test/J0/./org.apache.solr.core.CoreContainerCoreInitFailuresTest_bad_flow/col_bad/,
dataDir=/mnt/ssd/jenkins/workspace/Lucene-Solr-4.x-Linux-Java6-64/checkout/solr/build/solr-core/test/J0/./org.apache.solr.core.CoreContainerCoreInitFailuresTest_bad_flow/col_bad/data/
[junit4:junit4]   2> 161 T236 oasc.SolrCore.<init> JMX monitoring not detected for
core: col_bad
[junit4:junit4]   2> 161 T236 oasc.SolrCore.getNewIndexDir WARNING New index directory
detected: old=null new=/mnt/ssd/jenkins/workspace/Lucene-Solr-4.x-Linux-Java6-64/checkout/solr/build/solr-core/test/J0/./org.apache.solr.core.CoreContainerCoreInitFailuresTest_bad_flow/col_bad/data/index/
[junit4:junit4]   2> 161 T236 oasc.SolrCore.initIndex WARNING [col_bad] Solr index directory
'/mnt/ssd/jenkins/workspace/Lucene-Solr-4.x-Linux-Java6-64/checkout/solr/build/solr-core/test/J0/./org.apache.solr.core.CoreContainerCoreInitFailuresTest_bad_flow/col_bad/data/index'
doesn't exist. Creating new index...
[junit4:junit4]   2> 163 T236 oasc.SolrException.log Ignoring exception matching \QDummyMergePolicy\E
[junit4:junit4]   2> 164 T236 oasc.CoreContainer.create Creating SolrCore 'col_bad' using
instanceDir: /mnt/ssd/jenkins/workspace/Lucene-Solr-4.x-Linux-Java6-64/checkout/solr/build/solr-core/test/J0/./org.apache.solr.core.CoreContainerCoreInitFailuresTest_bad_flow/col_bad
[junit4:junit4]   2> 164 T236 oasc.SolrResourceLoader.<init> new SolrResourceLoader
for directory: '/mnt/ssd/jenkins/workspace/Lucene-Solr-4.x-Linux-Java6-64/checkout/solr/build/solr-core/test/J0/./org.apache.solr.core.CoreContainerCoreInitFailuresTest_bad_flow/col_bad/'
[junit4:junit4]   2> 181 T236 oasc.SolrConfig.<init> Using Lucene MatchVersion: LUCENE_40
[junit4:junit4]   2> 206 T236 oasc.SolrConfig.<init> Loaded SolrConfig: solrconfig.xml
[junit4:junit4]   2> 206 T236 oass.IndexSchema.readSchema Reading Solr Schema
[junit4:junit4]   2> 208 T236 oass.IndexSchema.readSchema Schema name=minimal
[junit4:junit4]   2> 215 T236 oass.IndexSchema.readSchema WARNING no uniqueKey specified
in schema.
[junit4:junit4]   2> 216 T236 oasc.SolrCore.<init> [col_bad] Opening new SolrCore
at /mnt/ssd/jenkins/workspace/Lucene-Solr-4.x-Linux-Java6-64/checkout/solr/build/solr-core/test/J0/./org.apache.solr.core.CoreContainerCoreInitFailuresTest_bad_flow/col_bad/,
dataDir=/mnt/ssd/jenkins/workspace/Lucene-Solr-4.x-Linux-Java6-64/checkout/solr/build/solr-core/test/J0/./org.apache.solr.core.CoreContainerCoreInitFailuresTest_bad_flow/col_bad/data/
[junit4:junit4]   2> 216 T236 oasc.SolrCore.<init> JMX monitoring not detected for
core: col_bad
[junit4:junit4]   2> 216 T236 oasc.SolrCore.getNewIndexDir WARNING New index directory
detected: old=null new=/mnt/ssd/jenkins/workspace/Lucene-Solr-4.x-Linux-Java6-64/checkout/solr/build/solr-core/test/J0/./org.apache.solr.core.CoreContainerCoreInitFailuresTest_bad_flow/col_bad/data/index/
[junit4:junit4]   2> 217 T236 oasc.SolrCore.initIndex WARNING [col_bad] Solr index directory
'/mnt/ssd/jenkins/workspace/Lucene-Solr-4.x-Linux-Java6-64/checkout/solr/build/solr-core/test/J0/./org.apache.solr.core.CoreContainerCoreInitFailuresTest_bad_flow/col_bad/data/index'
doesn't exist. Creating new index...
[junit4:junit4]   2> 218 T236 oasc.SolrDeletionPolicy.onCommit SolrDeletionPolicy.onCommit:
commits:num=1
[junit4:junit4]   2> 		commit{dir=MockDirWrapper(org.apache.lucene.store.RAMDirectory@6ea3dbbd
lockFactory=org.apache.lucene.store.NativeFSLockFactory@5696574a),segFN=segments_1,generation=1,filenames=[segments_1]
[junit4:junit4]   2> 218 T236 oasc.SolrDeletionPolicy.updateCommits newest commit = 1
[junit4:junit4]   2> 219 T236 oasc.RequestHandlers.initHandlersFromConfig created standard:
solr.StandardRequestHandler
[junit4:junit4]   2> 221 T236 oass.SolrIndexSearcher.<init> Opening Searcher@6ec21f2
main
[junit4:junit4]   2> 221 T236 oass.SolrIndexSearcher.getIndexDir WARNING WARNING: Directory
impl does not support setting indexDir: org.apache.lucene.store.MockDirectoryWrapper
[junit4:junit4]   2> 221 T236 oasu.CommitTracker.<init> Hard AutoCommit: disabled
[junit4:junit4]   2> 221 T236 oasu.CommitTracker.<init> Soft AutoCommit: disabled
[junit4:junit4]   2> 222 T238 oasc.SolrCore.registerSearcher [col_bad] Registered new searcher
Searcher@6ec21f2 main{StandardDirectoryReader(segments_1:1)}
[junit4:junit4]   2> 222 T236 oasc.CoreContainer.register registering core: col_bad
[junit4:junit4]   2> 222 T236 oasc.CoreContainer.create Creating SolrCore 'bogus' using
instanceDir: /mnt/ssd/jenkins/workspace/Lucene-Solr-4.x-Linux-Java6-64/checkout/solr/build/solr-core/test/J0/./org.apache.solr.core.CoreContainerCoreInitFailuresTest_bad_flow/bogus_path
[junit4:junit4]   2> 222 T236 oasc.SolrResourceLoader.<init> new SolrResourceLoader
for directory: '/mnt/ssd/jenkins/workspace/Lucene-Solr-4.x-Linux-Java6-64/checkout/solr/build/solr-core/test/J0/./org.apache.solr.core.CoreContainerCoreInitFailuresTest_bad_flow/bogus_path/'
[junit4:junit4]   2> 227 T236 oasc.CoreContainer.register registering core: bogus
[junit4:junit4]   2> 228 T236 oasc.CoreContainer.reload Reloading SolrCore 'col_bad' using
instanceDir: /mnt/ssd/jenkins/workspace/Lucene-Solr-4.x-Linux-Java6-64/checkout/solr/build/solr-core/test/J0/./org.apache.solr.core.CoreContainerCoreInitFailuresTest_bad_flow/col_bad
[junit4:junit4]   2> 228 T236 oasc.SolrResourceLoader.<init> new SolrResourceLoader
for directory: '/mnt/ssd/jenkins/workspace/Lucene-Solr-4.x-Linux-Java6-64/checkout/solr/build/solr-core/test/J0/./org.apache.solr.core.CoreContainerCoreInitFailuresTest_bad_flow/col_bad/'
[junit4:junit4]   2> 235 T236 oasc.SolrException.log SEVERE Exception during parsing file:
solrconfig.xml:org.xml.sax.SAXParseException: Content is not allowed in prolog.
[junit4:junit4]   2> 		at com.sun.org.apache.xerces.internal.util.ErrorHandlerWrapper.createSAXParseException(ErrorHandlerWrapper.java:195)
[junit4:junit4]   2> 		at com.sun.org.apache.xerces.internal.util.ErrorHandlerWrapper.fatalError(ErrorHandlerWrapper.java:174)
[junit4:junit4]   2> 		at com.sun.org.apache.xerces.internal.impl.XMLErrorReporter.reportError(XMLErrorReporter.java:388)
[junit4:junit4]   2> 		at com.sun.org.apache.xerces.internal.impl.XMLScanner.reportFatalError(XMLScanner.java:1427)
[junit4:junit4]   2> 		at com.sun.org.apache.xerces.internal.impl.XMLDocumentScannerImpl$PrologDriver.next(XMLDocumentScannerImpl.java:1036)
[junit4:junit4]   2> 		at com.sun.org.apache.xerces.internal.impl.XMLDocumentScannerImpl.next(XMLDocumentScannerImpl.java:647)
[junit4:junit4]   2> 		at com.sun.org.apache.xerces.internal.impl.XMLNSDocumentScannerImpl.next(XMLNSDocumentScannerImpl.java:140)
[junit4:junit4]   2> 		at com.sun.org.apache.xerces.internal.impl.XMLDocumentFragmentScannerImpl.scanDocument(XMLDocumentFragmentScannerImpl.java:511)
[junit4:junit4]   2> 		at com.sun.org.apache.xerces.internal.parsers.XML11Configuration.parse(XML11Configuration.java:808)
[junit4:junit4]   2> 		at com.sun.org.apache.xerces.internal.parsers.XML11Configuration.parse(XML11Configuration.java:737)
[junit4:junit4]   2> 		at com.sun.org.apache.xerces.internal.parsers.XMLParser.parse(XMLParser.java:119)
[junit4:junit4]   2> 		at com.sun.org.apache.xerces.internal.parsers.DOMParser.parse(DOMParser.java:232)
[junit4:junit4]   2> 		at com.sun.org.apache.xerces.internal.jaxp.DocumentBuilderImpl.parse(DocumentBuilderImpl.java:284)
[junit4:junit4]   2> 		at org.apache.solr.core.Config.<init>(Config.java:129)
[junit4:junit4]   2> 		at org.apache.solr.core.Config.<init>(Config.java:78)
[junit4:junit4]   2> 		at org.apache.solr.core.SolrConfig.<init>(SolrConfig.java:117)
[junit4:junit4]   2> 		at org.apache.solr.core.SolrCore.reload(SolrCore.java:364)
[junit4:junit4]   2> 		at org.apache.solr.core.CoreContainer.reload(CoreContainer.java:1015)
[junit4:junit4]   2> 		at org.apache.solr.core.CoreContainerCoreInitFailuresTest.testFlowBadFromStart(CoreContainerCoreInitFailuresTest.java:252)
[junit4:junit4]   2> 		at sun.reflect.NativeMethodAccessorImpl.invoke0(Native Method)
[junit4:junit4]   2> 		at sun.reflect.NativeMethodAccessorImpl.invoke(NativeMethodAccessorImpl.java:39)
[junit4:junit4]   2> 		at sun.reflect.DelegatingMethodAccessorImpl.invoke(DelegatingMethodAccessorImpl.java:25)
[junit4:junit4]   2> 		at java.lang.reflect.Method.invoke(Method.java:597)
[junit4:junit4]   2> 		at com.carrotsearch.randomizedtesting.RandomizedRunner.invoke(RandomizedRunner.java:1995)
[junit4:junit4]   2> 		at com.carrotsearch.randomizedtesting.RandomizedRunner.access$1100(RandomizedRunner.java:132)
[junit4:junit4]   2> 		at com.carrotsearch.randomizedtesting.RandomizedRunner$6.evaluate(RandomizedRunner.java:818)
[junit4:junit4]   2> 		at com.carrotsearch.randomizedtesting.RandomizedRunner$7.evaluate(RandomizedRunner.java:877)
[junit4:junit4]   2> 		at com.carrotsearch.randomizedtesting.RandomizedRunner$8.evaluate(RandomizedRunner.java:891)
[junit4:junit4]   2> 		at com.carrotsearch.randomizedtesting.rules.SystemPropertiesRestoreRule$1.evaluate(SystemPropertiesRestoreRule.java:53)
[junit4:junit4]   2> 		at org.apache.lucene.util.TestRuleSetupTeardownChained$1.evaluate(TestRuleSetupTeardownChained.java:50)
[junit4:junit4]   2> 		at org.apache.lucene.util.TestRuleFieldCacheSanity$1.evaluate(TestRuleFieldCacheSanity.java:32)
[junit4:junit4]   2> 		at org.apache.lucene.util.AbstractBeforeAfterRule$1.evaluate(AbstractBeforeAfterRule.java:45)
[junit4:junit4]   2> 		at com.carrotsearch.randomizedtesting.rules.SystemPropertiesInvariantRule$1.evaluate(SystemPropertiesInvariantRule.java:55)
[junit4:junit4]   2> 		at org.apache.lucene.util.TestRuleReportUncaughtExceptions$1.evaluate(TestRuleReportUncaughtExceptions.java:68)
[junit4:junit4]   2> 		at org.apache.lucene.util.TestRuleThreadAndTestName$1.evaluate(TestRuleThreadAndTestName.java:48)
[junit4:junit4]   2> 		at org.apache.lucene.util.TestRuleIgnoreAfterMaxFailures$1.evaluate(TestRuleIgnoreAfterMaxFailures.java:70)
[junit4:junit4]   2> 		at org.apache.lucene.util.TestRuleMarkFailure$1.evaluate(TestRuleMarkFailure.java:48)
[junit4:junit4]   2> 		at com.carrotsearch.randomizedtesting.RandomizedRunner.runSingleTest(RandomizedRunner.java:825)
[junit4:junit4]   2> 		at com.carrotsearch.randomizedtesting.RandomizedRunner.access$700(RandomizedRunner.java:132)
[junit4:junit4]   2> 		at com.carrotsearch.randomizedtesting.RandomizedRunner$3$1.run(RandomizedRunner.java:671)
[junit4:junit4]   2> 		at com.carrotsearch.randomizedtesting.RandomizedRunner$3.evaluate(RandomizedRunner.java:697)
[junit4:junit4]   2> 		at com.carrotsearch.randomizedtesting.RandomizedRunner$4.evaluate(RandomizedRunner.java:736)
[junit4:junit4]   2> 		at com.carrotsearch.randomizedtesting.RandomizedRunner$5.evaluate(RandomizedRunner.java:747)
[junit4:junit4]   2> 		at com.carrotsearch.randomizedtesting.rules.SystemPropertiesRestoreRule$1.evaluate(SystemPropertiesRestoreRule.java:53)
[junit4:junit4]   2> 		at org.apache.lucene.util.AbstractBeforeAfterRule$1.evaluate(AbstractBeforeAfterRule.java:45)
[junit4:junit4]   2> 		at org.apache.lucene.util.TestRuleReportUncaughtExceptions$1.evaluate(TestRuleReportUncaughtExceptions.java:68)
[junit4:junit4]   2> 		at org.apache.lucene.util.TestRuleStoreClassName$1.evaluate(TestRuleStoreClassName.java:38)
[junit4:junit4]   2> 		at com.carrotsearch.randomizedtesting.rules.SystemPropertiesInvariantRule$1.evaluate(SystemPropertiesInvariantRule.java:55)
[junit4:junit4]   2> 		at org.apache.lucene.util.TestRuleNoInstanceHooksOverrides$1.evaluate(TestRuleNoInstanceHooksOverrides.java:53)
[junit4:junit4]   2> 		at org.apache.lucene.util.TestRuleNoStaticHooksShadowing$1.evaluate(TestRuleNoStaticHooksShadowing.java:52)
[junit4:junit4]   2> 		at org.apache.lucene.util.TestRuleAssertionsRequired$1.evaluate(TestRuleAssertionsRequired.java:36)
[junit4:junit4]   2> 		at org.apache.lucene.util.TestRuleMarkFailure$1.evaluate(TestRuleMarkFailure.java:48)
[junit4:junit4]   2> 		at org.apache.lucene.util.TestRuleIgnoreAfterMaxFailures$1.evaluate(TestRuleIgnoreAfterMaxFailures.java:70)
[junit4:junit4]   2> 		at org.apache.lucene.util.TestRuleIgnoreTestSuites$1.evaluate(TestRuleIgnoreTestSuites.java:55)
[junit4:junit4]   2> 		at com.carrotsearch.randomizedtesting.RandomizedRunner.runSuite(RandomizedRunner.java:605)
[junit4:junit4]   2> 		at com.carrotsearch.randomizedtesting.RandomizedRunner.access$400(RandomizedRunner.java:132)
[junit4:junit4]   2> 		at com.carrotsearch.randomizedtesting.RandomizedRunner$2.run(RandomizedRunner.java:551)
[junit4:junit4]   2> 	
[junit4:junit4]   2> 237 T236 oasc.CoreContainer.shutdown Shutting down CoreContainer instance=704415906
[junit4:junit4]   2> 237 T236 oasc.SolrCore.close [col_bad]  CLOSING SolrCore org.apache.solr.core.SolrCore@37d541d4
[junit4:junit4]   2> 237 T236 oasc.SolrCore.closeSearcher [col_bad] Closing main searcher
on request.
[junit4:junit4]   2> 238 T236 oasu.DirectUpdateHandler2.close closing DirectUpdateHandler2{commits=0,autocommits=0,soft
autocommits=0,optimizes=0,rollbacks=0,expungeDeletes=0,docsPending=0,adds=0,deletesById=0,deletesByQuery=0,errors=0,cumulative_adds=0,cumulative_deletesById=0,cumulative_deletesByQuery=0,cumulative_errors=0}
[junit4:junit4]   2> 238 T236 oasc.SolrCore.close [bogus]  CLOSING SolrCore org.apache.solr.core.SolrCore@23ae23
[junit4:junit4]   2> 238 T236 oasc.SolrCore.closeSearcher [bogus] Closing main searcher
on request.
[junit4:junit4]   2> 239 T236 oasu.DirectUpdateHandler2.close closing DirectUpdateHandler2{commits=0,autocommits=0,soft
autocommits=0,optimizes=0,rollbacks=0,expungeDeletes=0,docsPending=0,adds=0,deletesById=0,deletesByQuery=0,errors=0,cumulative_adds=0,cumulative_deletesById=0,cumulative_deletesByQuery=0,cumulative_errors=0}
[junit4:junit4]   2> 240 T236 oas.SolrTestCaseJ4.tearDown ###Ending testFlowBadFromStart
[junit4:junit4]   2> NOTE: reproduce with: ant test  -Dtestcase=CoreContainerCoreInitFailuresTest
-Dtests.method=testFlowBadFromStart -Dtests.seed=3077B16E40EBB0A8 -Dtests.multiplier=3 -Dtests.slow=true
-Dtests.locale=zh_SG -Dtests.timezone=America/El_Salvador -Dtests.file.encoding=US-ASCII
[junit4:junit4]   2>
[junit4:junit4]    > (@AfterClass output)
[junit4:junit4]   2> 386 T236 oas.SolrTestCaseJ4.deleteCore ###deleteCore
[junit4:junit4]   2> NOTE: test params are: codec=Asserting, sim=DefaultSimilarity, locale=zh_SG,
timezone=America/El_Salvador
[junit4:junit4]   2> NOTE: Linux 3.2.0-26-generic amd64/Sun Microsystems Inc. 1.6.0_33
(64-bit)/cpus=8,threads=1,free=203218952,total=255066112
[junit4:junit4]   2> NOTE: All tests run in this JVM: [DefaultValueUpdateProcessorTest,
TestDefaultSimilarityFactory, TestFastLRUCache, JSONWriterTest, DOMUtilTest, RequestHandlersTest,
TermsComponentTest, TestReload, SolrCoreCheckLockOnStartupTest, FastVectorHighlighterTest,
SyncSliceTest, SpatialFilterTest, TestSort, SOLR749Test, IndexSchemaRuntimeFieldTest, TestBadConfig,
TestSurroundQueryParser, SignatureUpdateProcessorFactoryTest, TestStressLucene, CoreContainerCoreInitFailuresTest]
[junit4:junit4]   2> 
[junit4:junit4] Completed on J0 in 0.40s, 2 tests, 1 failure <<< FAILURES!

[...truncated 531 lines...]
BUILD FAILED
/mnt/ssd/jenkins/workspace/Lucene-Solr-4.x-Linux-Java6-64/checkout/build.xml:29: The following
error occurred while executing this line:
/mnt/ssd/jenkins/workspace/Lucene-Solr-4.x-Linux-Java6-64/checkout/solr/build.xml:144: The
following error occurred while executing this line:
/mnt/ssd/jenkins/workspace/Lucene-Solr-4.x-Linux-Java6-64/checkout/lucene/module-build.xml:62:
The following error occurred while executing this line:
/mnt/ssd/jenkins/workspace/Lucene-Solr-4.x-Linux-Java6-64/checkout/lucene/common-build.xml:1095:
The following error occurred while executing this line:
/mnt/ssd/jenkins/workspace/Lucene-Solr-4.x-Linux-Java6-64/checkout/lucene/common-build.xml:790:
There were test failures: 223 suites, 901 tests, 1 failure, 5 ignored

Total time: 19 minutes 58 seconds
Build step 'Execute shell' marked build as failure
Archiving artifacts
Recording test results
Email was triggered for: Failure
Sending email for trigger: Failure




Mime
View raw message