lucene-dev mailing list archives

Site index · List index
Message view « Date » · « Thread »
Top « Date » · « Thread »
From Policeman Jenkins Server <jenk...@sd-datasolutions.de>
Subject [JENKINS] Lucene-Solr-4.x-Linux-Java8-64 - Build # 7 - Still Failing!
Date Sun, 08 Jul 2012 16:21:18 GMT
Build: http://jenkins.sd-datasolutions.de/job/Lucene-Solr-4.x-Linux-Java8-64/7/

2 tests failed.
REGRESSION:  org.apache.solr.handler.component.SpellCheckComponentTest.testPerDictionary

Error Message:
mismatch: '0'!='2' @ spellcheck/suggestions/bar/startOffset

Stack Trace:
java.lang.RuntimeException: mismatch: '0'!='2' @ spellcheck/suggestions/bar/startOffset
	at __randomizedtesting.SeedInfo.seed([78F5428526CDF64:C081A0805A00CA2C]:0)
	at org.apache.solr.SolrTestCaseJ4.assertJQ(SolrTestCaseJ4.java:573)
	at org.apache.solr.SolrTestCaseJ4.assertJQ(SolrTestCaseJ4.java:521)
	at org.apache.solr.handler.component.SpellCheckComponentTest.testPerDictionary(SpellCheckComponentTest.java:102)
	at sun.reflect.NativeMethodAccessorImpl.invoke0(Native Method)
	at sun.reflect.NativeMethodAccessorImpl.invoke(NativeMethodAccessorImpl.java:57)
	at sun.reflect.DelegatingMethodAccessorImpl.invoke(DelegatingMethodAccessorImpl.java:43)
	at java.lang.reflect.Method.invoke(Method.java:474)
	at com.carrotsearch.randomizedtesting.RandomizedRunner.invoke(RandomizedRunner.java:1995)
	at com.carrotsearch.randomizedtesting.RandomizedRunner.access$1100(RandomizedRunner.java:132)
	at com.carrotsearch.randomizedtesting.RandomizedRunner$6.evaluate(RandomizedRunner.java:818)
	at com.carrotsearch.randomizedtesting.RandomizedRunner$7.evaluate(RandomizedRunner.java:877)
	at com.carrotsearch.randomizedtesting.RandomizedRunner$8.evaluate(RandomizedRunner.java:891)
	at com.carrotsearch.randomizedtesting.rules.SystemPropertiesRestoreRule$1.evaluate(SystemPropertiesRestoreRule.java:53)
	at org.apache.lucene.util.TestRuleSetupTeardownChained$1.evaluate(TestRuleSetupTeardownChained.java:50)
	at org.apache.lucene.util.TestRuleFieldCacheSanity$1.evaluate(TestRuleFieldCacheSanity.java:32)
	at org.apache.lucene.util.AbstractBeforeAfterRule$1.evaluate(AbstractBeforeAfterRule.java:45)
	at com.carrotsearch.randomizedtesting.rules.SystemPropertiesInvariantRule$1.evaluate(SystemPropertiesInvariantRule.java:55)
	at org.apache.lucene.util.TestRuleReportUncaughtExceptions$1.evaluate(TestRuleReportUncaughtExceptions.java:68)
	at org.apache.lucene.util.TestRuleThreadAndTestName$1.evaluate(TestRuleThreadAndTestName.java:48)
	at org.apache.lucene.util.TestRuleIgnoreAfterMaxFailures$1.evaluate(TestRuleIgnoreAfterMaxFailures.java:70)
	at org.apache.lucene.util.TestRuleMarkFailure$1.evaluate(TestRuleMarkFailure.java:48)
	at com.carrotsearch.randomizedtesting.RandomizedRunner.runSingleTest(RandomizedRunner.java:825)
	at com.carrotsearch.randomizedtesting.RandomizedRunner.access$700(RandomizedRunner.java:132)
	at com.carrotsearch.randomizedtesting.RandomizedRunner$3$1.run(RandomizedRunner.java:671)
	at com.carrotsearch.randomizedtesting.RandomizedRunner$3.evaluate(RandomizedRunner.java:697)
	at com.carrotsearch.randomizedtesting.RandomizedRunner$4.evaluate(RandomizedRunner.java:736)
	at com.carrotsearch.randomizedtesting.RandomizedRunner$5.evaluate(RandomizedRunner.java:747)
	at com.carrotsearch.randomizedtesting.rules.SystemPropertiesRestoreRule$1.evaluate(SystemPropertiesRestoreRule.java:53)
	at org.apache.lucene.util.AbstractBeforeAfterRule$1.evaluate(AbstractBeforeAfterRule.java:45)
	at org.apache.lucene.util.TestRuleReportUncaughtExceptions$1.evaluate(TestRuleReportUncaughtExceptions.java:68)
	at org.apache.lucene.util.TestRuleStoreClassName$1.evaluate(TestRuleStoreClassName.java:38)
	at org.apache.lucene.util.TestRuleIcuHack$1.evaluate(TestRuleIcuHack.java:51)
	at com.carrotsearch.randomizedtesting.rules.SystemPropertiesInvariantRule$1.evaluate(SystemPropertiesInvariantRule.java:55)
	at org.apache.lucene.util.TestRuleNoInstanceHooksOverrides$1.evaluate(TestRuleNoInstanceHooksOverrides.java:53)
	at org.apache.lucene.util.TestRuleNoStaticHooksShadowing$1.evaluate(TestRuleNoStaticHooksShadowing.java:52)
	at org.apache.lucene.util.TestRuleAssertionsRequired$1.evaluate(TestRuleAssertionsRequired.java:36)
	at org.apache.lucene.util.TestRuleMarkFailure$1.evaluate(TestRuleMarkFailure.java:48)
	at org.apache.lucene.util.TestRuleIgnoreAfterMaxFailures$1.evaluate(TestRuleIgnoreAfterMaxFailures.java:70)
	at org.apache.lucene.util.TestRuleIgnoreTestSuites$1.evaluate(TestRuleIgnoreTestSuites.java:55)
	at com.carrotsearch.randomizedtesting.RandomizedRunner.runSuite(RandomizedRunner.java:605)
	at com.carrotsearch.randomizedtesting.RandomizedRunner.access$400(RandomizedRunner.java:132)
	at com.carrotsearch.randomizedtesting.RandomizedRunner$2.run(RandomizedRunner.java:551)


FAILED:  org.apache.solr.handler.component.DistributedQueryElevationComponentTest.testDistribSearch

Error Message:
Index: 18, Size: 18

Stack Trace:
java.lang.IndexOutOfBoundsException: Index: 18, Size: 18
	at __randomizedtesting.SeedInfo.seed([78F5428526CDF64:8669DA302533BF58]:0)
	at java.util.ArrayList.rangeCheck(ArrayList.java:603)
	at java.util.ArrayList.get(ArrayList.java:381)
	at org.apache.solr.common.util.NamedList.getName(NamedList.java:127)
	at org.apache.solr.BaseDistributedSearchTestCase.compare(BaseDistributedSearchTestCase.java:466)
	at org.apache.solr.BaseDistributedSearchTestCase.compare(BaseDistributedSearchTestCase.java:612)
	at org.apache.solr.BaseDistributedSearchTestCase.compare(BaseDistributedSearchTestCase.java:500)
	at org.apache.solr.BaseDistributedSearchTestCase.compare(BaseDistributedSearchTestCase.java:612)
	at org.apache.solr.BaseDistributedSearchTestCase.compare(BaseDistributedSearchTestCase.java:500)
	at org.apache.solr.BaseDistributedSearchTestCase.compareResponses(BaseDistributedSearchTestCase.java:667)
	at org.apache.solr.BaseDistributedSearchTestCase.query(BaseDistributedSearchTestCase.java:392)
	at org.apache.solr.handler.component.DistributedQueryElevationComponentTest.doTest(DistributedQueryElevationComponentTest.java:81)
	at org.apache.solr.BaseDistributedSearchTestCase.testDistribSearch(BaseDistributedSearchTestCase.java:679)
	at sun.reflect.NativeMethodAccessorImpl.invoke0(Native Method)
	at sun.reflect.NativeMethodAccessorImpl.invoke(NativeMethodAccessorImpl.java:57)
	at sun.reflect.DelegatingMethodAccessorImpl.invoke(DelegatingMethodAccessorImpl.java:43)
	at java.lang.reflect.Method.invoke(Method.java:474)
	at com.carrotsearch.randomizedtesting.RandomizedRunner.invoke(RandomizedRunner.java:1995)
	at com.carrotsearch.randomizedtesting.RandomizedRunner.access$1100(RandomizedRunner.java:132)
	at com.carrotsearch.randomizedtesting.RandomizedRunner$6.evaluate(RandomizedRunner.java:818)
	at com.carrotsearch.randomizedtesting.RandomizedRunner$7.evaluate(RandomizedRunner.java:877)
	at com.carrotsearch.randomizedtesting.RandomizedRunner$8.evaluate(RandomizedRunner.java:891)
	at com.carrotsearch.randomizedtesting.rules.SystemPropertiesRestoreRule$1.evaluate(SystemPropertiesRestoreRule.java:53)
	at org.apache.lucene.util.TestRuleSetupTeardownChained$1.evaluate(TestRuleSetupTeardownChained.java:50)
	at org.apache.lucene.util.TestRuleFieldCacheSanity$1.evaluate(TestRuleFieldCacheSanity.java:32)
	at org.apache.lucene.util.AbstractBeforeAfterRule$1.evaluate(AbstractBeforeAfterRule.java:45)
	at com.carrotsearch.randomizedtesting.rules.SystemPropertiesInvariantRule$1.evaluate(SystemPropertiesInvariantRule.java:55)
	at org.apache.lucene.util.TestRuleReportUncaughtExceptions$1.evaluate(TestRuleReportUncaughtExceptions.java:68)
	at org.apache.lucene.util.TestRuleThreadAndTestName$1.evaluate(TestRuleThreadAndTestName.java:48)
	at org.apache.lucene.util.TestRuleIgnoreAfterMaxFailures$1.evaluate(TestRuleIgnoreAfterMaxFailures.java:70)
	at org.apache.lucene.util.TestRuleMarkFailure$1.evaluate(TestRuleMarkFailure.java:48)
	at com.carrotsearch.randomizedtesting.RandomizedRunner.runSingleTest(RandomizedRunner.java:825)
	at com.carrotsearch.randomizedtesting.RandomizedRunner.access$700(RandomizedRunner.java:132)
	at com.carrotsearch.randomizedtesting.RandomizedRunner$3$1.run(RandomizedRunner.java:671)
	at com.carrotsearch.randomizedtesting.RandomizedRunner$3.evaluate(RandomizedRunner.java:697)
	at com.carrotsearch.randomizedtesting.RandomizedRunner$4.evaluate(RandomizedRunner.java:736)
	at com.carrotsearch.randomizedtesting.RandomizedRunner$5.evaluate(RandomizedRunner.java:747)
	at com.carrotsearch.randomizedtesting.rules.SystemPropertiesRestoreRule$1.evaluate(SystemPropertiesRestoreRule.java:53)
	at org.apache.lucene.util.AbstractBeforeAfterRule$1.evaluate(AbstractBeforeAfterRule.java:45)
	at org.apache.lucene.util.TestRuleReportUncaughtExceptions$1.evaluate(TestRuleReportUncaughtExceptions.java:68)
	at org.apache.lucene.util.TestRuleStoreClassName$1.evaluate(TestRuleStoreClassName.java:38)
	at org.apache.lucene.util.TestRuleIcuHack$1.evaluate(TestRuleIcuHack.java:51)
	at com.carrotsearch.randomizedtesting.rules.SystemPropertiesInvariantRule$1.evaluate(SystemPropertiesInvariantRule.java:55)
	at org.apache.lucene.util.TestRuleNoInstanceHooksOverrides$1.evaluate(TestRuleNoInstanceHooksOverrides.java:53)
	at org.apache.lucene.util.TestRuleNoStaticHooksShadowing$1.evaluate(TestRuleNoStaticHooksShadowing.java:52)
	at org.apache.lucene.util.TestRuleAssertionsRequired$1.evaluate(TestRuleAssertionsRequired.java:36)
	at org.apache.lucene.util.TestRuleMarkFailure$1.evaluate(TestRuleMarkFailure.java:48)
	at org.apache.lucene.util.TestRuleIgnoreAfterMaxFailures$1.evaluate(TestRuleIgnoreAfterMaxFailures.java:70)
	at org.apache.lucene.util.TestRuleIgnoreTestSuites$1.evaluate(TestRuleIgnoreTestSuites.java:55)
	at com.carrotsearch.randomizedtesting.RandomizedRunner.runSuite(RandomizedRunner.java:605)
	at com.carrotsearch.randomizedtesting.RandomizedRunner.access$400(RandomizedRunner.java:132)
	at com.carrotsearch.randomizedtesting.RandomizedRunner$2.run(RandomizedRunner.java:551)




Build Log:
[...truncated 7619 lines...]
[junit4:junit4] Suite: org.apache.solr.handler.component.SpellCheckComponentTest
[junit4:junit4]    > (@BeforeClass output)
[junit4:junit4]   2> 1 T87 oas.SolrTestCaseJ4.initCore ####initCore
[junit4:junit4]   2> Creating dataDir: /mnt/ssd/jenkins/workspace/Lucene-Solr-4.x-Linux-Java8-64/checkout/solr/build/solr-core/test/J1/./solrtest-SpellCheckComponentTest-1341764125023
[junit4:junit4]   2> 1 T87 oasc.SolrResourceLoader.<init> new SolrResourceLoader for directory: '/mnt/ssd/jenkins/workspace/Lucene-Solr-4.x-Linux-Java8-64/checkout/solr/build/solr-core/test-files/solr/collection1/'
[junit4:junit4]   2> 2 T87 oasc.SolrResourceLoader.replaceClassLoader Adding 'file:/mnt/ssd/jenkins/workspace/Lucene-Solr-4.x-Linux-Java8-64/checkout/solr/build/solr-core/test-files/solr/collection1/lib/README' to classloader
[junit4:junit4]   2> 2 T87 oasc.SolrResourceLoader.replaceClassLoader Adding 'file:/mnt/ssd/jenkins/workspace/Lucene-Solr-4.x-Linux-Java8-64/checkout/solr/build/solr-core/test-files/solr/collection1/lib/classes/' to classloader
[junit4:junit4]   2> 24 T87 oasc.SolrConfig.<init> Using Lucene MatchVersion: LUCENE_40
[junit4:junit4]   2> 77 T87 oasc.SolrConfig.<init> Loaded SolrConfig: solrconfig-spellcheckcomponent.xml
[junit4:junit4]   2> 77 T87 oass.IndexSchema.readSchema Reading Solr Schema
[junit4:junit4]   2> 83 T87 oass.IndexSchema.readSchema Schema name=test
[junit4:junit4]   2> 438 T87 oass.OpenExchangeRatesOrgProvider.init Initialized with rates=open-exchange-rates.json, refreshInterval=1440.
[junit4:junit4]   2> 446 T87 oass.IndexSchema.readSchema default search field in schema is text
[junit4:junit4]   2> 448 T87 oass.IndexSchema.readSchema unique key field: id
[junit4:junit4]   2> 477 T87 oass.FileExchangeRateProvider.reload Reloading exchange rates from file currency.xml
[junit4:junit4]   2> 480 T87 oass.FileExchangeRateProvider.reload Reloading exchange rates from file currency.xml
[junit4:junit4]   2> 482 T87 oass.OpenExchangeRatesOrgProvider.reload Reloading exchange rates from open-exchange-rates.json
[junit4:junit4]   2> 483 T87 oass.OpenExchangeRatesOrgProvider.reload Reloading exchange rates from open-exchange-rates.json
[junit4:junit4]   2> 483 T87 oasc.SolrResourceLoader.locateSolrHome JNDI not configured for solr (NoInitialContextEx)
[junit4:junit4]   2> 483 T87 oasc.SolrResourceLoader.locateSolrHome using system property solr.solr.home: /mnt/ssd/jenkins/workspace/Lucene-Solr-4.x-Linux-Java8-64/checkout/solr/build/solr-core/test-files/solr
[junit4:junit4]   2> 484 T87 oasc.SolrResourceLoader.<init> new SolrResourceLoader for directory: '/mnt/ssd/jenkins/workspace/Lucene-Solr-4.x-Linux-Java8-64/checkout/solr/build/solr-core/test-files/solr/'
[junit4:junit4]   2> 484 T87 oasc.CoreContainer.<init> New CoreContainer 53714184
[junit4:junit4]   2> 484 T87 oasc.SolrCore.<init> [collection1] Opening new SolrCore at /mnt/ssd/jenkins/workspace/Lucene-Solr-4.x-Linux-Java8-64/checkout/solr/build/solr-core/test-files/solr/collection1/, dataDir=/mnt/ssd/jenkins/workspace/Lucene-Solr-4.x-Linux-Java8-64/checkout/solr/build/solr-core/test/J1/./solrtest-SpellCheckComponentTest-1341764125023/
[junit4:junit4]   2> 484 T87 oasc.SolrCore.<init> JMX monitoring not detected for core: collection1
[junit4:junit4]   2> 485 T87 oasc.SolrCore.getNewIndexDir WARNING New index directory detected: old=null new=/mnt/ssd/jenkins/workspace/Lucene-Solr-4.x-Linux-Java8-64/checkout/solr/build/solr-core/test/J1/./solrtest-SpellCheckComponentTest-1341764125023/index/
[junit4:junit4]   2> 485 T87 oasc.SolrCore.initIndex WARNING [collection1] Solr index directory '/mnt/ssd/jenkins/workspace/Lucene-Solr-4.x-Linux-Java8-64/checkout/solr/build/solr-core/test/J1/./solrtest-SpellCheckComponentTest-1341764125023/index' doesn't exist. Creating new index...
[junit4:junit4]   2> 488 T87 oasc.SolrDeletionPolicy.onCommit SolrDeletionPolicy.onCommit: commits:num=1
[junit4:junit4]   2> 		commit{dir=MockDirWrapper(org.apache.lucene.store.RAMDirectory@2eef47e lockFactory=org.apache.lucene.store.NativeFSLockFactory@280f7e08),segFN=segments_1,generation=1,filenames=[segments_1]
[junit4:junit4]   2> 488 T87 oasc.SolrDeletionPolicy.updateCommits newest commit = 1
[junit4:junit4]   2> 489 T87 oasc.RequestHandlers.initHandlersFromConfig created standard: solr.StandardRequestHandler
[junit4:junit4]   2> 489 T87 oasc.RequestHandlers.initHandlersFromConfig created spellCheckCompRH: org.apache.solr.handler.component.SearchHandler
[junit4:junit4]   2> 490 T87 oasc.RequestHandlers.initHandlersFromConfig created spellCheckCompRH1: org.apache.solr.handler.component.SearchHandler
[junit4:junit4]   2> 490 T87 oasc.RequestHandlers.initHandlersFromConfig created spellCheckWithWordbreak: org.apache.solr.handler.component.SearchHandler
[junit4:junit4]   2> 505 T87 oass.SolrIndexSearcher.<init> Opening Searcher@3489632b main
[junit4:junit4]   2> 505 T87 oass.SolrIndexSearcher.getIndexDir WARNING WARNING: Directory impl does not support setting indexDir: org.apache.lucene.store.MockDirectoryWrapper
[junit4:junit4]   2> 505 T87 oasu.CommitTracker.<init> Hard AutoCommit: disabled
[junit4:junit4]   2> 505 T87 oasu.CommitTracker.<init> Soft AutoCommit: disabled
[junit4:junit4]   2> 505 T87 oashc.SpellCheckComponent.inform Initializing spell checkers
[junit4:junit4]   2> 509 T87 oashc.SpellCheckComponent.inform Registering newSearcher listener for spellchecker: default
[junit4:junit4]   2> 512 T87 oashc.SpellCheckComponent.inform Registering newSearcher listener for spellchecker: default_teststop
[junit4:junit4]   2> 516 T87 oass.DirectSolrSpellChecker.init init: {name=direct,classname=solr.DirectSolrSpellChecker,minQueryLength=3,maxQueryFrequency=100.0,field=teststop}
[junit4:junit4]   2> 516 T87 oass.DirectSolrSpellChecker.init init: {name=direct_lowerfilt,classname=solr.DirectSolrSpellChecker,minQueryLength=3,maxQueryFrequency=100.0,field=lowerfilt}
[junit4:junit4]   2> 523 T87 oashc.SpellCheckComponent.inform Registering newSearcher listener for spellchecker: threshold
[junit4:junit4]   2> 523 T87 oass.DirectSolrSpellChecker.init init: {name=threshold_direct,classname=solr.DirectSolrSpellChecker,field=lowerfilt,spellcheckIndexDir=spellcheckerThreshold,buildOnCommit=true,thresholdTokenFrequency=0.29}
[junit4:junit4]   2> 523 T87 oashc.SpellCheckComponent.inform Registering newSearcher listener for spellchecker: threshold_direct
[junit4:junit4]   2> 528 T87 oashc.SpellCheckComponent.inform Registering newSearcher listener for spellchecker: multipleFields
[junit4:junit4]   2> 536 T87 oashc.SpellCheckComponent.inform Registering newSearcher listener for spellchecker: freq
[junit4:junit4]   2> 539 T87 oashc.SpellCheckComponent.inform Registering newSearcher listener for spellchecker: fqcn
[junit4:junit4]   2> 540 T87 oashc.HttpShardHandlerFactory.getParameter Setting socketTimeout to: 0
[junit4:junit4]   2> 540 T87 oashc.HttpShardHandlerFactory.getParameter Setting urlScheme to: http://
[junit4:junit4]   2> 540 T87 oashc.HttpShardHandlerFactory.getParameter Setting connTimeout to: 0
[junit4:junit4]   2> 540 T87 oashc.HttpShardHandlerFactory.getParameter Setting maxConnectionsPerHost to: 20
[junit4:junit4]   2> 540 T87 oashc.HttpShardHandlerFactory.getParameter Setting corePoolSize to: 0
[junit4:junit4]   2> 540 T87 oashc.HttpShardHandlerFactory.getParameter Setting maximumPoolSize to: 2147483647
[junit4:junit4]   2> 541 T87 oashc.HttpShardHandlerFactory.getParameter Setting maxThreadIdleTime to: 5
[junit4:junit4]   2> 541 T87 oashc.HttpShardHandlerFactory.getParameter Setting sizeOfQueue to: -1
[junit4:junit4]   2> 541 T87 oashc.HttpShardHandlerFactory.getParameter Setting fairnessPolicy to: false
[junit4:junit4]   2> 541 T87 oascsi.HttpClientUtil.createClient Creating new http client, config:maxConnectionsPerHost=20&maxConnections=10000&socketTimeout=0&connTimeout=0&retry=false
[junit4:junit4]   2> 543 T88 oasc.SolrCore.registerSearcher [collection1] Registered new searcher Searcher@3489632b main{StandardDirectoryReader(segments_1:1)}
[junit4:junit4]   2> 543 T87 oasc.CoreContainer.register registering core: collection1
[junit4:junit4]   2> 544 T87 oas.SolrTestCaseJ4.initCore ####initCore end
[junit4:junit4]   2> 
[junit4:junit4] ERROR   0.55s J1 | SpellCheckComponentTest.testPerDictionary
[junit4:junit4]    > Throwable #1: java.lang.RuntimeException: mismatch: '0'!='2' @ spellcheck/suggestions/bar/startOffset
[junit4:junit4]    > 	at __randomizedtesting.SeedInfo.seed([78F5428526CDF64:C081A0805A00CA2C]:0)
[junit4:junit4]    > 	at org.apache.solr.SolrTestCaseJ4.assertJQ(SolrTestCaseJ4.java:573)
[junit4:junit4]    > 	at org.apache.solr.SolrTestCaseJ4.assertJQ(SolrTestCaseJ4.java:521)
[junit4:junit4]    > 	at org.apache.solr.handler.component.SpellCheckComponentTest.testPerDictionary(SpellCheckComponentTest.java:102)
[junit4:junit4]    > 	at sun.reflect.NativeMethodAccessorImpl.invoke0(Native Method)
[junit4:junit4]    > 	at sun.reflect.NativeMethodAccessorImpl.invoke(NativeMethodAccessorImpl.java:57)
[junit4:junit4]    > 	at sun.reflect.DelegatingMethodAccessorImpl.invoke(DelegatingMethodAccessorImpl.java:43)
[junit4:junit4]    > 	at java.lang.reflect.Method.invoke(Method.java:474)
[junit4:junit4]    > 	at com.carrotsearch.randomizedtesting.RandomizedRunner.invoke(RandomizedRunner.java:1995)
[junit4:junit4]    > 	at com.carrotsearch.randomizedtesting.RandomizedRunner.access$1100(RandomizedRunner.java:132)
[junit4:junit4]    > 	at com.carrotsearch.randomizedtesting.RandomizedRunner$6.evaluate(RandomizedRunner.java:818)
[junit4:junit4]    > 	at com.carrotsearch.randomizedtesting.RandomizedRunner$7.evaluate(RandomizedRunner.java:877)
[junit4:junit4]    > 	at com.carrotsearch.randomizedtesting.RandomizedRunner$8.evaluate(RandomizedRunner.java:891)
[junit4:junit4]    > 	at com.carrotsearch.randomizedtesting.rules.SystemPropertiesRestoreRule$1.evaluate(SystemPropertiesRestoreRule.java:53)
[junit4:junit4]    > 	at org.apache.lucene.util.TestRuleSetupTeardownChained$1.evaluate(TestRuleSetupTeardownChained.java:50)
[junit4:junit4]    > 	at org.apache.lucene.util.TestRuleFieldCacheSanity$1.evaluate(TestRuleFieldCacheSanity.java:32)
[junit4:junit4]    > 	at org.apache.lucene.util.AbstractBeforeAfterRule$1.evaluate(AbstractBeforeAfterRule.java:45)
[junit4:junit4]    > 	at com.carrotsearch.randomizedtesting.rules.SystemPropertiesInvariantRule$1.evaluate(SystemPropertiesInvariantRule.java:55)
[junit4:junit4]    > 	at org.apache.lucene.util.TestRuleReportUncaughtExceptions$1.evaluate(TestRuleReportUncaughtExceptions.java:68)
[junit4:junit4]    > 	at org.apache.lucene.util.TestRuleThreadAndTestName$1.evaluate(TestRuleThreadAndTestName.java:48)
[junit4:junit4]    > 	at org.apache.lucene.util.TestRuleIgnoreAfterMaxFailures$1.evaluate(TestRuleIgnoreAfterMaxFailures.java:70)
[junit4:junit4]    > 	at org.apache.lucene.util.TestRuleMarkFailure$1.evaluate(TestRuleMarkFailure.java:48)
[junit4:junit4]    > 	at com.carrotsearch.randomizedtesting.RandomizedRunner.runSingleTest(RandomizedRunner.java:825)
[junit4:junit4]    > 	at com.carrotsearch.randomizedtesting.RandomizedRunner.access$700(RandomizedRunner.java:132)
[junit4:junit4]    > 	at com.carrotsearch.randomizedtesting.RandomizedRunner$3$1.run(RandomizedRunner.java:671)
[junit4:junit4]    > 	at com.carrotsearch.randomizedtesting.RandomizedRunner$3.evaluate(RandomizedRunner.java:697)
[junit4:junit4]    > 	at com.carrotsearch.randomizedtesting.RandomizedRunner$4.evaluate(RandomizedRunner.java:736)
[junit4:junit4]    > 	at com.carrotsearch.randomizedtesting.RandomizedRunner$5.evaluate(RandomizedRunner.java:747)
[junit4:junit4]    > 	at com.carrotsearch.randomizedtesting.rules.SystemPropertiesRestoreRule$1.evaluate(SystemPropertiesRestoreRule.java:53)
[junit4:junit4]    > 	at org.apache.lucene.util.AbstractBeforeAfterRule$1.evaluate(AbstractBeforeAfterRule.java:45)
[junit4:junit4]    > 	at org.apache.lucene.util.TestRuleReportUncaughtExceptions$1.evaluate(TestRuleReportUncaughtExceptions.java:68)
[junit4:junit4]    > 	at org.apache.lucene.util.TestRuleStoreClassName$1.evaluate(TestRuleStoreClassName.java:38)
[junit4:junit4]    > 	at org.apache.lucene.util.TestRuleIcuHack$1.evaluate(TestRuleIcuHack.java:51)
[junit4:junit4]    > 	at com.carrotsearch.randomizedtesting.rules.SystemPropertiesInvariantRule$1.evaluate(SystemPropertiesInvariantRule.java:55)
[junit4:junit4]    > 	at org.apache.lucene.util.TestRuleNoInstanceHooksOverrides$1.evaluate(TestRuleNoInstanceHooksOverrides.java:53)
[junit4:junit4]    > 	at org.apache.lucene.util.TestRuleNoStaticHooksShadowing$1.evaluate(TestRuleNoStaticHooksShadowing.java:52)
[junit4:junit4]    > 	at org.apache.lucene.util.TestRuleAssertionsRequired$1.evaluate(TestRuleAssertionsRequired.java:36)
[junit4:junit4]    > 	at org.apache.lucene.util.TestRuleMarkFailure$1.evaluate(TestRuleMarkFailure.java:48)
[junit4:junit4]    > 	at org.apache.lucene.util.TestRuleIgnoreAfterMaxFailures$1.evaluate(TestRuleIgnoreAfterMaxFailures.java:70)
[junit4:junit4]    > 	at org.apache.lucene.util.TestRuleIgnoreTestSuites$1.evaluate(TestRuleIgnoreTestSuites.java:55)
[junit4:junit4]    > 	at com.carrotsearch.randomizedtesting.RandomizedRunner.runSuite(RandomizedRunner.java:605)
[junit4:junit4]    > 	at com.carrotsearch.randomizedtesting.RandomizedRunner.access$400(RandomizedRunner.java:132)
[junit4:junit4]    > 	at com.carrotsearch.randomizedtesting.RandomizedRunner$2.run(RandomizedRunner.java:551)
[junit4:junit4]    > 
[junit4:junit4]   2> 4909 T87 oas.SolrTestCaseJ4.setUp ###Starting testPerDictionary
[junit4:junit4]   2> 4913 T87 C6 UPDATE [collection1] webapp=null path=null params={} {add=[0]} 0 1
[junit4:junit4]   2> 4918 T87 C6 UPDATE [collection1] webapp=null path=null params={} {add=[1]} 0 1
[junit4:junit4]   2> 4923 T87 C6 UPDATE [collection1] webapp=null path=null params={} {add=[2]} 0 1
[junit4:junit4]   2> 4928 T87 C6 UPDATE [collection1] webapp=null path=null params={} {add=[3]} 0 1
[junit4:junit4]   2> 4933 T87 C6 UPDATE [collection1] webapp=null path=null params={} {add=[4]} 0 1
[junit4:junit4]   2> 4937 T87 C6 UPDATE [collection1] webapp=null path=null params={} {add=[5]} 0 0
[junit4:junit4]   2> 4942 T87 C6 UPDATE [collection1] webapp=null path=null params={} {add=[6]} 0 0
[junit4:junit4]   2> 4947 T87 C6 UPDATE [collection1] webapp=null path=null params={} {add=[7]} 0 1
[junit4:junit4]   2> 4951 T87 C6 UPDATE [collection1] webapp=null path=null params={} {add=[8]} 0 0
[junit4:junit4]   2> 4956 T87 C6 UPDATE [collection1] webapp=null path=null params={} {add=[9]} 0 0
[junit4:junit4]   2> 4960 T87 C6 oasu.DirectUpdateHandler2.commit start commit{flags=0,version=0,optimize=false,openSearcher=true,waitSearcher=true,expungeDeletes=false,softCommit=false}
[junit4:junit4]   2> 4963 T87 C6 oasc.SolrDeletionPolicy.onCommit SolrDeletionPolicy.onCommit: commits:num=2
[junit4:junit4]   2> 		commit{dir=MockDirWrapper(org.apache.lucene.store.RAMDirectory@2eef47e lockFactory=org.apache.lucene.store.NativeFSLockFactory@280f7e08),segFN=segments_f,generation=15,filenames=[segments_f]
[junit4:junit4]   2> 		commit{dir=MockDirWrapper(org.apache.lucene.store.RAMDirectory@2eef47e lockFactory=org.apache.lucene.store.NativeFSLockFactory@280f7e08),segFN=segments_g,generation=16,filenames=[_8.fnm, segments_g, _8.si, _8_Lucene40_0.prx, _8.fdx, _8_nrm.cfe, _8_Lucene40_0.tip, _8_nrm.cfs, _8.fdt, _8_Lucene40_0.frq, _8_Lucene40_0.tim]
[junit4:junit4]   2> 4964 T87 C6 oasc.SolrDeletionPolicy.updateCommits newest commit = 16
[junit4:junit4]   2> 4965 T87 C6 oass.SolrIndexSearcher.<init> Opening Searcher@4045bda7 main
[junit4:junit4]   2> 4965 T87 C6 oass.SolrIndexSearcher.getIndexDir WARNING WARNING: Directory impl does not support setting indexDir: org.apache.lucene.store.MockDirectoryWrapper
[junit4:junit4]   2> 4966 T88 oashc.SpellCheckComponent$SpellCheckerListener.buildSpellIndex Building spell index for spell checker: default
[junit4:junit4]   2> 4967 T87 C6 oasu.DirectUpdateHandler2.commit end_commit_flush
[junit4:junit4]   2> 4997 T88 oashc.SpellCheckComponent$SpellCheckerListener.buildSpellIndex Building spell index for spell checker: default_teststop
[junit4:junit4]   2> 5018 T88 oashc.SpellCheckComponent$SpellCheckerListener.buildSpellIndex Building spell index for spell checker: threshold
[junit4:junit4]   2> 5087 T88 oashc.SpellCheckComponent$SpellCheckerListener.buildSpellIndex Building spell index for spell checker: threshold_direct
[junit4:junit4]   2> 5087 T88 oashc.SpellCheckComponent$SpellCheckerListener.buildSpellIndex Building spell index for spell checker: multipleFields
[junit4:junit4]   2> 5127 T88 oashc.SpellCheckComponent$SpellCheckerListener.buildSpellIndex Building spell index for spell checker: freq
[junit4:junit4]   2> 5167 T88 oashc.SpellCheckComponent$SpellCheckerListener.buildSpellIndex Building spell index for spell checker: fqcn
[junit4:junit4]   2> 5207 T88 oasc.SolrCore.registerSearcher [collection1] Registered new searcher Searcher@4045bda7 main{StandardDirectoryReader(segments_g:26 _8(4.0):C10)}
[junit4:junit4]   2> 5207 T87 C6 UPDATE [collection1] webapp=null path=null params={} {commit=} 0 247
[junit4:junit4]   2> 5209 T87 C6 REQ [collection1] webapp=null path=null params={q=documemt&qt=spellCheckCompRH&spellcheck.build=true&spellcheck..perDict.foo=bar&spellcheck.dictionary=perDict&json.nl=map&spellcheck..perDict.bar=foo&spellcheck=true} hits=0 status=0 QTime=0 
[junit4:junit4]   2> 5210 T87 oas.SolrTestCaseJ4.assertJQ SEVERE query failed JSON validation. error=mismatch: '0'!='2' @ spellcheck/suggestions/bar/startOffset
[junit4:junit4]   2> 	 expected =/spellcheck/suggestions/bar=={"numFound":1, "startOffset":0, "endOffset":1, "suggestion":["foo"]}
[junit4:junit4]   2> 	 response = {
[junit4:junit4]   2> 	  "responseHeader":{
[junit4:junit4]   2> 	    "status":0,
[junit4:junit4]   2> 	    "QTime":0},
[junit4:junit4]   2> 	  "command":"build",
[junit4:junit4]   2> 	  "response":{"numFound":0,"start":0,"docs":[]
[junit4:junit4]   2> 	  },
[junit4:junit4]   2> 	  "spellcheck":{
[junit4:junit4]   2> 	    "suggestions":{
[junit4:junit4]   2> 	      "foo":{
[junit4:junit4]   2> 	        "numFound":1,
[junit4:junit4]   2> 	        "startOffset":0,
[junit4:junit4]   2> 	        "endOffset":1,
[junit4:junit4]   2> 	        "suggestion":["bar"]},
[junit4:junit4]   2> 	      "bar":{
[junit4:junit4]   2> 	        "numFound":1,
[junit4:junit4]   2> 	        "startOffset":2,
[junit4:junit4]   2> 	        "endOffset":3,
[junit4:junit4]   2> 	        "suggestion":["foo"]}}}}
[junit4:junit4]   2> 	
[junit4:junit4]   2> 	 request = q=documemt&qt=spellCheckCompRH&spellcheck.build=true&spellcheck..perDict.foo=bar&spellcheck.dictionary=perDict&json.nl=map&spellcheck..perDict.bar=foo&spellcheck=true
[junit4:junit4]   2> 5211 T87 oas.SolrTestCaseJ4.tearDown ###Ending testPerDictionary
[junit4:junit4]   2> 5214 T87 C6 oasu.DirectUpdateHandler2.deleteAll [collection1] REMOVING ALL DOCUMENTS FROM INDEX
[junit4:junit4]   2> 5214 T87 C6 UPDATE [collection1] webapp=null path=null params={} {deleteByQuery=*:*} 0 0
[junit4:junit4]   2> 5218 T87 C6 oasu.DirectUpdateHandler2.commit start commit{flags=0,version=0,optimize=false,openSearcher=true,waitSearcher=true,expungeDeletes=false,softCommit=false}
[junit4:junit4]   2> 5219 T87 C6 oasc.SolrDeletionPolicy.onCommit SolrDeletionPolicy.onCommit: commits:num=2
[junit4:junit4]   2> 		commit{dir=MockDirWrapper(org.apache.lucene.store.RAMDirectory@2eef47e lockFactory=org.apache.lucene.store.NativeFSLockFactory@280f7e08),segFN=segments_g,generation=16,filenames=[_8.fnm, segments_g, _8.si, _8_Lucene40_0.prx, _8.fdx, _8_nrm.cfe, _8_Lucene40_0.tip, _8_nrm.cfs, _8.fdt, _8_Lucene40_0.frq, _8_Lucene40_0.tim]
[junit4:junit4]   2> 		commit{dir=MockDirWrapper(org.apache.lucene.store.RAMDirectory@2eef47e lockFactory=org.apache.lucene.store.NativeFSLockFactory@280f7e08),segFN=segments_h,generation=17,filenames=[segments_h]
[junit4:junit4]   2> 5219 T87 C6 oasc.SolrDeletionPolicy.updateCommits newest commit = 17
[junit4:junit4]   2> 5220 T87 C6 oass.SolrIndexSearcher.<init> Opening Searcher@6f7f0411 main
[junit4:junit4]   2> 5220 T87 C6 oass.SolrIndexSearcher.getIndexDir WARNING WARNING: Directory impl does not support setting indexDir: org.apache.lucene.store.MockDirectoryWrapper
[junit4:junit4]   2> 5221 T88 oashc.SpellCheckComponent$SpellCheckerListener.buildSpellIndex Building spell index for spell checker: default
[junit4:junit4]   2> 5221 T87 C6 oasu.DirectUpdateHandler2.commit end_commit_flush
[junit4:junit4]   2> 5238 T88 oashc.SpellCheckComponent$SpellCheckerListener.buildSpellIndex Building spell index for spell checker: default_teststop
[junit4:junit4]   2> 5260 T88 oashc.SpellCheckComponent$SpellCheckerListener.buildSpellIndex Building spell index for spell checker: threshold
[junit4:junit4]   2> 5278 T88 oashc.SpellCheckComponent$SpellCheckerListener.buildSpellIndex Building spell index for spell checker: threshold_direct
[junit4:junit4]   2> 5278 T88 oashc.SpellCheckComponent$SpellCheckerListener.buildSpellIndex Building spell index for spell checker: multipleFields
[junit4:junit4]   2> 5328 T88 oashc.SpellCheckComponent$SpellCheckerListener.buildSpellIndex Building spell index for spell checker: freq
[junit4:junit4]   2> 5358 T88 oashc.SpellCheckComponent$SpellCheckerListener.buildSpellIndex Building spell index for spell checker: fqcn
[junit4:junit4]   2> 5428 T88 oasc.SolrCore.registerSearcher [collection1] Registered new searcher Searcher@6f7f0411 main{StandardDirectoryReader(segments_h:27)}
[junit4:junit4]   2> 5428 T87 C6 UPDATE [collection1] webapp=null path=null params={} {commit=} 0 210
[junit4:junit4]   2> NOTE: reproduce with: ant test  -Dtestcase=SpellCheckComponentTest -Dtests.method=testPerDictionary -Dtests.seed=78F5428526CDF64 -Dtests.multiplier=3 -Dtests.slow=true -Dtests.locale=sq_AL -Dtests.timezone=Pacific/Johnston -Dtests.file.encoding=UTF-8
[junit4:junit4]   2>
[junit4:junit4]    > (@AfterClass output)
[junit4:junit4]   2> 6516 T87 oas.SolrTestCaseJ4.deleteCore ###deleteCore
[junit4:junit4]   2> 6516 T87 oasc.CoreContainer.shutdown Shutting down CoreContainer instance=53714184
[junit4:junit4]   2> 6516 T87 oasc.SolrCore.close [collection1]  CLOSING SolrCore org.apache.solr.core.SolrCore@47788a76
[junit4:junit4]   2> 6517 T87 oasc.SolrCore.closeSearcher [collection1] Closing main searcher on request.
[junit4:junit4]   2> 6517 T87 oasu.DirectUpdateHandler2.close closing DirectUpdateHandler2{commits=20,autocommits=0,soft autocommits=0,optimizes=0,rollbacks=0,expungeDeletes=0,docsPending=0,adds=0,deletesById=0,deletesByQuery=0,errors=0,cumulative_adds=92,cumulative_deletesById=0,cumulative_deletesByQuery=9,cumulative_errors=0}
[junit4:junit4]   2> NOTE: test params are: codec=Lucene3x, sim=RandomSimilarityProvider(queryNorm=true,coord=true): {}, locale=sq_AL, timezone=Pacific/Johnston
[junit4:junit4]   2> NOTE: Linux 3.2.0-26-generic amd64/Oracle Corporation 1.8.0-ea (64-bit)/cpus=8,threads=1,free=215744888,total=247988224
[junit4:junit4]   2> NOTE: All tests run in this JVM: [StandardRequestHandlerTest, TestValueSourceCache, TestCJKBigramFilterFactory, UpdateParamsTest, TestLMDirichletSimilarityFactory, TestDefaultSimilarityFactory, TestStressRecovery, TestGermanMinimalStemFilterFactory, CloudStateTest, NotRequiredUniqueKeyTest, TestIBSimilarityFactory, TestLMJelinekMercerSimilarityFactory, UUIDFieldTest, TestMultiCoreConfBootstrap, TestHungarianLightStemFilterFactory, RAMDirectoryFactoryTest, SampleTest, NoCacheHeaderTest, DocumentAnalysisRequestHandlerTest, TestSolrDeletionPolicy1, DistanceFunctionTest, SpellCheckComponentTest]
[junit4:junit4]   2> 
[junit4:junit4] Completed on J1 in 6.58s, 9 tests, 1 error <<< FAILURES!

[...truncated 477 lines...]
[junit4:junit4] Suite: org.apache.solr.handler.component.DistributedQueryElevationComponentTest
[junit4:junit4] ERROR   1.49s J0 | DistributedQueryElevationComponentTest.testDistribSearch
[junit4:junit4]    > Throwable #1: java.lang.IndexOutOfBoundsException: Index: 18, Size: 18
[junit4:junit4]    > 	at __randomizedtesting.SeedInfo.seed([78F5428526CDF64:8669DA302533BF58]:0)
[junit4:junit4]    > 	at java.util.ArrayList.rangeCheck(ArrayList.java:603)
[junit4:junit4]    > 	at java.util.ArrayList.get(ArrayList.java:381)
[junit4:junit4]    > 	at org.apache.solr.common.util.NamedList.getName(NamedList.java:127)
[junit4:junit4]    > 	at org.apache.solr.BaseDistributedSearchTestCase.compare(BaseDistributedSearchTestCase.java:466)
[junit4:junit4]    > 	at org.apache.solr.BaseDistributedSearchTestCase.compare(BaseDistributedSearchTestCase.java:612)
[junit4:junit4]    > 	at org.apache.solr.BaseDistributedSearchTestCase.compare(BaseDistributedSearchTestCase.java:500)
[junit4:junit4]    > 	at org.apache.solr.BaseDistributedSearchTestCase.compare(BaseDistributedSearchTestCase.java:612)
[junit4:junit4]    > 	at org.apache.solr.BaseDistributedSearchTestCase.compare(BaseDistributedSearchTestCase.java:500)
[junit4:junit4]    > 	at org.apache.solr.BaseDistributedSearchTestCase.compareResponses(BaseDistributedSearchTestCase.java:667)
[junit4:junit4]    > 	at org.apache.solr.BaseDistributedSearchTestCase.query(BaseDistributedSearchTestCase.java:392)
[junit4:junit4]    > 	at org.apache.solr.handler.component.DistributedQueryElevationComponentTest.doTest(DistributedQueryElevationComponentTest.java:81)
[junit4:junit4]    > 	at org.apache.solr.BaseDistributedSearchTestCase.testDistribSearch(BaseDistributedSearchTestCase.java:679)
[junit4:junit4]    > 	at sun.reflect.NativeMethodAccessorImpl.invoke0(Native Method)
[junit4:junit4]    > 	at sun.reflect.NativeMethodAccessorImpl.invoke(NativeMethodAccessorImpl.java:57)
[junit4:junit4]    > 	at sun.reflect.DelegatingMethodAccessorImpl.invoke(DelegatingMethodAccessorImpl.java:43)
[junit4:junit4]    > 	at java.lang.reflect.Method.invoke(Method.java:474)
[junit4:junit4]    > 	at com.carrotsearch.randomizedtesting.RandomizedRunner.invoke(RandomizedRunner.java:1995)
[junit4:junit4]    > 	at com.carrotsearch.randomizedtesting.RandomizedRunner.access$1100(RandomizedRunner.java:132)
[junit4:junit4]    > 	at com.carrotsearch.randomizedtesting.RandomizedRunner$6.evaluate(RandomizedRunner.java:818)
[junit4:junit4]    > 	at com.carrotsearch.randomizedtesting.RandomizedRunner$7.evaluate(RandomizedRunner.java:877)
[junit4:junit4]    > 	at com.carrotsearch.randomizedtesting.RandomizedRunner$8.evaluate(RandomizedRunner.java:891)
[junit4:junit4]    > 	at com.carrotsearch.randomizedtesting.rules.SystemPropertiesRestoreRule$1.evaluate(SystemPropertiesRestoreRule.java:53)
[junit4:junit4]    > 	at org.apache.lucene.util.TestRuleSetupTeardownChained$1.evaluate(TestRuleSetupTeardownChained.java:50)
[junit4:junit4]    > 	at org.apache.lucene.util.TestRuleFieldCacheSanity$1.evaluate(TestRuleFieldCacheSanity.java:32)
[junit4:junit4]    > 	at org.apache.lucene.util.AbstractBeforeAfterRule$1.evaluate(AbstractBeforeAfterRule.java:45)
[junit4:junit4]    > 	at com.carrotsearch.randomizedtesting.rules.SystemPropertiesInvariantRule$1.evaluate(SystemPropertiesInvariantRule.java:55)
[junit4:junit4]    > 	at org.apache.lucene.util.TestRuleReportUncaughtExceptions$1.evaluate(TestRuleReportUncaughtExceptions.java:68)
[junit4:junit4]    > 	at org.apache.lucene.util.TestRuleThreadAndTestName$1.evaluate(TestRuleThreadAndTestName.java:48)
[junit4:junit4]    > 	at org.apache.lucene.util.TestRuleIgnoreAfterMaxFailures$1.evaluate(TestRuleIgnoreAfterMaxFailures.java:70)
[junit4:junit4]    > 	at org.apache.lucene.util.TestRuleMarkFailure$1.evaluate(TestRuleMarkFailure.java:48)
[junit4:junit4]    > 	at com.carrotsearch.randomizedtesting.RandomizedRunner.runSingleTest(RandomizedRunner.java:825)
[junit4:junit4]    > 	at com.carrotsearch.randomizedtesting.RandomizedRunner.access$700(RandomizedRunner.java:132)
[junit4:junit4]    > 	at com.carrotsearch.randomizedtesting.RandomizedRunner$3$1.run(RandomizedRunner.java:671)
[junit4:junit4]    > 	at com.carrotsearch.randomizedtesting.RandomizedRunner$3.evaluate(RandomizedRunner.java:697)
[junit4:junit4]    > 	at com.carrotsearch.randomizedtesting.RandomizedRunner$4.evaluate(RandomizedRunner.java:736)
[junit4:junit4]    > 	at com.carrotsearch.randomizedtesting.RandomizedRunner$5.evaluate(RandomizedRunner.java:747)
[junit4:junit4]    > 	at com.carrotsearch.randomizedtesting.rules.SystemPropertiesRestoreRule$1.evaluate(SystemPropertiesRestoreRule.java:53)
[junit4:junit4]    > 	at org.apache.lucene.util.AbstractBeforeAfterRule$1.evaluate(AbstractBeforeAfterRule.java:45)
[junit4:junit4]    > 	at org.apache.lucene.util.TestRuleReportUncaughtExceptions$1.evaluate(TestRuleReportUncaughtExceptions.java:68)
[junit4:junit4]    > 	at org.apache.lucene.util.TestRuleStoreClassName$1.evaluate(TestRuleStoreClassName.java:38)
[junit4:junit4]    > 	at org.apache.lucene.util.TestRuleIcuHack$1.evaluate(TestRuleIcuHack.java:51)
[junit4:junit4]    > 	at com.carrotsearch.randomizedtesting.rules.SystemPropertiesInvariantRule$1.evaluate(SystemPropertiesInvariantRule.java:55)
[junit4:junit4]    > 	at org.apache.lucene.util.TestRuleNoInstanceHooksOverrides$1.evaluate(TestRuleNoInstanceHooksOverrides.java:53)
[junit4:junit4]    > 	at org.apache.lucene.util.TestRuleNoStaticHooksShadowing$1.evaluate(TestRuleNoStaticHooksShadowing.java:52)
[junit4:junit4]    > 	at org.apache.lucene.util.TestRuleAssertionsRequired$1.evaluate(TestRuleAssertionsRequired.java:36)
[junit4:junit4]    > 	at org.apache.lucene.util.TestRuleMarkFailure$1.evaluate(TestRuleMarkFailure.java:48)
[junit4:junit4]    > 	at org.apache.lucene.util.TestRuleIgnoreAfterMaxFailures$1.evaluate(TestRuleIgnoreAfterMaxFailures.java:70)
[junit4:junit4]    > 	at org.apache.lucene.util.TestRuleIgnoreTestSuites$1.evaluate(TestRuleIgnoreTestSuites.java:55)
[junit4:junit4]    > 	at com.carrotsearch.randomizedtesting.RandomizedRunner.runSuite(RandomizedRunner.java:605)
[junit4:junit4]    > 	at com.carrotsearch.randomizedtesting.RandomizedRunner.access$400(RandomizedRunner.java:132)
[junit4:junit4]    > 	at com.carrotsearch.randomizedtesting.RandomizedRunner$2.run(RandomizedRunner.java:551)
[junit4:junit4]    > 
[junit4:junit4]   2> 2 T1224 oas.SolrTestCaseJ4.setUp ###Starting testDistribSearch
[junit4:junit4]   2> 3 T1224 oejs.Server.doStart jetty-8.1.2.v20120308
[junit4:junit4]   2> 5 T1224 oejs.AbstractConnector.doStart Started SocketConnector@0.0.0.0:39151
[junit4:junit4]   2> 10 T1224 oasc.SolrResourceLoader.locateSolrHome JNDI not configured for solr (NoInitialContextEx)
[junit4:junit4]   2> 10 T1224 oasc.SolrResourceLoader.locateSolrHome using system property solr.solr.home: /mnt/ssd/jenkins/workspace/Lucene-Solr-4.x-Linux-Java8-64/checkout/solr/build/solr-core/test-files/solr
[junit4:junit4]   2> 11 T1224 oasc.SolrResourceLoader.<init> new SolrResourceLoader for deduced Solr Home: '/mnt/ssd/jenkins/workspace/Lucene-Solr-4.x-Linux-Java8-64/checkout/solr/build/solr-core/test-files/solr/'
[junit4:junit4]   2> 15 T1224 oass.SolrDispatchFilter.init SolrDispatchFilter.init()
[junit4:junit4]   2> 15 T1224 oasc.SolrResourceLoader.locateSolrHome JNDI not configured for solr (NoInitialContextEx)
[junit4:junit4]   2> 16 T1224 oasc.SolrResourceLoader.locateSolrHome using system property solr.solr.home: /mnt/ssd/jenkins/workspace/Lucene-Solr-4.x-Linux-Java8-64/checkout/solr/build/solr-core/test-files/solr
[junit4:junit4]   2> 16 T1224 oasc.CoreContainer$Initializer.initialize looking for solr.xml: /mnt/ssd/jenkins/workspace/Lucene-Solr-4.x-Linux-Java8-64/checkout/solr/build/solr-core/test-files/solr/solr.xml
[junit4:junit4]   2> 16 T1224 oasc.CoreContainer.<init> New CoreContainer 1531557251
[junit4:junit4]   2> 16 T1224 oasc.CoreContainer.load Loading CoreContainer using Solr Home: '/mnt/ssd/jenkins/workspace/Lucene-Solr-4.x-Linux-Java8-64/checkout/solr/build/solr-core/test-files/solr/'
[junit4:junit4]   2> 17 T1224 oasc.SolrResourceLoader.<init> new SolrResourceLoader for directory: '/mnt/ssd/jenkins/workspace/Lucene-Solr-4.x-Linux-Java8-64/checkout/solr/build/solr-core/test-files/solr/'
[junit4:junit4]   2> 24 T1224 oasc.CoreContainer.load Registering Log Listener
[junit4:junit4]   2> 37 T1224 oashc.HttpShardHandlerFactory.getParameter Setting socketTimeout to: 0
[junit4:junit4]   2> 37 T1224 oashc.HttpShardHandlerFactory.getParameter Setting urlScheme to: http://
[junit4:junit4]   2> 37 T1224 oashc.HttpShardHandlerFactory.getParameter Setting connTimeout to: 0
[junit4:junit4]   2> 38 T1224 oashc.HttpShardHandlerFactory.getParameter Setting maxConnectionsPerHost to: 20
[junit4:junit4]   2> 38 T1224 oashc.HttpShardHandlerFactory.getParameter Setting corePoolSize to: 0
[junit4:junit4]   2> 38 T1224 oashc.HttpShardHandlerFactory.getParameter Setting maximumPoolSize to: 2147483647
[junit4:junit4]   2> 38 T1224 oashc.HttpShardHandlerFactory.getParameter Setting maxThreadIdleTime to: 5
[junit4:junit4]   2> 39 T1224 oashc.HttpShardHandlerFactory.getParameter Setting sizeOfQueue to: -1
[junit4:junit4]   2> 39 T1224 oashc.HttpShardHandlerFactory.getParameter Setting fairnessPolicy to: false
[junit4:junit4]   2> 39 T1224 oascsi.HttpClientUtil.createClient Creating new http client, config:maxConnectionsPerHost=20&maxConnections=10000&socketTimeout=0&connTimeout=0&retry=false
[junit4:junit4]   2> 48 T1224 oasc.CoreContainer.create Creating SolrCore 'collection1' using instanceDir: /mnt/ssd/jenkins/workspace/Lucene-Solr-4.x-Linux-Java8-64/checkout/solr/build/solr-core/test-files/solr/collection1
[junit4:junit4]   2> 48 T1224 oasc.SolrResourceLoader.<init> new SolrResourceLoader for directory: '/mnt/ssd/jenkins/workspace/Lucene-Solr-4.x-Linux-Java8-64/checkout/solr/build/solr-core/test-files/solr/collection1/'
[junit4:junit4]   2> 49 T1224 oasc.SolrResourceLoader.replaceClassLoader Adding 'file:/mnt/ssd/jenkins/workspace/Lucene-Solr-4.x-Linux-Java8-64/checkout/solr/build/solr-core/test-files/solr/collection1/lib/README' to classloader
[junit4:junit4]   2> 52 T1224 oasc.SolrResourceLoader.replaceClassLoader Adding 'file:/mnt/ssd/jenkins/workspace/Lucene-Solr-4.x-Linux-Java8-64/checkout/solr/build/solr-core/test-files/solr/collection1/lib/classes/' to classloader
[junit4:junit4]   2> 76 T1224 oasc.SolrConfig.<init> Using Lucene MatchVersion: LUCENE_40
[junit4:junit4]   2> 114 T1224 oasc.SolrConfig.<init> Loaded SolrConfig: solrconfig-elevate.xml
[junit4:junit4]   2> 114 T1224 oass.IndexSchema.readSchema Reading Solr Schema
[junit4:junit4]   2> 123 T1224 oass.IndexSchema.readSchema Schema name=example
[junit4:junit4]   2> 259 T1224 oass.IndexSchema.readSchema default search field in schema is text
[junit4:junit4]   2> 261 T1224 oass.IndexSchema.readSchema unique key field: id
[junit4:junit4]   2> 263 T1224 oasc.SolrCore.<init> [collection1] Opening new SolrCore at /mnt/ssd/jenkins/workspace/Lucene-Solr-4.x-Linux-Java8-64/checkout/solr/build/solr-core/test-files/solr/collection1/, dataDir=./org.apache.solr.handler.component.DistributedQueryElevationComponentTest-1341764434756/control/data/
[junit4:junit4]   2> 263 T1224 oasc.JmxMonitoredMap.<init> JMX monitoring is enabled. Adding Solr mbeans to JMX Server: com.sun.jmx.mbeanserver.JmxMBeanServer@6065af06
[junit4:junit4]   2> 263 T1224 oasc.SolrCore.getNewIndexDir WARNING New index directory detected: old=null new=./org.apache.solr.handler.component.DistributedQueryElevationComponentTest-1341764434756/control/data/index/
[junit4:junit4]   2> 264 T1224 oasc.SolrCore.initIndex WARNING [collection1] Solr index directory './org.apache.solr.handler.component.DistributedQueryElevationComponentTest-1341764434756/control/data/index' doesn't exist. Creating new index...
[junit4:junit4]   2> 264 T1224 oasc.SolrDeletionPolicy.onCommit SolrDeletionPolicy.onCommit: commits:num=1
[junit4:junit4]   2> 		commit{dir=MockDirWrapper(org.apache.lucene.store.RAMDirectory@46e46f0b lockFactory=org.apache.lucene.store.SingleInstanceLockFactory@aba3bcb),segFN=segments_1,generation=1,filenames=[segments_1]
[junit4:junit4]   2> 265 T1224 oasc.SolrDeletionPolicy.updateCommits newest commit = 1
[junit4:junit4]   2> 266 T1224 oasc.RequestHandlers.initHandlersFromConfig created /update: solr.UpdateRequestHandler
[junit4:junit4]   2> 266 T1224 oasc.RequestHandlers.initHandlersFromConfig created /elevate: org.apache.solr.handler.component.SearchHandler
[junit4:junit4]   2> 266 T1224 oasc.RequestHandlers.initHandlersFromConfig created /dataElevate: org.apache.solr.handler.component.SearchHandler
[junit4:junit4]   2> 267 T1224 oashl.XMLLoader.init xsltCacheLifetimeSeconds=60
[junit4:junit4]   2> 267 T1224 oasc.RequestHandlers.initHandlersFromConfig WARNING no default request handler is registered (either '/select' or 'standard')
[junit4:junit4]   2> 273 T1224 oasc.SolrCore.initDeprecatedSupport WARNING solrconfig.xml uses deprecated <admin/gettableFiles>, Please update your config to use the ShowFileRequestHandler.
[junit4:junit4]   2> 274 T1224 oasc.SolrCore.initDeprecatedSupport WARNING adding ShowFileRequestHandler with hidden files: [SOLRCONFIG-UPDATE-PROCESSOR-CHAINS.XML, SCHEMA-CHARFILTERS.XML, BAD-SCHEMA-NOT-INDEXED-BUT-POS.XML, SCHEMA-TFIDF.XML, SOLRCONFIG-REPEATER.XML, SCHEMA-COPYFIELD-TEST.XML, PHRASESUGGEST.TXT, SOLRCONFIG-SLAVE.XML, CURRENCY.XML, KEEP-1.TXT, KEEP-2.TXT, SCHEMA-REVERSED.XML, SOLRCONFIG-TERMINDEX.XML, SOLRCONFIG-ENABLEPLUGIN.XML, XSLT, SOLRCONFIG-SLAVE1.XML, SCHEMA-NUMERIC.XML, SOLRCONFIG-SIMPLELOCK.XML, BAD-SCHEMA-UNIQUEKEY-USES-DEFAULT.XML, SOLRCONFIG-TLOG.XML, SCHEMASURROUND.XML, STOP-2.TXT, SCHEMA-STOP-KEEP.XML, SCHEMA-NOT-REQUIRED-UNIQUE-KEY.XML, HUNSPELL-TEST.AFF, PROTWORDS.TXT, SOLRCONFIG-MASTER2.XML, SOLRCONFIG-MASTER1.XML, BAD-SCHEMA-EXTERNAL-FILEFIELD.XML, BAD-SCHEMA-SIM-GLOBAL-VS-FT-MISMATCH.XML, SCHEMA-REQUIRED-FIELDS.XML, SOLRCONFIG-FUNCTIONQUERY.XML, HUNSPELL-TEST.DIC, SOLRCONFIG-BASIC.XML, SOLRCONFIG-TRANSFORMERS.XML, SOLRCONFIG-DELPOLICY2.XML, SOLRCONFIG-QUERYSENDER.XML, SOLRCONFIG-SPELLCHECKCOMPONENT.XML, BAD-SCHEMA-NOT-INDEXED-BUT-NORMS.XML, BAD_SOLRCONFIG.XML, SCHEMA-BINARYFIELD.XML, SCHEMA-MINIMAL.XML, SCHEMA-PHRASESUGGEST.XML, ELEVATE.XML, STEMDICT.TXT, STOP-SNOWBALL.TXT, STOPTYPES-2.TXT, SOLRCONFIG-XINCLUDE.XML, SCHEMA-BM25.XML, STOPTYPES-1.TXT, SOLRCONFIG-ELEVATE.XML, BAD-SCHEMA-UNIQUEKEY-IS-COPYFIELD-DEST.XML, SCHEMA-LMJELINEKMERCER.XML, SCHEMA-REPLICATION1.XML, SCHEMA.XML, SCHEMA-COLLATEFILTER.XML, BAD-SCHEMA-DUP-DYNAMICFIELD.XML, SOLRCONFIG-SOLCOREPROPERTIES.XML, BAD-SCHEMA-DUP-FIELD.XML, SOLRCONFIG-NOCACHE.XML, FRENCHARTICLES.TXT, COMPOUNDDICTIONARY.TXT, STOP-1.TXT, SOLRCONFIG-HIGHLIGHT.XML, SCHEMA11.XML, BAD-SCHEMA-DUP-FIELDTYPE.XML, HYPHENATION.DTD, SCHEMA-SPELLCHECKER.XML, BAD-SCHEMA-NOT-INDEXED-BUT-TF.XML, SOLRCONFIG-MASTER3.XML, SCHEMA15.XML, SOLRCONFIG-NATIVELOCK.XML, SOLRCONFIG_CODEC.XML, SCHEMA-FOLDING.XML, SOLRCONFIG-MASTER.XML, WDFTYPES.TXT, SCHEMA-IB.XML, BAD-SCHEMA-NONTEXT-ANALYZER.XML, SOLRCONFIG-SPELLCHECKER.XML, SCHEMA-LUCENEMATCHVERSION.XML, SOLRCONFIG-CACHING.XML, SOLRCONFIG-ALTDIRECTORY.XML, OPEN-EXCHANGE-RATES.JSON, BAD-SCHEMA-OMIT-TF-BUT-NOT-POS.XML, SOLRCONFIG-PROPINJECT-INDEXDEFAULT.XML, SOLRCONFIG-REQHANDLER.INCL, SCHEMA-LMDIRICHLET.XML, MAPPING-ISOLATIN1ACCENT.TXT, SOLRCONFIG-SOLR-749.XML, SCHEMA_CODEC.XML, SOLRCONFIG-BASIC-LUCENEVERSION31.XML, DA_COMPOUNDDICTIONARY.TXT, STOPWORDSWRONGENCODING.TXT, SOLRCONFIG-MASTER1-KEEPONEBACKUP.XML, SOLRCONFIG-PHRASESUGGEST.XML, BAD-MP-SOLRCONFIG.XML, SOLRCONFIG-DELPOLICY1.XML, SOLRCONFIG-QUERYSENDER-NOQUERY.XML, STOPWITHBOM.TXT, SOLRCONFIG-PROPINJECT.XML, SYNONYMS.TXT, SOLRCONFIG-MERGEPOLICY.XML, SCHEMA-REPLICATION2.XML, SCHEMA12.XML, SCHEMA-TRIE.XML, SCHEMA-DFR.XML, SCHEMA-COLLATE.XML, STOPWORDS.TXT, SOLRCONFIG_PERF.XML, DA_UTF8.XML, SOLRCONFIG-LAZYWRITER.XML, SCHEMA-SIM.XML, OLD_SYNONYMS.TXT]
[junit4:junit4]   2> 275 T1224 oass.SolrIndexSearcher.<init> Opening Searcher@5b75a794 main
[junit4:junit4]   2> 276 T1224 oass.SolrIndexSearcher.getIndexDir WARNING WARNING: Directory impl does not support setting indexDir: org.apache.lucene.store.MockDirectoryWrapper
[junit4:junit4]   2> 276 T1224 oasu.CommitTracker.<init> Hard AutoCommit: disabled
[junit4:junit4]   2> 276 T1224 oasu.CommitTracker.<init> Soft AutoCommit: disabled
[junit4:junit4]   2> 276 T1224 oashc.QueryElevationComponent.inform Loading QueryElevation from: /mnt/ssd/jenkins/workspace/Lucene-Solr-4.x-Linux-Java8-64/checkout/solr/build/solr-core/test-files/solr/collection1/conf/elevate.xml
[junit4:junit4]   2> 283 T1224 oashc.QueryElevationComponent.inform Loading QueryElevation from: /mnt/ssd/jenkins/workspace/Lucene-Solr-4.x-Linux-Java8-64/checkout/solr/build/solr-core/test-files/solr/collection1/conf/elevate.xml
[junit4:junit4]   2> 291 T1234 oasc.SolrCore.registerSearcher [collection1] Registered new searcher Searcher@5b75a794 main{StandardDirectoryReader(segments_1:1)}
[junit4:junit4]   2> 291 T1224 oasc.CoreContainer.register registering core: collection1
[junit4:junit4]   2> 291 T1224 oass.SolrDispatchFilter.init user.dir=/mnt/ssd/jenkins/workspace/Lucene-Solr-4.x-Linux-Java8-64/checkout/solr/build/solr-core/test/J0
[junit4:junit4]   2> 291 T1224 oass.SolrDispatchFilter.init SolrDispatchFilter.init() done
[junit4:junit4]   2> 291 T1224 oascsi.HttpClientUtil.createClient Creating new http client, config:maxConnections=128&maxConnectionsPerHost=32&followRedirects=false
[junit4:junit4]   2> 294 T1224 oejs.Server.doStart jetty-8.1.2.v20120308
[junit4:junit4]   2> 295 T1224 oejs.AbstractConnector.doStart Started SocketConnector@0.0.0.0:34781
[junit4:junit4]   2> 297 T1224 oasc.SolrResourceLoader.locateSolrHome JNDI not configured for solr (NoInitialContextEx)
[junit4:junit4]   2> 298 T1224 oasc.SolrResourceLoader.locateSolrHome using system property solr.solr.home: /mnt/ssd/jenkins/workspace/Lucene-Solr-4.x-Linux-Java8-64/checkout/solr/build/solr-core/test-files/solr
[junit4:junit4]   2> 298 T1224 oasc.SolrResourceLoader.<init> new SolrResourceLoader for deduced Solr Home: '/mnt/ssd/jenkins/workspace/Lucene-Solr-4.x-Linux-Java8-64/checkout/solr/build/solr-core/test-files/solr/'
[junit4:junit4]   2> 301 T1224 oass.SolrDispatchFilter.init SolrDispatchFilter.init()
[junit4:junit4]   2> 302 T1224 oasc.SolrResourceLoader.locateSolrHome JNDI not configured for solr (NoInitialContextEx)
[junit4:junit4]   2> 302 T1224 oasc.SolrResourceLoader.locateSolrHome using system property solr.solr.home: /mnt/ssd/jenkins/workspace/Lucene-Solr-4.x-Linux-Java8-64/checkout/solr/build/solr-core/test-files/solr
[junit4:junit4]   2> 302 T1224 oasc.CoreContainer$Initializer.initialize looking for solr.xml: /mnt/ssd/jenkins/workspace/Lucene-Solr-4.x-Linux-Java8-64/checkout/solr/build/solr-core/test-files/solr/solr.xml
[junit4:junit4]   2> 303 T1224 oasc.CoreContainer.<init> New CoreContainer 1954000053
[junit4:junit4]   2> 303 T1224 oasc.CoreContainer.load Loading CoreContainer using Solr Home: '/mnt/ssd/jenkins/workspace/Lucene-Solr-4.x-Linux-Java8-64/checkout/solr/build/solr-core/test-files/solr/'
[junit4:junit4]   2> 303 T1224 oasc.SolrResourceLoader.<init> new SolrResourceLoader for directory: '/mnt/ssd/jenkins/workspace/Lucene-Solr-4.x-Linux-Java8-64/checkout/solr/build/solr-core/test-files/solr/'
[junit4:junit4]   2> 317 T1224 oasc.CoreContainer.load Registering Log Listener
[junit4:junit4]   2> 326 T1224 oashc.HttpShardHandlerFactory.getParameter Setting socketTimeout to: 0
[junit4:junit4]   2> 326 T1224 oashc.HttpShardHandlerFactory.getParameter Setting urlScheme to: http://
[junit4:junit4]   2> 327 T1224 oashc.HttpShardHandlerFactory.getParameter Setting connTimeout to: 0
[junit4:junit4]   2> 327 T1224 oashc.HttpShardHandlerFactory.getParameter Setting maxConnectionsPerHost to: 20
[junit4:junit4]   2> 327 T1224 oashc.HttpShardHandlerFactory.getParameter Setting corePoolSize to: 0
[junit4:junit4]   2> 327 T1224 oashc.HttpShardHandlerFactory.getParameter Setting maximumPoolSize to: 2147483647
[junit4:junit4]   2> 327 T1224 oashc.HttpShardHandlerFactory.getParameter Setting maxThreadIdleTime to: 5
[junit4:junit4]   2> 328 T1224 oashc.HttpShardHandlerFactory.getParameter Setting sizeOfQueue to: -1
[junit4:junit4]   2> 328 T1224 oashc.HttpShardHandlerFactory.getParameter Setting fairnessPolicy to: false
[junit4:junit4]   2> 328 T1224 oascsi.HttpClientUtil.createClient Creating new http client, config:maxConnectionsPerHost=20&maxConnections=10000&socketTimeout=0&connTimeout=0&retry=false
[junit4:junit4]   2> 334 T1224 oasc.CoreContainer.create Creating SolrCore 'collection1' using instanceDir: /mnt/ssd/jenkins/workspace/Lucene-Solr-4.x-Linux-Java8-64/checkout/solr/build/solr-core/test-files/solr/collection1
[junit4:junit4]   2> 334 T1224 oasc.SolrResourceLoader.<init> new SolrResourceLoader for directory: '/mnt/ssd/jenkins/workspace/Lucene-Solr-4.x-Linux-Java8-64/checkout/solr/build/solr-core/test-files/solr/collection1/'
[junit4:junit4]   2> 335 T1224 oasc.SolrResourceLoader.replaceClassLoader Adding 'file:/mnt/ssd/jenkins/workspace/Lucene-Solr-4.x-Linux-Java8-64/checkout/solr/build/solr-core/test-files/solr/collection1/lib/README' to classloader
[junit4:junit4]   2> 336 T1224 oasc.SolrResourceLoader.replaceClassLoader Adding 'file:/mnt/ssd/jenkins/workspace/Lucene-Solr-4.x-Linux-Java8-64/checkout/solr/build/solr-core/test-files/solr/collection1/lib/classes/' to classloader
[junit4:junit4]   2> 354 T1224 oasc.SolrConfig.<init> Using Lucene MatchVersion: LUCENE_40
[junit4:junit4]   2> 391 T1224 oasc.SolrConfig.<init> Loaded SolrConfig: solrconfig-elevate.xml
[junit4:junit4]   2> 391 T1224 oass.IndexSchema.readSchema Reading Solr Schema
[junit4:junit4]   2> 394 T1224 oass.IndexSchema.readSchema Schema name=example
[junit4:junit4]   2> 547 T1224 oass.IndexSchema.readSchema default search field in schema is text
[junit4:junit4]   2> 549 T1224 oass.IndexSchema.readSchema unique key field: id
[junit4:junit4]   2> 551 T1224 oasc.SolrCore.<init> [collection1] Opening new SolrCore at /mnt/ssd/jenkins/workspace/Lucene-Solr-4.x-Linux-Java8-64/checkout/solr/build/solr-core/test-files/solr/collection1/, dataDir=./org.apache.solr.handler.component.DistributedQueryElevationComponentTest-1341764434756/shard0/data/
[junit4:junit4]   2> 552 T1224 oasc.JmxMonitoredMap.<init> JMX monitoring is enabled. Adding Solr mbeans to JMX Server: com.sun.jmx.mbeanserver.JmxMBeanServer@6065af06
[junit4:junit4]   2> 552 T1224 oasc.SolrCore.getNewIndexDir WARNING New index directory detected: old=null new=./org.apache.solr.handler.component.DistributedQueryElevationComponentTest-1341764434756/shard0/data/index/
[junit4:junit4]   2> 553 T1224 oasc.SolrCore.initIndex WARNING [collection1] Solr index directory './org.apache.solr.handler.component.DistributedQueryElevationComponentTest-1341764434756/shard0/data/index' doesn't exist. Creating new index...
[junit4:junit4]   2> 554 T1224 oasc.SolrDeletionPolicy.onCommit SolrDeletionPolicy.onCommit: commits:num=1
[junit4:junit4]   2> 		commit{dir=MockDirWrapper(org.apache.lucene.store.RAMDirectory@11ece774 lockFactory=org.apache.lucene.store.SingleInstanceLockFactory@49c9c976),segFN=segments_1,generation=1,filenames=[segments_1]
[junit4:junit4]   2> 554 T1224 oasc.SolrDeletionPolicy.updateCommits newest commit = 1
[junit4:junit4]   2> 555 T1224 oasc.RequestHandlers.initHandlersFromConfig created /update: solr.UpdateRequestHandler
[junit4:junit4]   2> 555 T1224 oasc.RequestHandlers.initHandlersFromConfig created /elevate: org.apache.solr.handler.component.SearchHandler
[junit4:junit4]   2> 556 T1224 oasc.RequestHandlers.initHandlersFromConfig created /dataElevate: org.apache.solr.handler.component.SearchHandler
[junit4:junit4]   2> 556 T1224 oashl.XMLLoader.init xsltCacheLifetimeSeconds=60
[junit4:junit4]   2> 556 T1224 oasc.RequestHandlers.initHandlersFromConfig WARNING no default request handler is registered (either '/select' or 'standard')
[junit4:junit4]   2> 558 T1224 oasc.SolrCore.initDeprecatedSupport WARNING solrconfig.xml uses deprecated <admin/gettableFiles>, Please update your config to use the ShowFileRequestHandler.
[junit4:junit4]   2> 558 T1224 oasc.SolrCore.initDeprecatedSupport WARNING adding ShowFileRequestHandler with hidden files: [SOLRCONFIG-UPDATE-PROCESSOR-CHAINS.XML, SCHEMA-CHARFILTERS.XML, BAD-SCHEMA-NOT-INDEXED-BUT-POS.XML, SCHEMA-TFIDF.XML, SOLRCONFIG-REPEATER.XML, SCHEMA-COPYFIELD-TEST.XML, PHRASESUGGEST.TXT, SOLRCONFIG-SLAVE.XML, CURRENCY.XML, KEEP-1.TXT, KEEP-2.TXT, SCHEMA-REVERSED.XML, SOLRCONFIG-TERMINDEX.XML, SOLRCONFIG-ENABLEPLUGIN.XML, XSLT, SOLRCONFIG-SLAVE1.XML, SCHEMA-NUMERIC.XML, SOLRCONFIG-SIMPLELOCK.XML, BAD-SCHEMA-UNIQUEKEY-USES-DEFAULT.XML, SOLRCONFIG-TLOG.XML, SCHEMASURROUND.XML, STOP-2.TXT, SCHEMA-STOP-KEEP.XML, SCHEMA-NOT-REQUIRED-UNIQUE-KEY.XML, HUNSPELL-TEST.AFF, PROTWORDS.TXT, SOLRCONFIG-MASTER2.XML, SOLRCONFIG-MASTER1.XML, BAD-SCHEMA-EXTERNAL-FILEFIELD.XML, BAD-SCHEMA-SIM-GLOBAL-VS-FT-MISMATCH.XML, SCHEMA-REQUIRED-FIELDS.XML, SOLRCONFIG-FUNCTIONQUERY.XML, HUNSPELL-TEST.DIC, SOLRCONFIG-BASIC.XML, SOLRCONFIG-TRANSFORMERS.XML, SOLRCONFIG-DELPOLICY2.XML, SOLRCONFIG-QUERYSENDER.XML, SOLRCONFIG-SPELLCHECKCOMPONENT.XML, BAD-SCHEMA-NOT-INDEXED-BUT-NORMS.XML, BAD_SOLRCONFIG.XML, SCHEMA-BINARYFIELD.XML, SCHEMA-MINIMAL.XML, SCHEMA-PHRASESUGGEST.XML, ELEVATE.XML, STEMDICT.TXT, STOP-SNOWBALL.TXT, STOPTYPES-2.TXT, SOLRCONFIG-XINCLUDE.XML, SCHEMA-BM25.XML, STOPTYPES-1.TXT, SOLRCONFIG-ELEVATE.XML, BAD-SCHEMA-UNIQUEKEY-IS-COPYFIELD-DEST.XML, SCHEMA-LMJELINEKMERCER.XML, SCHEMA-REPLICATION1.XML, SCHEMA.XML, SCHEMA-COLLATEFILTER.XML, BAD-SCHEMA-DUP-DYNAMICFIELD.XML, SOLRCONFIG-SOLCOREPROPERTIES.XML, BAD-SCHEMA-DUP-FIELD.XML, SOLRCONFIG-NOCACHE.XML, FRENCHARTICLES.TXT, COMPOUNDDICTIONARY.TXT, STOP-1.TXT, SOLRCONFIG-HIGHLIGHT.XML, SCHEMA11.XML, BAD-SCHEMA-DUP-FIELDTYPE.XML, HYPHENATION.DTD, SCHEMA-SPELLCHECKER.XML, BAD-SCHEMA-NOT-INDEXED-BUT-TF.XML, SOLRCONFIG-MASTER3.XML, SCHEMA15.XML, SOLRCONFIG-NATIVELOCK.XML, SOLRCONFIG_CODEC.XML, SCHEMA-FOLDING.XML, SOLRCONFIG-MASTER.XML, WDFTYPES.TXT, SCHEMA-IB.XML, BAD-SCHEMA-NONTEXT-ANALYZER.XML, SOLRCONFIG-SPELLCHECKER.XML, SCHEMA-LUCENEMATCHVERSION.XML, SOLRCONFIG-CACHING.XML, SOLRCONFIG-ALTDIRECTORY.XML, OPEN-EXCHANGE-RATES.JSON, BAD-SCHEMA-OMIT-TF-BUT-NOT-POS.XML, SOLRCONFIG-PROPINJECT-INDEXDEFAULT.XML, SOLRCONFIG-REQHANDLER.INCL, SCHEMA-LMDIRICHLET.XML, MAPPING-ISOLATIN1ACCENT.TXT, SOLRCONFIG-SOLR-749.XML, SCHEMA_CODEC.XML, SOLRCONFIG-BASIC-LUCENEVERSION31.XML, DA_COMPOUNDDICTIONARY.TXT, STOPWORDSWRONGENCODING.TXT, SOLRCONFIG-MASTER1-KEEPONEBACKUP.XML, SOLRCONFIG-PHRASESUGGEST.XML, BAD-MP-SOLRCONFIG.XML, SOLRCONFIG-DELPOLICY1.XML, SOLRCONFIG-QUERYSENDER-NOQUERY.XML, STOPWITHBOM.TXT, SOLRCONFIG-PROPINJECT.XML, SYNONYMS.TXT, SOLRCONFIG-MERGEPOLICY.XML, SCHEMA-REPLICATION2.XML, SCHEMA12.XML, SCHEMA-TRIE.XML, SCHEMA-DFR.XML, SCHEMA-COLLATE.XML, STOPWORDS.TXT, SOLRCONFIG_PERF.XML, DA_UTF8.XML, SOLRCONFIG-LAZYWRITER.XML, SCHEMA-SIM.XML, OLD_SYNONYMS.TXT]
[junit4:junit4]   2> 560 T1224 oass.SolrIndexSearcher.<init> Opening Searcher@2cf97681 main
[junit4:junit4]   2> 561 T1224 oass.SolrIndexSearcher.getIndexDir WARNING WARNING: Directory impl does not support setting indexDir: org.apache.lucene.store.MockDirectoryWrapper
[junit4:junit4]   2> 561 T1224 oasu.CommitTracker.<init> Hard AutoCommit: disabled
[junit4:junit4]   2> 561 T1224 oasu.CommitTracker.<init> Soft AutoCommit: disabled
[junit4:junit4]   2> 562 T1224 oashc.QueryElevationComponent.inform Loading QueryElevation from: /mnt/ssd/jenkins/workspace/Lucene-Solr-4.x-Linux-Java8-64/checkout/solr/build/solr-core/test-files/solr/collection1/conf/elevate.xml
[junit4:junit4]   2> 575 T1224 oashc.QueryElevationComponent.inform Loading QueryElevation from: /mnt/ssd/jenkins/workspace/Lucene-Solr-4.x-Linux-Java8-64/checkout/solr/build/solr-core/test-files/solr/collection1/conf/elevate.xml
[junit4:junit4]   2> 582 T1244 oasc.SolrCore.registerSearcher [collection1] Registered new searcher Searcher@2cf97681 main{StandardDirectoryReader(segments_1:1)}
[junit4:junit4]   2> 583 T1224 oasc.CoreContainer.register registering core: collection1
[junit4:junit4]   2> 583 T1224 oass.SolrDispatchFilter.init user.dir=/mnt/ssd/jenkins/workspace/Lucene-Solr-4.x-Linux-Java8-64/checkout/solr/build/solr-core/test/J0
[junit4:junit4]   2> 583 T1224 oass.SolrDispatchFilter.init SolrDispatchFilter.init() done
[junit4:junit4]   2> 583 T1224 oascsi.HttpClientUtil.createClient Creating new http client, config:maxConnections=128&maxConnectionsPerHost=32&followRedirects=false
[junit4:junit4]   2> 595 T1224 oejs.Server.doStart jetty-8.1.2.v20120308
[junit4:junit4]   2> 597 T1224 oejs.AbstractConnector.doStart Started SocketConnector@0.0.0.0:59595
[junit4:junit4]   2> 598 T1224 oasc.SolrResourceLoader.locateSolrHome JNDI not configured for solr (NoInitialContextEx)
[junit4:junit4]   2> 598 T1224 oasc.SolrResourceLoader.locateSolrHome using system property solr.solr.home: /mnt/ssd/jenkins/workspace/Lucene-Solr-4.x-Linux-Java8-64/checkout/solr/build/solr-core/test-files/solr
[junit4:junit4]   2> 598 T1224 oasc.SolrResourceLoader.<init> new SolrResourceLoader for deduced Solr Home: '/mnt/ssd/jenkins/workspace/Lucene-Solr-4.x-Linux-Java8-64/checkout/solr/build/solr-core/test-files/solr/'
[junit4:junit4]   2> 602 T1224 oass.SolrDispatchFilter.init SolrDispatchFilter.init()
[junit4:junit4]   2> 602 T1224 oasc.SolrResourceLoader.locateSolrHome JNDI not configured for solr (NoInitialContextEx)
[junit4:junit4]   2> 602 T1224 oasc.SolrResourceLoader.locateSolrHome using system property solr.solr.home: /mnt/ssd/jenkins/workspace/Lucene-Solr-4.x-Linux-Java8-64/checkout/solr/build/solr-core/test-files/solr
[junit4:junit4]   2> 602 T1224 oasc.CoreContainer$Initializer.initialize looking for solr.xml: /mnt/ssd/jenkins/workspace/Lucene-Solr-4.x-Linux-Java8-64/checkout/solr/build/solr-core/test-files/solr/solr.xml
[junit4:junit4]   2> 603 T1224 oasc.CoreContainer.<init> New CoreContainer 1097031299
[junit4:junit4]   2> 603 T1224 oasc.CoreContainer.load Loading CoreContainer using Solr Home: '/mnt/ssd/jenkins/workspace/Lucene-Solr-4.x-Linux-Java8-64/checkout/solr/build/solr-core/test-files/solr/'
[junit4:junit4]   2> 603 T1224 oasc.SolrResourceLoader.<init> new SolrResourceLoader for directory: '/mnt/ssd/jenkins/workspace/Lucene-Solr-4.x-Linux-Java8-64/checkout/solr/build/solr-core/test-files/solr/'
[junit4:junit4]   2> 611 T1224 oasc.CoreContainer.load Registering Log Listener
[junit4:junit4]   2> 620 T1224 oashc.HttpShardHandlerFactory.getParameter Setting socketTimeout to: 0
[junit4:junit4]   2> 620 T1224 oashc.HttpShardHandlerFactory.getParameter Setting urlScheme to: http://
[junit4:junit4]   2> 620 T1224 oashc.HttpShardHandlerFactory.getParameter Setting connTimeout to: 0
[junit4:junit4]   2> 621 T1224 oashc.HttpShardHandlerFactory.getParameter Setting maxConnectionsPerHost to: 20
[junit4:junit4]   2> 621 T1224 oashc.HttpShardHandlerFactory.getParameter Setting corePoolSize to: 0
[junit4:junit4]   2> 621 T1224 oashc.HttpShardHandlerFactory.getParameter Setting maximumPoolSize to: 2147483647
[junit4:junit4]   2> 621 T1224 oashc.HttpShardHandlerFactory.getParameter Setting maxThreadIdleTime to: 5
[junit4:junit4]   2> 622 T1224 oashc.HttpShardHandlerFactory.getParameter Setting sizeOfQueue to: -1
[junit4:junit4]   2> 622 T1224 oashc.HttpShardHandlerFactory.getParameter Setting fairnessPolicy to: false
[junit4:junit4]   2> 622 T1224 oascsi.HttpClientUtil.createClient Creating new http client, config:maxConnectionsPerHost=20&maxConnections=10000&socketTimeout=0&connTimeout=0&retry=false
[junit4:junit4]   2> 627 T1224 oasc.CoreContainer.create Creating SolrCore 'collection1' using instanceDir: /mnt/ssd/jenkins/workspace/Lucene-Solr-4.x-Linux-Java8-64/checkout/solr/build/solr-core/test-files/solr/collection1
[junit4:junit4]   2> 628 T1224 oasc.SolrResourceLoader.<init> new SolrResourceLoader for directory: '/mnt/ssd/jenkins/workspace/Lucene-Solr-4.x-Linux-Java8-64/checkout/solr/build/solr-core/test-files/solr/collection1/'
[junit4:junit4]   2> 628 T1224 oasc.SolrResourceLoader.replaceClassLoader Adding 'file:/mnt/ssd/jenkins/workspace/Lucene-Solr-4.x-Linux-Java8-64/checkout/solr/build/solr-core/test-files/solr/collection1/lib/README' to classloader
[junit4:junit4]   2> 629 T1224 oasc.SolrResourceLoader.replaceClassLoader Adding 'file:/mnt/ssd/jenkins/workspace/Lucene-Solr-4.x-Linux-Java8-64/checkout/solr/build/solr-core/test-files/solr/collection1/lib/classes/' to classloader
[junit4:junit4]   2> 646 T1224 oasc.SolrConfig.<init> Using Lucene MatchVersion: LUCENE_40
[junit4:junit4]   2> 683 T1224 oasc.SolrConfig.<init> Loaded SolrConfig: solrconfig-elevate.xml
[junit4:junit4]   2> 683 T1224 oass.IndexSchema.readSchema Reading Solr Schema
[junit4:junit4]   2> 686 T1224 oass.IndexSchema.readSchema Schema name=example
[junit4:junit4]   2> 844 T1224 oass.IndexSchema.readSchema default search field in schema is text
[junit4:junit4]   2> 847 T1224 oass.IndexSchema.readSchema unique key field: id
[junit4:junit4]   2> 852 T1224 oasc.SolrCore.<init> [collection1] Opening new SolrCore at /mnt/ssd/jenkins/workspace/Lucene-Solr-4.x-Linux-Java8-64/checkout/solr/build/solr-core/test-files/solr/collection1/, dataDir=./org.apache.solr.handler.component.DistributedQueryElevationComponentTest-1341764434756/shard1/data/
[junit4:junit4]   2> 852 T1224 oasc.JmxMonitoredMap.<init> JMX monitoring is enabled. Adding Solr mbeans to JMX Server: com.sun.jmx.mbeanserver.JmxMBeanServer@6065af06
[junit4:junit4]   2> 853 T1224 oasc.SolrCore.getNewIndexDir WARNING New index directory detected: old=null new=./org.apache.solr.handler.component.DistributedQueryElevationComponentTest-1341764434756/shard1/data/index/
[junit4:junit4]   2> 853 T1224 oasc.SolrCore.initIndex WARNING [collection1] Solr index directory './org.apache.solr.handler.component.DistributedQueryElevationComponentTest-1341764434756/shard1/data/index' doesn't exist. Creating new index...
[junit4:junit4]   2> 855 T1224 oasc.SolrDeletionPolicy.onCommit SolrDeletionPolicy.onCommit: commits:num=1
[junit4:junit4]   2> 		commit{dir=MockDirWrapper(NRTCachingDirectory(org.apache.lucene.store.RAMDirectory@401fc793 lockFactory=org.apache.lucene.store.SingleInstanceLockFactory@8e9bb95; maxCacheMB=0.7041015625 maxMergeSizeMB=0.275390625)),segFN=segments_1,generation=1,filenames=[segments_1]
[junit4:junit4]   2> 855 T1224 oasc.SolrDeletionPolicy.updateCommits newest commit = 1
[junit4:junit4]   2> 856 T1224 oasc.RequestHandlers.initHandlersFromConfig created /update: solr.UpdateRequestHandler
[junit4:junit4]   2> 857 T1224 oasc.RequestHandlers.initHandlersFromConfig created /elevate: org.apache.solr.handler.component.SearchHandler
[junit4:junit4]   2> 857 T1224 oasc.RequestHandlers.initHandlersFromConfig created /dataElevate: org.apache.solr.handler.component.SearchHandler
[junit4:junit4]   2> 858 T1224 oashl.XMLLoader.init xsltCacheLifetimeSeconds=60
[junit4:junit4]   2> 858 T1224 oasc.RequestHandlers.initHandlersFromConfig WARNING no default request handler is registered (either '/select' or 'standard')
[junit4:junit4]   2> 859 T1224 oasc.SolrCore.initDeprecatedSupport WARNING solrconfig.xml uses deprecated <admin/gettableFiles>, Please update your config to use the ShowFileRequestHandler.
[junit4:junit4]   2> 860 T1224 oasc.SolrCore.initDeprecatedSupport WARNING adding ShowFileRequestHandler with hidden files: [SOLRCONFIG-UPDATE-PROCESSOR-CHAINS.XML, SCHEMA-CHARFILTERS.XML, BAD-SCHEMA-NOT-INDEXED-BUT-POS.XML, SCHEMA-TFIDF.XML, SOLRCONFIG-REPEATER.XML, SCHEMA-COPYFIELD-TEST.XML, PHRASESUGGEST.TXT, SOLRCONFIG-SLAVE.XML, CURRENCY.XML, KEEP-1.TXT, KEEP-2.TXT, SCHEMA-REVERSED.XML, SOLRCONFIG-TERMINDEX.XML, SOLRCONFIG-ENABLEPLUGIN.XML, XSLT, SOLRCONFIG-SLAVE1.XML, SCHEMA-NUMERIC.XML, SOLRCONFIG-SIMPLELOCK.XML, BAD-SCHEMA-UNIQUEKEY-USES-DEFAULT.XML, SOLRCONFIG-TLOG.XML, SCHEMASURROUND.XML, STOP-2.TXT, SCHEMA-STOP-KEEP.XML, SCHEMA-NOT-REQUIRED-UNIQUE-KEY.XML, HUNSPELL-TEST.AFF, PROTWORDS.TXT, SOLRCONFIG-MASTER2.XML, SOLRCONFIG-MASTER1.XML, BAD-SCHEMA-EXTERNAL-FILEFIELD.XML, BAD-SCHEMA-SIM-GLOBAL-VS-FT-MISMATCH.XML, SCHEMA-REQUIRED-FIELDS.XML, SOLRCONFIG-FUNCTIONQUERY.XML, HUNSPELL-TEST.DIC, SOLRCONFIG-BASIC.XML, SOLRCONFIG-TRANSFORMERS.XML, SOLRCONFIG-DELPOLICY2.XML, SOLRCONFIG-QUERYSENDER.XML, SOLRCONFIG-SPELLCHECKCOMPONENT.XML, BAD-SCHEMA-NOT-INDEXED-BUT-NORMS.XML, BAD_SOLRCONFIG.XML, SCHEMA-BINARYFIELD.XML, SCHEMA-MINIMAL.XML, SCHEMA-PHRASESUGGEST.XML, ELEVATE.XML, STEMDICT.TXT, STOP-SNOWBALL.TXT, STOPTYPES-2.TXT, SOLRCONFIG-XINCLUDE.XML, SCHEMA-BM25.XML, STOPTYPES-1.TXT, SOLRCONFIG-ELEVATE.XML, BAD-SCHEMA-UNIQUEKEY-IS-COPYFIELD-DEST.XML, SCHEMA-LMJELINEKMERCER.XML, SCHEMA-REPLICATION1.XML, SCHEMA.XML, SCHEMA-COLLATEFILTER.XML, BAD-SCHEMA-DUP-DYNAMICFIELD.XML, SOLRCONFIG-SOLCOREPROPERTIES.XML, BAD-SCHEMA-DUP-FIELD.XML, SOLRCONFIG-NOCACHE.XML, FRENCHARTICLES.TXT, COMPOUNDDICTIONARY.TXT, STOP-1.TXT, SOLRCONFIG-HIGHLIGHT.XML, SCHEMA11.XML, BAD-SCHEMA-DUP-FIELDTYPE.XML, HYPHENATION.DTD, SCHEMA-SPELLCHECKER.XML, BAD-SCHEMA-NOT-INDEXED-BUT-TF.XML, SOLRCONFIG-MASTER3.XML, SCHEMA15.XML, SOLRCONFIG-NATIVELOCK.XML, SOLRCONFIG_CODEC.XML, SCHEMA-FOLDING.XML, SOLRCONFIG-MASTER.XML, WDFTYPES.TXT, SCHEMA-IB.XML, BAD-SCHEMA-NONTEXT-ANALYZER.XML, SOLRCONFIG-SPELLCHECKER.XML, SCHEMA-LUCENEMATCHVERSION.XML, SOLRCONFIG-CACHING.XML, SOLRCONFIG-ALTDIRECTORY.XML, OPEN-EXCHANGE-RATES.JSON, BAD-SCHEMA-OMIT-TF-BUT-NOT-POS.XML, SOLRCONFIG-PROPINJECT-INDEXDEFAULT.XML, SOLRCONFIG-REQHANDLER.INCL, SCHEMA-LMDIRICHLET.XML, MAPPING-ISOLATIN1ACCENT.TXT, SOLRCONFIG-SOLR-749.XML, SCHEMA_CODEC.XML, SOLRCONFIG-BASIC-LUCENEVERSION31.XML, DA_COMPOUNDDICTIONARY.TXT, STOPWORDSWRONGENCODING.TXT, SOLRCONFIG-MASTER1-KEEPONEBACKUP.XML, SOLRCONFIG-PHRASESUGGEST.XML, BAD-MP-SOLRCONFIG.XML, SOLRCONFIG-DELPOLICY1.XML, SOLRCONFIG-QUERYSENDER-NOQUERY.XML, STOPWITHBOM.TXT, SOLRCONFIG-PROPINJECT.XML, SYNONYMS.TXT, SOLRCONFIG-MERGEPOLICY.XML, SCHEMA-REPLICATION2.XML, SCHEMA12.XML, SCHEMA-TRIE.XML, SCHEMA-DFR.XML, SCHEMA-COLLATE.XML, STOPWORDS.TXT, SOLRCONFIG_PERF.XML, DA_UTF8.XML, SOLRCONFIG-LAZYWRITER.XML, SCHEMA-SIM.XML, OLD_SYNONYMS.TXT]
[junit4:junit4]   2> 862 T1224 oass.SolrIndexSearcher.<init> Opening Searcher@53628962 main
[junit4:junit4]   2> 863 T1224 oass.SolrIndexSearcher.getIndexDir WARNING WARNING: Directory impl does not support setting indexDir: org.apache.lucene.store.MockDirectoryWrapper
[junit4:junit4]   2> 863 T1224 oasu.CommitTracker.<init> Hard AutoCommit: disabled
[junit4:junit4]   2> 863 T1224 oasu.CommitTracker.<init> Soft AutoCommit: disabled
[junit4:junit4]   2> 864 T1224 oashc.QueryElevationComponent.inform Loading QueryElevation from: /mnt/ssd/jenkins/workspace/Lucene-Solr-4.x-Linux-Java8-64/checkout/solr/build/solr-core/test-files/solr/collection1/conf/elevate.xml
[junit4:junit4]   2> 871 T1224 oashc.QueryElevationComponent.inform Loading QueryElevation from: /mnt/ssd/jenkins/workspace/Lucene-Solr-4.x-Linux-Java8-64/checkout/solr/build/solr-core/test-files/solr/collection1/conf/elevate.xml
[junit4:junit4]   2> 885 T1254 oasc.SolrCore.registerSearcher [collection1] Registered new searcher Searcher@53628962 main{StandardDirectoryReader(segments_1:1)}
[junit4:junit4]   2> 885 T1224 oasc.CoreContainer.register registering core: collection1
[junit4:junit4]   2> 885 T1224 oass.SolrDispatchFilter.init user.dir=/mnt/ssd/jenkins/workspace/Lucene-Solr-4.x-Linux-Java8-64/checkout/solr/build/solr-core/test/J0
[junit4:junit4]   2> 885 T1224 oass.SolrDispatchFilter.init SolrDispatchFilter.init() done
[junit4:junit4]   2> 886 T1224 oascsi.HttpClientUtil.createClient Creating new http client, config:maxConnections=128&maxConnectionsPerHost=32&followRedirects=false
[junit4:junit4]   2> 893 T1224 oejs.Server.doStart jetty-8.1.2.v20120308
[junit4:junit4]   2> 915 T1224 oejs.AbstractConnector.doStart Started SocketConnector@0.0.0.0:40321
[junit4:junit4]   2> 916 T1224 oasc.SolrResourceLoader.locateSolrHome JNDI not configured for solr (NoInitialContextEx)
[junit4:junit4]   2> 916 T1224 oasc.SolrResourceLoader.locateSolrHome using system property solr.solr.home: /mnt/ssd/jenkins/workspace/Lucene-Solr-4.x-Linux-Java8-64/checkout/solr/build/solr-core/test-files/solr
[junit4:junit4]   2> 916 T1224 oasc.SolrResourceLoader.<init> new SolrResourceLoader for deduced Solr Home: '/mnt/ssd/jenkins/workspace/Lucene-Solr-4.x-Linux-Java8-64/checkout/solr/build/solr-core/test-files/solr/'
[junit4:junit4]   2> 920 T1224 oass.SolrDispatchFilter.init SolrDispatchFilter.init()
[junit4:junit4]   2> 920 T1224 oasc.SolrResourceLoader.locateSolrHome JNDI not configured for solr (NoInitialContextEx)
[junit4:junit4]   2> 920 T1224 oasc.SolrResourceLoader.locateSolrHome using system property solr.solr.home: /mnt/ssd/jenkins/workspace/Lucene-Solr-4.x-Linux-Java8-64/checkout/solr/build/solr-core/test-files/solr
[junit4:junit4]   2> 921 T1224 oasc.CoreContainer$Initializer.initialize looking for solr.xml: /mnt/ssd/jenkins/workspace/Lucene-Solr-4.x-Linux-Java8-64/checkout/solr/build/solr-core/test-files/solr/solr.xml
[junit4:junit4]   2> 921 T1224 oasc.CoreContainer.<init> New CoreContainer 1443082064
[junit4:junit4]   2> 921 T1224 oasc.CoreContainer.load Loading CoreContainer using Solr Home: '/mnt/ssd/jenkins/workspace/Lucene-Solr-4.x-Linux-Java8-64/checkout/solr/build/solr-core/test-files/solr/'
[junit4:junit4]   2> 922 T1224 oasc.SolrResourceLoader.<init> new SolrResourceLoader for directory: '/mnt/ssd/jenkins/workspace/Lucene-Solr-4.x-Linux-Java8-64/checkout/solr/build/solr-core/test-files/solr/'
[junit4:junit4]   2> 932 T1224 oasc.CoreContainer.load Registering Log Listener
[junit4:junit4]   2> 948 T1224 oashc.HttpShardHandlerFactory.getParameter Setting socketTimeout to: 0
[junit4:junit4]   2> 949 T1224 oashc.HttpShardHandlerFactory.getParameter Setting urlScheme to: http://
[junit4:junit4]   2> 949 T1224 oashc.HttpShardHandlerFactory.getParameter Setting connTimeout to: 0
[junit4:junit4]   2> 949 T1224 oashc.HttpShardHandlerFactory.getParameter Setting maxConnectionsPerHost to: 20
[junit4:junit4]   2> 949 T1224 oashc.HttpShardHandlerFactory.getParameter Setting corePoolSize to: 0
[junit4:junit4]   2> 950 T1224 oashc.HttpShardHandlerFactory.getParameter Setting maximumPoolSize to: 2147483647
[junit4:junit4]   2> 950 T1224 oashc.HttpShardHandlerFactory.getParameter Setting maxThreadIdleTime to: 5
[junit4:junit4]   2> 950 T1224 oashc.HttpShardHandlerFactory.getParameter Setting sizeOfQueue to: -1
[junit4:junit4]   2> 950 T1224 oashc.HttpShardHandlerFactory.getParameter Setting fairnessPolicy to: false
[junit4:junit4]   2> 951 T1224 oascsi.HttpClientUtil.createClient Creating new http client, config:maxConnectionsPerHost=20&maxConnections=10000&socketTimeout=0&connTimeout=0&retry=false
[junit4:junit4]   2> 956 T1224 oasc.CoreContainer.create Creating SolrCore 'collection1' using instanceDir: /mnt/ssd/jenkins/workspace/Lucene-Solr-4.x-Linux-Java8-64/checkout/solr/build/solr-core/test-files/solr/collection1
[junit4:junit4]   2> 957 T1224 oasc.SolrResourceLoader.<init> new SolrResourceLoader for directory: '/mnt/ssd/jenkins/workspace/Lucene-Solr-4.x-Linux-Java8-64/checkout/solr/build/solr-core/test-files/solr/collection1/'
[junit4:junit4]   2> 957 T1224 oasc.SolrResourceLoader.replaceClassLoader Adding 'file:/mnt/ssd/jenkins/workspace/Lucene-Solr-4.x-Linux-Java8-64/checkout/solr/build/solr-core/test-files/solr/collection1/lib/README' to classloader
[junit4:junit4]   2> 958 T1224 oasc.SolrResourceLoader.replaceClassLoader Adding 'file:/mnt/ssd/jenkins/workspace/Lucene-Solr-4.x-Linux-Java8-64/checkout/solr/build/solr-core/test-files/solr/collection1/lib/classes/' to classloader
[junit4:junit4]   2> 976 T1224 oasc.SolrConfig.<init> Using Lucene MatchVersion: LUCENE_40
[junit4:junit4]   2> 1009 T1224 oasc.SolrConfig.<init> Loaded SolrConfig: solrconfig-elevate.xml
[junit4:junit4]   2> 1009 T1224 oass.IndexSchema.readSchema Reading Solr Schema
[junit4:junit4]   2> 1012 T1224 oass.IndexSchema.readSchema Schema name=example
[junit4:junit4]   2> 1120 T1224 oass.IndexSchema.readSchema default search field in schema is text
[junit4:junit4]   2> 1121 T1224 oass.IndexSchema.readSchema unique key field: id
[junit4:junit4]   2> 1123 T1224 oasc.SolrCore.<init> [collection1] Opening new SolrCore at /mnt/ssd/jenkins/workspace/Lucene-Solr-4.x-Linux-Java8-64/checkout/solr/build/solr-core/test-files/solr/collection1/, dataDir=./org.apache.solr.handler.component.DistributedQueryElevationComponentTest-1341764434756/shard2/data/
[junit4:junit4]   2> 1123 T1224 oasc.JmxMonitoredMap.<init> JMX monitoring is enabled. Adding Solr mbeans to JMX Server: com.sun.jmx.mbeanserver.JmxMBeanServer@6065af06
[junit4:junit4]   2> 1123 T1224 oasc.SolrCore.getNewIndexDir WARNING New index directory detected: old=null new=./org.apache.solr.handler.component.DistributedQueryElevationComponentTest-1341764434756/shard2/data/index/
[junit4:junit4]   2> 1124 T1224 oasc.SolrCore.initIndex WARNING [collection1] Solr index directory './org.apache.solr.handler.component.DistributedQueryElevationComponentTest-1341764434756/shard2/data/index' doesn't exist. Creating new index...
[junit4:junit4]   2> 1125 T1224 oasc.SolrDeletionPolicy.onCommit SolrDeletionPolicy.onCommit: commits:num=1
[junit4:junit4]   2> 		commit{dir=MockDirWrapper(org.apache.lucene.store.RAMDirectory@4c54947c lockFactory=org.apache.lucene.store.SingleInstanceLockFactory@6ef633d9),segFN=segments_1,generation=1,filenames=[segments_1]
[junit4:junit4]   2> 1125 T1224 oasc.SolrDeletionPolicy.updateCommits newest commit = 1
[junit4:junit4]   2> 1126 T1224 oasc.RequestHandlers.initHandlersFromConfig created /update: solr.UpdateRequestHandler
[junit4:junit4]   2> 1126 T1224 oasc.RequestHandlers.initHandlersFromConfig created /elevate: org.apache.solr.handler.component.SearchHandler
[junit4:junit4]   2> 1126 T1224 oasc.RequestHandlers.initHandlersFromConfig created /dataElevate: org.apache.solr.handler.component.SearchHandler
[junit4:junit4]   2> 1127 T1224 oashl.XMLLoader.init xsltCacheLifetimeSeconds=60
[junit4:junit4]   2> 1127 T1224 oasc.RequestHandlers.initHandlersFromConfig WARNING no default request handler is registered (either '/select' or 'standard')
[junit4:junit4]   2> 1128 T1224 oasc.SolrCore.initDeprecatedSupport WARNING solrconfig.xml uses deprecated <admin/gettableFiles>, Please update your config to use the ShowFileRequestHandler.
[junit4:junit4]   2> 1128 T1224 oasc.SolrCore.initDeprecatedSupport WARNING adding ShowFileRequestHandler with hidden files: [SOLRCONFIG-UPDATE-PROCESSOR-CHAINS.XML, SCHEMA-CHARFILTERS.XML, BAD-SCHEMA-NOT-INDEXED-BUT-POS.XML, SCHEMA-TFIDF.XML, SOLRCONFIG-REPEATER.XML, SCHEMA-COPYFIELD-TEST.XML, PHRASESUGGEST.TXT, SOLRCONFIG-SLAVE.XML, CURRENCY.XML, KEEP-1.TXT, KEEP-2.TXT, SCHEMA-REVERSED.XML, SOLRCONFIG-TERMINDEX.XML, SOLRCONFIG-ENABLEPLUGIN.XML, XSLT, SOLRCONFIG-SLAVE1.XML, SCHEMA-NUMERIC.XML, SOLRCONFIG-SIMPLELOCK.XML, BAD-SCHEMA-UNIQUEKEY-USES-DEFAULT.XML, SOLRCONFIG-TLOG.XML, SCHEMASURROUND.XML, STOP-2.TXT, SCHEMA-STOP-KEEP.XML, SCHEMA-NOT-REQUIRED-UNIQUE-KEY.XML, HUNSPELL-TEST.AFF, PROTWORDS.TXT, SOLRCONFIG-MASTER2.XML, SOLRCONFIG-MASTER1.XML, BAD-SCHEMA-EXTERNAL-FILEFIELD.XML, BAD-SCHEMA-SIM-GLOBAL-VS-FT-MISMATCH.XML, SCHEMA-REQUIRED-FIELDS.XML, SOLRCONFIG-FUNCTIONQUERY.XML, HUNSPELL-TEST.DIC, SOLRCONFIG-BASIC.XML, SOLRCONFIG-TRANSFORMERS.XML, SOLRCONFIG-DELPOLICY2.XML, SOLRCONFIG-QUERYSENDER.XML, SOLRCONFIG-SPELLCHECKCOMPONENT.XML, BAD-SCHEMA-NOT-INDEXED-BUT-NORMS.XML, BAD_SOLRCONFIG.XML, SCHEMA-BINARYFIELD.XML, SCHEMA-MINIMAL.XML, SCHEMA-PHRASESUGGEST.XML, ELEVATE.XML, STEMDICT.TXT, STOP-SNOWBALL.TXT, STOPTYPES-2.TXT, SOLRCONFIG-XINCLUDE.XML, SCHEMA-BM25.XML, STOPTYPES-1.TXT, SOLRCONFIG-ELEVATE.XML, BAD-SCHEMA-UNIQUEKEY-IS-COPYFIELD-DEST.XML, SCHEMA-LMJELINEKMERCER.XML, SCHEMA-REPLICATION1.XML, SCHEMA.XML, SCHEMA-COLLATEFILTER.XML, BAD-SCHEMA-DUP-DYNAMICFIELD.XML, SOLRCONFIG-SOLCOREPROPERTIES.XML, BAD-SCHEMA-DUP-FIELD.XML, SOLRCONFIG-NOCACHE.XML, FRENCHARTICLES.TXT, COMPOUNDDICTIONARY.TXT, STOP-1.TXT, SOLRCONFIG-HIGHLIGHT.XML, SCHEMA11.XML, BAD-SCHEMA-DUP-FIELDTYPE.XML, HYPHENATION.DTD, SCHEMA-SPELLCHECKER.XML, BAD-SCHEMA-NOT-INDEXED-BUT-TF.XML, SOLRCONFIG-MASTER3.XML, SCHEMA15.XML, SOLRCONFIG-NATIVELOCK.XML, SOLRCONFIG_CODEC.XML, SCHEMA-FOLDING.XML, SOLRCONFIG-MASTER.XML, WDFTYPES.TXT, SCHEMA-IB.XML, BAD-SCHEMA-NONTEXT-ANALYZER.XML, SOLRCONFIG-SPELLCHECKER.XML, SCHEMA-LUCENEMATCHVERSION.XML, SOLRCONFIG-CACHING.XML, SOLRCONFIG-ALTDIRECTORY.XML, OPEN-EXCHANGE-RATES.JSON, BAD-SCHEMA-OMIT-TF-BUT-NOT-POS.XML, SOLRCONFIG-PROPINJECT-INDEXDEFAULT.XML, SOLRCONFIG-REQHANDLER.INCL, SCHEMA-LMDIRICHLET.XML, MAPPING-ISOLATIN1ACCENT.TXT, SOLRCONFIG-SOLR-749.XML, SCHEMA_CODEC.XML, SOLRCONFIG-BASIC-LUCENEVERSION31.XML, DA_COMPOUNDDICTIONARY.TXT, STOPWORDSWRONGENCODING.TXT, SOLRCONFIG-MASTER1-KEEPONEBACKUP.XML, SOLRCONFIG-PHRASESUGGEST.XML, BAD-MP-SOLRCONFIG.XML, SOLRCONFIG-DELPOLICY1.XML, SOLRCONFIG-QUERYSENDER-NOQUERY.XML, STOPWITHBOM.TXT, SOLRCONFIG-PROPINJECT.XML, SYNONYMS.TXT, SOLRCONFIG-MERGEPOLICY.XML, SCHEMA-REPLICATION2.XML, SCHEMA12.XML, SCHEMA-TRIE.XML, SCHEMA-DFR.XML, SCHEMA-COLLATE.XML, STOPWORDS.TXT, SOLRCONFIG_PERF.XML, DA_UTF8.XML, SOLRCONFIG-LAZYWRITER.XML, SCHEMA-SIM.XML, OLD_SYNONYMS.TXT]
[junit4:junit4]   2> 1130 T1224 oass.SolrIndexSearcher.<init> Opening Searcher@35f7c58d main
[junit4:junit4]   2> 1130 T1224 oass.SolrIndexSearcher.getIndexDir WARNING WARNING: Directory impl does not support setting indexDir: org.apache.lucene.store.MockDirectoryWrapper
[junit4:junit4]   2> 1130 T1224 oasu.CommitTracker.<init> Hard AutoCommit: disabled
[junit4:junit4]   2> 1130 T1224 oasu.CommitTracker.<init> Soft AutoCommit: disabled
[junit4:junit4]   2> 1131 T1224 oashc.QueryElevationComponent.inform Loading QueryElevation from: /mnt/ssd/jenkins/workspace/Lucene-Solr-4.x-Linux-Java8-64/checkout/solr/build/solr-core/test-files/solr/collection1/conf/elevate.xml
[junit4:junit4]   2> 1135 T1224 oashc.QueryElevationComponent.inform Loading QueryElevation from: /mnt/ssd/jenkins/workspace/Lucene-Solr-4.x-Linux-Java8-64/checkout/solr/build/solr-core/test-files/solr/collection1/conf/elevate.xml
[junit4:junit4]   2> 1140 T1264 oasc.SolrCore.registerSearcher [collection1] Registered new searcher Searcher@35f7c58d main{StandardDirectoryReader(segments_1:1)}
[junit4:junit4]   2> 1140 T1224 oasc.CoreContainer.register registering core: collection1
[junit4:junit4]   2> 1141 T1224 oass.SolrDispatchFilter.init user.dir=/mnt/ssd/jenkins/workspace/Lucene-Solr-4.x-Linux-Java8-64/checkout/solr/build/solr-core/test/J0
[junit4:junit4]   2> 1141 T1224 oass.SolrDispatchFilter.init SolrDispatchFilter.init() done
[junit4:junit4]   2> 1141 T1224 oascsi.HttpClientUtil.createClient Creating new http client, config:maxConnections=128&maxConnectionsPerHost=32&followRedirects=false
[junit4:junit4]   2> ASYNC  NEW_CORE C111 name=collection1 org.apache.solr.core.SolrCore@1c1770a5
[junit4:junit4]   2> 1146 T1227 C111 oasu.DirectUpdateHandler2.deleteAll [collection1] REMOVING ALL DOCUMENTS FROM INDEX
[junit4:junit4]   2> 1147 T1227 C111 oasc.SolrDeletionPolicy.onInit SolrDeletionPolicy.onInit: commits:num=1
[junit4:junit4]   2> 		commit{dir=MockDirWrapper(org.apache.lucene.store.RAMDirectory@46e46f0b lockFactory=org.apache.lucene.store.SingleInstanceLockFactory@aba3bcb),segFN=segments_1,generation=1,filenames=[segments_1]
[junit4:junit4]   2> 1148 T1227 C111 oasc.SolrDeletionPolicy.updateCommits newest commit = 1
[junit4:junit4]   2> 1148 T1227 C111 UPDATE [collection1] webapp=/solr path=/update params={wt=javabin&version=2} {deleteByQuery=*:*} 0 2
[junit4:junit4]   2> ASYNC  NEW_CORE C112 name=collection1 org.apache.solr.core.SolrCore@b1ec840
[junit4:junit4]   2> 1152 T1237 C112 oasu.DirectUpdateHandler2.deleteAll [collection1] REMOVING ALL DOCUMENTS FROM INDEX
[junit4:junit4]   2> 1153 T1237 C112 oasc.SolrDeletionPolicy.onInit SolrDeletionPolicy.onInit: commits:num=1
[junit4:junit4]   2> 		commit{dir=MockDirWrapper(org.apache.lucene.store.RAMDirectory@11ece774 lockFactory=org.apache.lucene.store.SingleInstanceLockFactory@49c9c976),segFN=segments_1,generation=1,filenames=[segments_1]
[junit4:junit4]   2> 1153 T1237 C112 oasc.SolrDeletionPolicy.updateCommits newest commit = 1
[junit4:junit4]   2> 1159 T1237 C112 UPDATE [collection1] webapp=/solr path=/update params={wt=javabin&version=2} {deleteByQuery=*:*} 0 7
[junit4:junit4]   2> ASYNC  NEW_CORE C113 name=collection1 org.apache.solr.core.SolrCore@187d255c
[junit4:junit4]   2> 1162 T1248 C113 oasu.DirectUpdateHandler2.deleteAll [collection1] REMOVING ALL DOCUMENTS FROM INDEX
[junit4:junit4]   2> 1163 T1248 C113 oasc.SolrDeletionPolicy.onInit SolrDeletionPolicy.onInit: commits:num=1
[junit4:junit4]   2> 		commit{dir=MockDirWrapper(NRTCachingDirectory(org.apache.lucene.store.RAMDirectory@401fc793 lockFactory=org.apache.lucene.store.SingleInstanceLockFactory@8e9bb95; maxCacheMB=0.7041015625 maxMergeSizeMB=0.275390625)),segFN=segments_1,generation=1,filenames=[segments_1]
[junit4:junit4]   2> 1164 T1248 C113 oasc.SolrDeletionPolicy.updateCommits newest commit = 1
[junit4:junit4]   2> 1164 T1248 C113 UPDATE [collection1] webapp=/solr path=/update params={wt=javabin&version=2} {deleteByQuery=*:*} 0 2
[junit4:junit4]   2> ASYNC  NEW_CORE C114 name=collection1 org.apache.solr.core.SolrCore@3d5d7f3
[junit4:junit4]   2> 1166 T1257 C114 oasu.DirectUpdateHandler2.deleteAll [collection1] REMOVING ALL DOCUMENTS FROM INDEX
[junit4:junit4]   2> 1167 T1257 C114 oasc.SolrDeletionPolicy.onInit SolrDeletionPolicy.onInit: commits:num=1
[junit4:junit4]   2> 		commit{dir=MockDirWrapper(org.apache.lucene.store.RAMDirectory@4c54947c lockFactory=org.apache.lucene.store.SingleInstanceLockFactory@6ef633d9),segFN=segments_1,generation=1,filenames=[segments_1]
[junit4:junit4]   2> 1167 T1257 C114 oasc.SolrDeletionPolicy.updateCommits newest commit = 1
[junit4:junit4]   2> 1168 T1257 C114 UPDATE [collection1] webapp=/solr path=/update params={wt=javabin&version=2} {deleteByQuery=*:*} 0 2
[junit4:junit4]   2> 1170 T1227 C111 UPDATE [collection1] webapp=/solr path=/update params={wt=javabin&version=2} {add=[1]} 0 1
[junit4:junit4]   2> 1172 T1237 C112 UPDATE [collection1] webapp=/solr path=/update params={wt=javabin&version=2} {add=[1]} 0 0
[junit4:junit4]   2> 1174 T1227 C111 UPDATE [collection1] webapp=/solr path=/update params={wt=javabin&version=2} {add=[2]} 0 0
[junit4:junit4]   2> 1176 T1248 C113 UPDATE [collection1] webapp=/solr path=/update params={wt=javabin&version=2} {add=[2]} 0 0
[junit4:junit4]   2> 1178 T1227 C111 UPDATE [collection1] webapp=/solr path=/update params={wt=javabin&version=2} {add=[3]} 0 0
[junit4:junit4]   2> 1180 T1257 C114 UPDATE [collection1] webapp=/solr path=/update params={wt=javabin&version=2} {add=[3]} 0 0
[junit4:junit4]   2> 1182 T1227 C111 UPDATE [collection1] webapp=/solr path=/update params={wt=javabin&version=2} {add=[4]} 0 1
[junit4:junit4]   2> 1184 T1237 C112 UPDATE [collection1] webapp=/solr path=/update params={wt=javabin&version=2} {add=[4]} 0 0
[junit4:junit4]   2> 1185 T1227 C111 UPDATE [collection1] webapp=/solr path=/update params={wt=javabin&version=2} {add=[5]} 0 0
[junit4:junit4]   2> 1187 T1248 C113 UPDATE [collection1] webapp=/solr path=/update params={wt=javabin&version=2} {add=[5]} 0 0
[junit4:junit4]   2> 1189 T1227 C111 UPDATE [collection1] webapp=/solr path=/update params={wt=javabin&version=2} {add=[6]} 0 1
[junit4:junit4]   2> 1190 T1257 C114 UPDATE [collection1] webapp=/solr path=/update params={wt=javabin&version=2} {add=[6]} 0 0
[junit4:junit4]   2> 1192 T1227 C111 UPDATE [collection1] webapp=/solr path=/update params={wt=javabin&version=2} {add=[7]} 0 0
[junit4:junit4]   2> 1194 T1257 C114 UPDATE [collection1] webapp=/solr path=/update params={wt=javabin&version=2} {add=[7]} 0 0
[junit4:junit4]   2> 1195 T1227 C111 oasu.DirectUpdateHandler2.commit start commit{flags=0,version=0,optimize=false,openSearcher=true,waitSearcher=true,expungeDeletes=false,softCommit=false}
[junit4:junit4]   2> 1196 T1227 C111 oasc.SolrDeletionPolicy.onCommit SolrDeletionPolicy.onCommit: commits:num=2
[junit4:junit4]   2> 		commit{dir=MockDirWrapper(org.apache.lucene.store.RAMDirectory@46e46f0b lockFactory=org.apache.lucene.store.SingleInstanceLockFactory@aba3bcb),segFN=segments_1,generation=1,filenames=[segments_1]
[junit4:junit4]   2> 		commit{dir=MockDirWrapper(org.apache.lucene.store.RAMDirectory@46e46f0b lockFactory=org.apache.lucene.store.SingleInstanceLockFactory@aba3bcb),segFN=segments_2,generation=2,filenames=[_0_Lucene40_0.tim, _0.fnm, _0_nrm.cfs, _0.si, _0_Lucene40_0.prx, _0_nrm.cfe, segments_2, _0.fdt, _0_Lucene40_0.tip, _0_Lucene40_0.frq, _0.fdx]
[junit4:junit4]   2> 1196 T1227 C111 oasc.SolrDeletionPolicy.updateCommits newest commit = 2
[junit4:junit4]   2> 1197 T1227 C111 oass.SolrIndexSearcher.<init> Opening Searcher@120429f3 main
[junit4:junit4]   2> 1197 T1227 C111 oass.SolrIndexSearcher.getIndexDir WARNING WARNING: Directory impl does not support setting indexDir: org.apache.lucene.store.MockDirectoryWrapper
[junit4:junit4]   2> 1197 T1227 C111 oasu.DirectUpdateHandler2.commit end_commit_flush
[junit4:junit4]   2> 1198 T1234 oasc.SolrCore.registerSearcher [collection1] Registered new searcher Searcher@120429f3 main{StandardDirectoryReader(segments_2:4 _0(4.0):C7)}
[junit4:junit4]   2> 1198 T1227 C111 UPDATE [collection1] webapp=/solr path=/update params={commit=true&wt=javabin&version=2&waitSearcher=true&softCommit=false} {commit=} 0 3
[junit4:junit4]   2> 1200 T1237 C112 oasu.DirectUpdateHandler2.commit start commit{flags=0,version=0,optimize=false,openSearcher=true,waitSearcher=true,expungeDeletes=false,softCommit=false}
[junit4:junit4]   2> 1200 T1237 C112 oasc.SolrDeletionPolicy.onCommit SolrDeletionPolicy.onCommit: commits:num=2
[junit4:junit4]   2> 		commit{dir=MockDirWrapper(org.apache.lucene.store.RAMDirectory@11ece774 lockFactory=org.apache.lucene.store.SingleInstanceLockFactory@49c9c976),segFN=segments_1,generation=1,filenames=[segments_1]
[junit4:junit4]   2> 		commit{dir=MockDirWrapper(org.apache.lucene.store.RAMDirectory@11ece774 lockFactory=org.apache.lucene.store.SingleInstanceLockFactory@49c9c976),segFN=segments_2,generation=2,filenames=[_0_Lucene40_0.tim, _0.fnm, _0_nrm.cfs, _0.si, _0_Lucene40_0.prx, _0_nrm.cfe, segments_2, _0.fdt, _0_Lucene40_0.tip, _0_Lucene40_0.frq, _0.fdx]
[junit4:junit4]   2> 1200 T1237 C112 oasc.SolrDeletionPolicy.updateCommits newest commit = 2
[junit4:junit4]   2> 1201 T1237 C112 oass.SolrIndexSearcher.<init> Opening Searcher@491bcad7 main
[junit4:junit4]   2> 1201 T1237 C112 oass.SolrIndexSearcher.getIndexDir WARNING WARNING: Directory impl does not support setting indexDir: org.apache.lucene.store.MockDirectoryWrapper
[junit4:junit4]   2> 1201 T1237 C112 oasu.DirectUpdateHandler2.commit end_commit_flush
[junit4:junit4]   2> 1201 T1244 oasc.SolrCore.registerSearcher [collection1] Registered new searcher Searcher@491bcad7 main{StandardDirectoryReader(segments_2:4 _0(4.0):C2)}
[junit4:junit4]   2> 1202 T1237 C112 UPDATE [collection1] webapp=/solr path=/update params={commit=true&wt=javabin&version=2&waitSearcher=true&softCommit=false} {commit=} 0 2
[junit4:junit4]   2> 1203 T1248 C113 oasu.DirectUpdateHandler2.commit start commit{flags=0,version=0,optimize=false,openSearcher=true,waitSearcher=true,expungeDeletes=false,softCommit=false}
[junit4:junit4]   2> 1204 T1248 C113 oasc.SolrDeletionPolicy.onCommit SolrDeletionPolicy.onCommit: commits:num=2
[junit4:junit4]   2> 		commit{dir=MockDirWrapper(NRTCachingDirectory(org.apache.lucene.store.RAMDirectory@401fc793 lockFactory=org.apache.lucene.store.SingleInstanceLockFactory@8e9bb95; maxCacheMB=0.7041015625 maxMergeSizeMB=0.275390625)),segFN=segments_1,generation=1,filenames=[segments_1]
[junit4:junit4]   2> 		commit{dir=MockDirWrapper(NRTCachingDirectory(org.apache.lucene.store.RAMDirectory@401fc793 lockFactory=org.apache.lucene.store.SingleInstanceLockFactory@8e9bb95; maxCacheMB=0.7041015625 maxMergeSizeMB=0.275390625)),segFN=segments_2,generation=2,filenames=[_0_Lucene40_0.tim, _0.fnm, _0_nrm.cfs, _0.si, _0_Lucene40_0.prx, _0_nrm.cfe, segments_2, _0.fdt, _0_Lucene40_0.tip, _0_Lucene40_0.frq, _0.fdx]
[junit4:junit4]   2> 1204 T1248 C113 oasc.SolrDeletionPolicy.updateCommits newest commit = 2
[junit4:junit4]   2> 1205 T1248 C113 oass.SolrIndexSearcher.<init> Opening Searcher@19cfb317 main
[junit4:junit4]   2> 1205 T1248 C113 oass.SolrIndexSearcher.getIndexDir WARNING WARNING: Directory impl does not support setting indexDir: org.apache.lucene.store.MockDirectoryWrapper
[junit4:junit4]   2> 1205 T1248 C113 oasu.DirectUpdateHandler2.commit end_commit_flush
[junit4:junit4]   2> 1206 T1254 oasc.SolrCore.registerSearcher [collection1] Registered new searcher Searcher@19cfb317 main{StandardDirectoryReader(segments_2:4 _0(4.0):C2)}
[junit4:junit4]   2> 1206 T1248 C113 UPDATE [collection1] webapp=/solr path=/update params={commit=true&wt=javabin&version=2&waitSearcher=true&softCommit=false} {commit=} 0 3
[junit4:junit4]   2> 1208 T1257 C114 oasu.DirectUpdateHandler2.commit start commit{flags=0,version=0,optimize=false,openSearcher=true,waitSearcher=true,expungeDeletes=false,softCommit=false}
[junit4:junit4]   2> 1209 T1257 C114 oasc.SolrDeletionPolicy.onCommit SolrDeletionPolicy.onCommit: commits:num=2
[junit4:junit4]   2> 		commit{dir=MockDirWrapper(org.apache.lucene.store.RAMDirectory@4c54947c lockFactory=org.apache.lucene.store.SingleInstanceLockFactory@6ef633d9),segFN=segments_1,generation=1,filenames=[segments_1]
[junit4:junit4]   2> 		commit{dir=MockDirWrapper(org.apache.lucene.store.RAMDirectory@4c54947c lockFactory=org.apache.lucene.store.SingleInstanceLockFactory@6ef633d9),segFN=segments_2,generation=2,filenames=[_0_Lucene40_0.tim, _0.fnm, _0_nrm.cfs, _0.si, _0_Lucene40_0.prx, _0_nrm.cfe, segments_2, _0.fdt, _0_Lucene40_0.tip, _0_Lucene40_0.frq, _0.fdx]
[junit4:junit4]   2> 1209 T1257 C114 oasc.SolrDeletionPolicy.updateCommits newest commit = 2
[junit4:junit4]   2> 1210 T1257 C114 oass.SolrIndexSearcher.<init> Opening Searcher@4e1c1bf1 main
[junit4:junit4]   2> 1210 T1257 C114 oass.SolrIndexSearcher.getIndexDir WARNING WARNING: Directory impl does not support setting indexDir: org.apache.lucene.store.MockDirectoryWrapper
[junit4:junit4]   2> 1210 T1257 C114 oasu.DirectUpdateHandler2.commit end_commit_flush
[junit4:junit4]   2> 1211 T1264 oasc.SolrCore.registerSearcher [collection1] Registered new searcher Searcher@4e1c1bf1 main{StandardDirectoryReader(segments_2:4 _0(4.0):C3)}
[junit4:junit4]   2> 1211 T1257 C114 UPDATE [collection1] webapp=/solr path=/update params={commit=true&wt=javabin&version=2&waitSearcher=true&softCommit=false} {commit=} 0 3
[junit4:junit4]   2> 1213 T1227 C111 REQ [collection1] webapp=/solr path=/elevate params={wt=javabin&rows=500&sort=id+desc&shards.qt=/elevate&qt=/elevate&fl=id,+score,+[elevated]&distrib=false&version=2&q=*:*} hits=7 status=0 QTime=0 
[junit4:junit4]   2> 1219 T1238 C112 REQ [collection1] webapp=/solr path=/elevate params={wt=javabin&rows=500&fsv=true&sort=id+desc&isShard=true&NOW=1341764435969&distrib=false&q=*:*&shard.url=localhost:34781/solr&shards.qt=/elevate&qt=/elevate&fl=id,score&version=2&start=0} hits=2 status=0 QTime=0 
[junit4:junit4]   2> 1219 T1249 C113 REQ [collection1] webapp=/solr path=/elevate params={wt=javabin&rows=500&fsv=true&sort=id+desc&isShard=true&NOW=1341764435969&distrib=false&q=*:*&shard.url=localhost:59595/solr&shards.qt=/elevate&qt=/elevate&fl=id,score&version=2&start=0} hits=2 status=0 QTime=0 
[junit4:junit4]   2> 1227 T1258 C114 REQ [collection1] webapp=/solr path=/elevate params={wt=javabin&rows=500&fsv=true&sort=id+desc&isShard=true&NOW=1341764435969&distrib=false&q=*:*&shard.url=localhost:40321/solr|[::1]:33332/solr&shards.qt=/elevate&qt=/elevate&fl=id,score&version=2&start=0} hits=3 status=0 QTime=1 
[junit4:junit4]   2> 1229 T1249 C113 REQ [collection1] webapp=/solr path=/elevate params={wt=javabin&rows=500&isShard=true&NOW=1341764435969&distrib=false&q=*:*&shard.url=localhost:59595/solr&shards.qt=/elevate&qt=/elevate&fl=id,+score,+[elevated]&ids=2.0,5.0&version=2} status=0 QTime=0 
[junit4:junit4]   2> 1229 T1258 C114 REQ [collection1] webapp=/solr path=/elevate params={wt=javabin&rows=500&isShard=true&NOW=1341764435969&distrib=false&q=*:*&shard.url=localhost:40321/solr|[::1]:33332/solr&shards.qt=/elevate&qt=/elevate&fl=id,+score,+[elevated]&ids=3.0,6.0,7.0&version=2} status=0 QTime=0 
[junit4:junit4]   2> 1229 T1238 C112 REQ [collection1] webapp=/solr path=/elevate params={wt=javabin&rows=500&isShard=true&NOW=1341764435969&distrib=false&q=*:*&shard.url=localhost:34781/solr&shards.qt=/elevate&qt=/elevate&fl=id,+score,+[elevated]&ids=1.0,4.0&version=2} status=0 QTime=0 
[junit4:junit4]   2> 1230 T1237 C112 REQ [collection1] webapp=/solr path=/elevate params={wt=javabin&rows=500&sort=id+desc&shards.qt=/elevate&qt=/elevate&shards=localhost:34781/solr,localhost:59595/solr,localhost:40321/solr|[::1]:33332/solr&fl=id,+score,+[elevated]&version=2&q=*:*} status=0 QTime=15 
[junit4:junit4]   2> 1231 T1224 oasc.CoreContainer.shutdown Shutting down CoreContainer instance=1531557251
[junit4:junit4]   2> 1231 T1224 oasc.SolrCore.close [collection1]  CLOSING SolrCore org.apache.solr.core.SolrCore@1c1770a5
[junit4:junit4]   2> 1232 T1224 oasc.SolrCore.closeSearcher [collection1] Closing main searcher on request.
[junit4:junit4]   2> 1232 T1224 oasu.DirectUpdateHandler2.close closing DirectUpdateHandler2{commits=1,autocommits=0,soft autocommits=0,optimizes=0,rollbacks=0,expungeDeletes=0,docsPending=0,adds=0,deletesById=0,deletesByQuery=0,errors=0,cumulative_adds=7,cumulative_deletesById=0,cumulative_deletesByQuery=1,cumulative_errors=0}
[junit4:junit4]   2> 1234 T1224 oejsh.ContextHandler.doStop stopped o.e.j.s.ServletContextHandler{/solr,null}
[junit4:junit4]   2> 1288 T1224 oasc.CoreContainer.shutdown Shutting down CoreContainer instance=1954000053
[junit4:junit4]   2> 1288 T1224 oasc.SolrCore.close [collection1]  CLOSING SolrCore org.apache.solr.core.SolrCore@b1ec840
[junit4:junit4]   2> 1289 T1224 oasc.SolrCore.closeSearcher [collection1] Closing main searcher on request.
[junit4:junit4]   2> 1289 T1224 oasu.DirectUpdateHandler2.close closing DirectUpdateHandler2{commits=1,autocommits=0,soft autocommits=0,optimizes=0,rollbacks=0,expungeDeletes=0,docsPending=0,adds=0,deletesById=0,deletesByQuery=0,errors=0,cumulative_adds=2,cumulative_deletesById=0,cumulative_deletesByQuery=1,cumulative_errors=0}
[junit4:junit4]   2> 1291 T1224 oejsh.ContextHandler.doStop stopped o.e.j.s.ServletContextHandler{/solr,null}
[junit4:junit4]   2> 1342 T1224 oasc.CoreContainer.shutdown Shutting down CoreContainer instance=1097031299
[junit4:junit4]   2> 1343 T1224 oasc.SolrCore.close [collection1]  CLOSING SolrCore org.apache.solr.core.SolrCore@187d255c
[junit4:junit4]   2> 1343 T1224 oasc.SolrCore.closeSearcher [collection1] Closing main searcher on request.
[junit4:junit4]   2> 1343 T1224 oasu.DirectUpdateHandler2.close closing DirectUpdateHandler2{commits=1,autocommits=0,soft autocommits=0,optimizes=0,rollbacks=0,expungeDeletes=0,docsPending=0,adds=0,deletesById=0,deletesByQuery=0,errors=0,cumulative_adds=2,cumulative_deletesById=0,cumulative_deletesByQuery=1,cumulative_errors=0}
[junit4:junit4]   2> 1345 T1224 oejsh.ContextHandler.doStop stopped o.e.j.s.ServletContextHandler{/solr,null}
[junit4:junit4]   2> 1397 T1224 oasc.CoreContainer.shutdown Shutting down CoreContainer instance=1443082064
[junit4:junit4]   2> 1398 T1224 oasc.SolrCore.close [collection1]  CLOSING SolrCore org.apache.solr.core.SolrCore@3d5d7f3
[junit4:junit4]   2> 1398 T1224 oasc.SolrCore.closeSearcher [collection1] Closing main searcher on request.
[junit4:junit4]   2> 1398 T1224 oasu.DirectUpdateHandler2.close closing DirectUpdateHandler2{commits=1,autocommits=0,soft autocommits=0,optimizes=0,rollbacks=0,expungeDeletes=0,docsPending=0,adds=0,deletesById=0,deletesByQuery=0,errors=0,cumulative_adds=3,cumulative_deletesById=0,cumulative_deletesByQuery=1,cumulative_errors=0}
[junit4:junit4]   2> 1400 T1224 oejsh.ContextHandler.doStop stopped o.e.j.s.ServletContextHandler{/solr,null}
[junit4:junit4]   2> 1452 T1224 oas.SolrTestCaseJ4.tearDown ###Ending testDistribSearch
[junit4:junit4]   2> NOTE: reproduce with: ant test  -Dtestcase=DistributedQueryElevationComponentTest -Dtests.method=testDistribSearch -Dtests.seed=78F5428526CDF64 -Dtests.multiplier=3 -Dtests.slow=true -Dtests.locale=ms -Dtests.timezone=Asia/Bishkek -Dtests.file.encoding=UTF-8
[junit4:junit4]   2>
[junit4:junit4]    > (@AfterClass output)
[junit4:junit4]   2> 1488 T1224 oas.SolrTestCaseJ4.deleteCore ###deleteCore
[junit4:junit4]   2> NOTE: test params are: codec=Lucene40: {}, sim=RandomSimilarityProvider(queryNorm=true,coord=true): {}, locale=ms, timezone=Asia/Bishkek
[junit4:junit4]   2> NOTE: Linux 3.2.0-26-generic amd64/Oracle Corporation 1.8.0-ea (64-bit)/cpus=8,threads=1,free=186895640,total=345440256
[junit4:junit4]   2> NOTE: All tests run in this JVM: [TestBM25SimilarityFactory, TestFiltering, TestPortugueseStemFilterFactory, RequiredFieldsTest, DateMathParserTest, PrimitiveFieldTypeTest, TestCapitalizationFilterFactory, PingRequestHandlerTest, SolrCoreCheckLockOnStartupTest, RequestHandlersTest, TestBulgarianStemFilterFactory, TestUpdate, TestBadConfig, TestReversedWildcardFilterFactory, CurrencyFieldTest, TestDictionaryCompoundWordTokenFilterFactory, TestDistributedGrouping, TestJoin, TestDFRSimilarityFactory, SolrIndexConfigTest, EchoParamsTest, TestQueryUtils, UpdateRequestProcessorFactoryTest, TestPHPSerializedResponseWriter, TestMappingCharFilterFactory, TestPropInject, TestCollationKeyRangeQueries, DoubleMetaphoneFilterFactoryTest, TestSolrQueryParser, SystemInfoHandlerTest, QueryElevationComponentTest, OpenExchangeRatesOrgProviderTest, TestFinnishLightStemFilterFactory, CacheHeaderTest, CoreAdminHandlerTest, TestIndexingPerformance, TestJapanesePartOfSpeechStopFilterFactory, TestSolrCoreProperties, TestFoldingMultitermQuery, TestPatternReplaceCharFilterFactory, BasicDistributedZkTest, MoreLikeThisHandlerTest, TestIrishLowerCaseFilterFactory, SuggesterTSTTest, TestItalianLightStemFilterFactory, TestExtendedDismaxParser, TestRandomFaceting, TestSurroundQueryParser, NumericFieldsTest, ShowFileRequestHandlerTest, SpatialFilterTest, TestHashPartitioner, DateFieldTest, DOMUtilTest, SolrRequestParserTest, FastVectorHighlighterTest, TestThaiWordFilterFactory, SimpleFacetsTest, TestStandardFactories, DefaultValueUpdateProcessorTest, TestTrimFilterFactory, TestStressLucene, TestFaceting, SuggesterTest, SnowballPorterFilterFactoryTest, TestSpanishLightStemFilterFactory, TestDelimitedPayloadTokenFilterFactory, TestFunctionQuery, CopyFieldTest, FileUtilsTest, DirectSolrSpellCheckerTest, PluginInfoTest, LeaderElectionTest, SoftAutoCommitTest, AutoCommitTest, ZkSolrClientTest, StatsComponentTest, TestRecovery, ConvertedLegacyTest, SortByFunctionTest, SignatureUpdateProcessorFactoryTest, TestBinaryResponseWriter, HighlighterTest, TestTrie, TestCSVLoader, MBeansHandlerTest, DistributedQueryElevationComponentTest]
[junit4:junit4]   2> 
[junit4:junit4] Completed on J0 in 1.52s, 1 test, 1 error <<< FAILURES!

[...truncated 331 lines...]
BUILD FAILED
/mnt/ssd/jenkins/workspace/Lucene-Solr-4.x-Linux-Java8-64/checkout/build.xml:29: The following error occurred while executing this line:
/mnt/ssd/jenkins/workspace/Lucene-Solr-4.x-Linux-Java8-64/checkout/solr/build.xml:144: The following error occurred while executing this line:
/mnt/ssd/jenkins/workspace/Lucene-Solr-4.x-Linux-Java8-64/checkout/lucene/module-build.xml:62: The following error occurred while executing this line:
/mnt/ssd/jenkins/workspace/Lucene-Solr-4.x-Linux-Java8-64/checkout/lucene/common-build.xml:1095: The following error occurred while executing this line:
/mnt/ssd/jenkins/workspace/Lucene-Solr-4.x-Linux-Java8-64/checkout/lucene/common-build.xml:792: There were test failures: 298 suites, 1057 tests, 2 errors, 5 ignored

Total time: 21 minutes 18 seconds
Build step 'Execute shell' marked build as failure
Archiving artifacts
Recording test results
Email was triggered for: Failure
Sending email for trigger: Failure




Mime
View raw message