lucene-dev mailing list archives

Site index · List index
Message view « Date » · « Thread »
Top « Date » · « Thread »
From Policeman Jenkins Server <jenk...@sd-datasolutions.de>
Subject [JENKINS] Lucene-Solr-4.x-Windows-Java6-64 - Build # 304 - Failure!
Date Wed, 11 Jul 2012 16:59:43 GMT
Build: http://jenkins.sd-datasolutions.de/job/Lucene-Solr-4.x-Windows-Java6-64/304/

1 tests failed.
REGRESSION:  org.apache.solr.spelling.suggest.SuggesterFSTTest.testSuggestions

Error Message:
Exception during query

Stack Trace:
java.lang.RuntimeException: Exception during query
	at __randomizedtesting.SeedInfo.seed([F9183C5331C7F320:5FC405A6FFF3A4DE]:0)
	at org.apache.solr.SolrTestCaseJ4.assertQ(SolrTestCaseJ4.java:487)
	at org.apache.solr.SolrTestCaseJ4.assertQ(SolrTestCaseJ4.java:454)
	at org.apache.solr.spelling.suggest.SuggesterTest.testSuggestions(SuggesterTest.java:71)
	at sun.reflect.NativeMethodAccessorImpl.invoke0(Native Method)
	at sun.reflect.NativeMethodAccessorImpl.invoke(NativeMethodAccessorImpl.java:39)
	at sun.reflect.DelegatingMethodAccessorImpl.invoke(DelegatingMethodAccessorImpl.java:25)
	at java.lang.reflect.Method.invoke(Method.java:597)
	at com.carrotsearch.randomizedtesting.RandomizedRunner.invoke(RandomizedRunner.java:1995)
	at com.carrotsearch.randomizedtesting.RandomizedRunner.access$1100(RandomizedRunner.java:132)
	at com.carrotsearch.randomizedtesting.RandomizedRunner$6.evaluate(RandomizedRunner.java:818)
	at com.carrotsearch.randomizedtesting.RandomizedRunner$7.evaluate(RandomizedRunner.java:877)
	at com.carrotsearch.randomizedtesting.RandomizedRunner$8.evaluate(RandomizedRunner.java:891)
	at com.carrotsearch.randomizedtesting.rules.SystemPropertiesRestoreRule$1.evaluate(SystemPropertiesRestoreRule.java:53)
	at org.apache.lucene.util.TestRuleSetupTeardownChained$1.evaluate(TestRuleSetupTeardownChained.java:50)
	at org.apache.lucene.util.TestRuleFieldCacheSanity$1.evaluate(TestRuleFieldCacheSanity.java:32)
	at org.apache.lucene.util.AbstractBeforeAfterRule$1.evaluate(AbstractBeforeAfterRule.java:45)
	at com.carrotsearch.randomizedtesting.rules.SystemPropertiesInvariantRule$1.evaluate(SystemPropertiesInvariantRule.java:55)
	at org.apache.lucene.util.TestRuleReportUncaughtExceptions$1.evaluate(TestRuleReportUncaughtExceptions.java:68)
	at org.apache.lucene.util.TestRuleThreadAndTestName$1.evaluate(TestRuleThreadAndTestName.java:48)
	at org.apache.lucene.util.TestRuleIgnoreAfterMaxFailures$1.evaluate(TestRuleIgnoreAfterMaxFailures.java:70)
	at org.apache.lucene.util.TestRuleMarkFailure$1.evaluate(TestRuleMarkFailure.java:48)
	at com.carrotsearch.randomizedtesting.RandomizedRunner.runSingleTest(RandomizedRunner.java:825)
	at com.carrotsearch.randomizedtesting.RandomizedRunner.access$700(RandomizedRunner.java:132)
	at com.carrotsearch.randomizedtesting.RandomizedRunner$3$1.run(RandomizedRunner.java:671)
	at com.carrotsearch.randomizedtesting.RandomizedRunner$3.evaluate(RandomizedRunner.java:697)
	at com.carrotsearch.randomizedtesting.RandomizedRunner$4.evaluate(RandomizedRunner.java:736)
	at com.carrotsearch.randomizedtesting.RandomizedRunner$5.evaluate(RandomizedRunner.java:747)
	at com.carrotsearch.randomizedtesting.rules.SystemPropertiesRestoreRule$1.evaluate(SystemPropertiesRestoreRule.java:53)
	at org.apache.lucene.util.AbstractBeforeAfterRule$1.evaluate(AbstractBeforeAfterRule.java:45)
	at org.apache.lucene.util.TestRuleReportUncaughtExceptions$1.evaluate(TestRuleReportUncaughtExceptions.java:68)
	at org.apache.lucene.util.TestRuleStoreClassName$1.evaluate(TestRuleStoreClassName.java:38)
	at org.apache.lucene.util.TestRuleIcuHack$1.evaluate(TestRuleIcuHack.java:51)
	at com.carrotsearch.randomizedtesting.rules.SystemPropertiesInvariantRule$1.evaluate(SystemPropertiesInvariantRule.java:55)
	at org.apache.lucene.util.TestRuleNoInstanceHooksOverrides$1.evaluate(TestRuleNoInstanceHooksOverrides.java:53)
	at org.apache.lucene.util.TestRuleNoStaticHooksShadowing$1.evaluate(TestRuleNoStaticHooksShadowing.java:52)
	at org.apache.lucene.util.TestRuleAssertionsRequired$1.evaluate(TestRuleAssertionsRequired.java:36)
	at org.apache.lucene.util.TestRuleMarkFailure$1.evaluate(TestRuleMarkFailure.java:48)
	at org.apache.lucene.util.TestRuleIgnoreAfterMaxFailures$1.evaluate(TestRuleIgnoreAfterMaxFailures.java:70)
	at org.apache.lucene.util.TestRuleIgnoreTestSuites$1.evaluate(TestRuleIgnoreTestSuites.java:55)
	at com.carrotsearch.randomizedtesting.RandomizedRunner.runSuite(RandomizedRunner.java:605)
	at com.carrotsearch.randomizedtesting.RandomizedRunner.access$400(RandomizedRunner.java:132)
	at com.carrotsearch.randomizedtesting.RandomizedRunner$2.run(RandomizedRunner.java:551)
Caused by: java.lang.NullPointerException
	at org.apache.lucene.search.suggest.fst.FSTCompletionLookup.lookup(FSTCompletionLookup.java:240)
	at org.apache.solr.spelling.suggest.Suggester.getSuggestions(Suggester.java:188)
	at org.apache.solr.handler.component.SpellCheckComponent.process(SpellCheckComponent.java:172)
	at org.apache.solr.handler.component.SearchHandler.handleRequestBody(SearchHandler.java:206)
	at org.apache.solr.handler.RequestHandlerBase.handleRequest(RequestHandlerBase.java:129)
	at org.apache.solr.core.SolrCore.execute(SolrCore.java:1619)
	at org.apache.solr.util.TestHarness.query(TestHarness.java:330)
	at org.apache.solr.util.TestHarness.query(TestHarness.java:313)
	at org.apache.solr.SolrTestCaseJ4.assertQ(SolrTestCaseJ4.java:461)
	... 41 more




Build Log:
[...truncated 9751 lines...]
[junit4:junit4] Suite: org.apache.solr.spelling.suggest.SuggesterFSTTest
[junit4:junit4]    > (@BeforeClass output)
[junit4:junit4]   2> 0 T840 oas.SolrTestCaseJ4.initCore ####initCore
[junit4:junit4]   2> Creating dataDir: C:\Jenkins\workspace\Lucene-Solr-4.x-Windows-Java6-64\solr\build\solr-core\test\J0\.\solrtest-SuggesterFSTTest-1342025223779
[junit4:junit4]   2> 1 T840 oasc.SolrResourceLoader.<init> new SolrResourceLoader
for directory: 'C:\Jenkins\workspace\Lucene-Solr-4.x-Windows-Java6-64\solr\build\solr-core\test-files\solr\collection1\'
[junit4:junit4]   2> 1 T840 oasc.SolrResourceLoader.replaceClassLoader Adding 'file:/C:/Jenkins/workspace/Lucene-Solr-4.x-Windows-Java6-64/solr/build/solr-core/test-files/solr/collection1/lib/classes/'
to classloader
[junit4:junit4]   2> 1 T840 oasc.SolrResourceLoader.replaceClassLoader Adding 'file:/C:/Jenkins/workspace/Lucene-Solr-4.x-Windows-Java6-64/solr/build/solr-core/test-files/solr/collection1/lib/README'
to classloader
[junit4:junit4]   2> 36 T840 oasc.SolrConfig.<init> Using Lucene MatchVersion: LUCENE_40
[junit4:junit4]   2> 104 T840 oasc.SolrConfig.<init> Loaded SolrConfig: solrconfig-spellchecker.xml
[junit4:junit4]   2> 105 T840 oass.IndexSchema.readSchema Reading Solr Schema
[junit4:junit4]   2> 109 T840 oass.IndexSchema.readSchema Schema name=Solr SpellCheck Test
[junit4:junit4]   2> 240 T840 oass.IndexSchema.readSchema default search field in schema
is text
[junit4:junit4]   2> 242 T840 oass.IndexSchema.readSchema query parser default operator
is OR
[junit4:junit4]   2> 243 T840 oass.IndexSchema.readSchema unique key field: id
[junit4:junit4]   2> 247 T840 oasc.SolrResourceLoader.locateSolrHome JNDI not configured
for solr (NoInitialContextEx)
[junit4:junit4]   2> 247 T840 oasc.SolrResourceLoader.locateSolrHome using system property
solr.solr.home: C:\Jenkins\workspace\Lucene-Solr-4.x-Windows-Java6-64\solr\build\solr-core\test-files\solr
[junit4:junit4]   2> 248 T840 oasc.SolrResourceLoader.<init> new SolrResourceLoader
for directory: 'C:\Jenkins\workspace\Lucene-Solr-4.x-Windows-Java6-64\solr\build\solr-core\test-files\solr\'
[junit4:junit4]   2> 248 T840 oasc.CoreContainer.<init> New CoreContainer 213255413
[junit4:junit4]   2> 248 T840 oasc.SolrCore.<init> [collection1] Opening new SolrCore
at C:\Jenkins\workspace\Lucene-Solr-4.x-Windows-Java6-64\solr\build\solr-core\test-files\solr\collection1\,
dataDir=C:\Jenkins\workspace\Lucene-Solr-4.x-Windows-Java6-64\solr\build\solr-core\test\J0\.\solrtest-SuggesterFSTTest-1342025223779\
[junit4:junit4]   2> 248 T840 oasc.SolrCore.<init> JMX monitoring not detected for
core: collection1
[junit4:junit4]   2> 249 T840 oasc.SolrCore.getNewIndexDir WARNING New index directory
detected: old=null new=C:\Jenkins\workspace\Lucene-Solr-4.x-Windows-Java6-64\solr\build\solr-core\test\J0\.\solrtest-SuggesterFSTTest-1342025223779\index/
[junit4:junit4]   2> 249 T840 oasc.SolrCore.initIndex WARNING [collection1] Solr index
directory 'C:\Jenkins\workspace\Lucene-Solr-4.x-Windows-Java6-64\solr\build\solr-core\test\J0\.\solrtest-SuggesterFSTTest-1342025223779\index'
doesn't exist. Creating new index...
[junit4:junit4]   2> 277 T840 oasc.SolrDeletionPolicy.onCommit SolrDeletionPolicy.onCommit:
commits:num=1
[junit4:junit4]   2> 		commit{dir=MockDirWrapper(org.apache.lucene.store.SimpleFSDirectory@C:\Jenkins\workspace\Lucene-Solr-4.x-Windows-Java6-64\solr\build\solr-core\test\J0\solrtest-SuggesterFSTTest-1342025223779\index
lockFactory=org.apache.lucene.store.NativeFSLockFactory@2af4336e),segFN=segments_1,generation=1,filenames=[segments_1]
[junit4:junit4]   2> 277 T840 oasc.SolrDeletionPolicy.updateCommits newest commit = 1
[junit4:junit4]   2> 278 T840 oasc.RequestHandlers.initHandlersFromConfig created standard:
solr.StandardRequestHandler
[junit4:junit4]   2> 278 T840 oasc.RequestHandlers.initHandlersFromConfig created /suggest:
org.apache.solr.handler.component.SearchHandler
[junit4:junit4]   2> 278 T840 oasc.RequestHandlers.initHandlersFromConfig created /suggest_tst:
org.apache.solr.handler.component.SearchHandler
[junit4:junit4]   2> 278 T840 oasc.RequestHandlers.initHandlersFromConfig created /suggest_fst:
org.apache.solr.handler.component.SearchHandler
[junit4:junit4]   2> 278 T840 oasc.RequestHandlers.initHandlersFromConfig created /suggest_wfst:
org.apache.solr.handler.component.SearchHandler
[junit4:junit4]   2> 290 T840 oass.SolrIndexSearcher.<init> Opening Searcher@7d15266
main
[junit4:junit4]   2> 290 T840 oass.SolrIndexSearcher.getIndexDir WARNING WARNING: Directory
impl does not support setting indexDir: org.apache.lucene.store.MockDirectoryWrapper
[junit4:junit4]   2> 290 T840 oasu.CommitTracker.<init> Hard AutoCommit: disabled
[junit4:junit4]   2> 291 T840 oasu.CommitTracker.<init> Soft AutoCommit: disabled
[junit4:junit4]   2> 291 T840 oashc.SpellCheckComponent.inform Initializing spell checkers
[junit4:junit4]   2> 291 T840 oasss.Suggester.init init: {name=suggest,classname=org.apache.solr.spelling.suggest.Suggester,lookupImpl=org.apache.solr.spelling.suggest.jaspell.JaspellLookup,field=suggest,storeDir=suggest,buildOnCommit=true,threshold=0.0}
[junit4:junit4]   2> 291 T840 oasssj.JaspellLookupFactory.create init: {name=suggest,classname=org.apache.solr.spelling.suggest.Suggester,lookupImpl=org.apache.solr.spelling.suggest.jaspell.JaspellLookup,field=suggest,storeDir=suggest,buildOnCommit=true,threshold=0.0}
[junit4:junit4]   2> 291 T840 oashc.SpellCheckComponent.inform Registering newSearcher
listener for spellchecker: suggest
[junit4:junit4]   2> 293 T840 oashc.SpellCheckComponent.inform No queryConverter defined,
using default converter
[junit4:junit4]   2> 293 T840 oashc.SpellCheckComponent.inform Initializing spell checkers
[junit4:junit4]   2> 293 T840 oasss.Suggester.init init: {name=suggest_tst,classname=org.apache.solr.spelling.suggest.Suggester,lookupImpl=org.apache.solr.spelling.suggest.tst.TSTLookup,field=suggest,storeDir=suggest_tst,buildOnCommit=true,threshold=0.0}
[junit4:junit4]   2> 293 T840 oashc.SpellCheckComponent.inform Registering newSearcher
listener for spellchecker: suggest_tst
[junit4:junit4]   2> 294 T840 oashc.SpellCheckComponent.inform No queryConverter defined,
using default converter
[junit4:junit4]   2> 294 T840 oashc.SpellCheckComponent.inform Initializing spell checkers
[junit4:junit4]   2> 294 T840 oasss.Suggester.init init: {name=suggest_fst,classname=org.apache.solr.spelling.suggest.Suggester,lookupImpl=org.apache.solr.spelling.suggest.fst.FSTLookup,field=suggest,storeDir=suggest_fst,buildOnCommit=true,weightBuckets=5,exactMatchFirst=true}
[junit4:junit4]   2> 295 T840 oashc.SpellCheckComponent.inform Registering newSearcher
listener for spellchecker: suggest_fst
[junit4:junit4]   2> 295 T840 oashc.SpellCheckComponent.inform No queryConverter defined,
using default converter
[junit4:junit4]   2> 295 T840 oashc.SpellCheckComponent.inform Initializing spell checkers
[junit4:junit4]   2> 295 T840 oasss.Suggester.init init: {name=suggest_wfst,classname=org.apache.solr.spelling.suggest.Suggester,lookupImpl=org.apache.solr.spelling.suggest.fst.WFSTLookupFactory,field=suggest,storeDir=suggest_wfst,buildOnCommit=true,exactMatchFirst=true}
[junit4:junit4]   2> 296 T840 oashc.SpellCheckComponent.inform Registering newSearcher
listener for spellchecker: suggest_wfst
[junit4:junit4]   2> 296 T840 oashc.SpellCheckComponent.inform No queryConverter defined,
using default converter
[junit4:junit4]   2> 297 T840 oashc.HttpShardHandlerFactory.getParameter Setting socketTimeout
to: 0
[junit4:junit4]   2> 297 T840 oashc.HttpShardHandlerFactory.getParameter Setting urlScheme
to: http://
[junit4:junit4]   2> 297 T840 oashc.HttpShardHandlerFactory.getParameter Setting connTimeout
to: 0
[junit4:junit4]   2> 297 T840 oashc.HttpShardHandlerFactory.getParameter Setting maxConnectionsPerHost
to: 20
[junit4:junit4]   2> 297 T840 oashc.HttpShardHandlerFactory.getParameter Setting corePoolSize
to: 0
[junit4:junit4]   2> 297 T840 oashc.HttpShardHandlerFactory.getParameter Setting maximumPoolSize
to: 2147483647
[junit4:junit4]   2> 298 T840 oashc.HttpShardHandlerFactory.getParameter Setting maxThreadIdleTime
to: 5
[junit4:junit4]   2> 298 T840 oashc.HttpShardHandlerFactory.getParameter Setting sizeOfQueue
to: -1
[junit4:junit4]   2> 298 T840 oashc.HttpShardHandlerFactory.getParameter Setting fairnessPolicy
to: false
[junit4:junit4]   2> 298 T840 oascsi.HttpClientUtil.createClient Creating new http client,
config:maxConnectionsPerHost=20&maxConnections=10000&socketTimeout=0&connTimeout=0&retry=false
[junit4:junit4]   2> 302 T840 oasc.CoreContainer.register registering core: collection1
[junit4:junit4]   2> 303 T840 oas.SolrTestCaseJ4.initCore ####initCore end
[junit4:junit4]   2> 
[junit4:junit4] ERROR   0.07s | SuggesterFSTTest.testSuggestions
[junit4:junit4]    > Throwable #1: java.lang.RuntimeException: Exception during query
[junit4:junit4]    > 	at __randomizedtesting.SeedInfo.seed([F9183C5331C7F320:5FC405A6FFF3A4DE]:0)
[junit4:junit4]    > 	at org.apache.solr.SolrTestCaseJ4.assertQ(SolrTestCaseJ4.java:487)
[junit4:junit4]    > 	at org.apache.solr.SolrTestCaseJ4.assertQ(SolrTestCaseJ4.java:454)
[junit4:junit4]    > 	at org.apache.solr.spelling.suggest.SuggesterTest.testSuggestions(SuggesterTest.java:71)
[junit4:junit4]    > 	at sun.reflect.NativeMethodAccessorImpl.invoke0(Native Method)
[junit4:junit4]    > 	at sun.reflect.NativeMethodAccessorImpl.invoke(NativeMethodAccessorImpl.java:39)
[junit4:junit4]    > 	at sun.reflect.DelegatingMethodAccessorImpl.invoke(DelegatingMethodAccessorImpl.java:25)
[junit4:junit4]    > 	at java.lang.reflect.Method.invoke(Method.java:597)
[junit4:junit4]    > 	at com.carrotsearch.randomizedtesting.RandomizedRunner.invoke(RandomizedRunner.java:1995)
[junit4:junit4]    > 	at com.carrotsearch.randomizedtesting.RandomizedRunner.access$1100(RandomizedRunner.java:132)
[junit4:junit4]    > 	at com.carrotsearch.randomizedtesting.RandomizedRunner$6.evaluate(RandomizedRunner.java:818)
[junit4:junit4]    > 	at com.carrotsearch.randomizedtesting.RandomizedRunner$7.evaluate(RandomizedRunner.java:877)
[junit4:junit4]    > 	at com.carrotsearch.randomizedtesting.RandomizedRunner$8.evaluate(RandomizedRunner.java:891)
[junit4:junit4]    > 	at com.carrotsearch.randomizedtesting.rules.SystemPropertiesRestoreRule$1.evaluate(SystemPropertiesRestoreRule.java:53)
[junit4:junit4]    > 	at org.apache.lucene.util.TestRuleSetupTeardownChained$1.evaluate(TestRuleSetupTeardownChained.java:50)
[junit4:junit4]    > 	at org.apache.lucene.util.TestRuleFieldCacheSanity$1.evaluate(TestRuleFieldCacheSanity.java:32)
[junit4:junit4]    > 	at org.apache.lucene.util.AbstractBeforeAfterRule$1.evaluate(AbstractBeforeAfterRule.java:45)
[junit4:junit4]    > 	at com.carrotsearch.randomizedtesting.rules.SystemPropertiesInvariantRule$1.evaluate(SystemPropertiesInvariantRule.java:55)
[junit4:junit4]    > 	at org.apache.lucene.util.TestRuleReportUncaughtExceptions$1.evaluate(TestRuleReportUncaughtExceptions.java:68)
[junit4:junit4]    > 	at org.apache.lucene.util.TestRuleThreadAndTestName$1.evaluate(TestRuleThreadAndTestName.java:48)
[junit4:junit4]    > 	at org.apache.lucene.util.TestRuleIgnoreAfterMaxFailures$1.evaluate(TestRuleIgnoreAfterMaxFailures.java:70)
[junit4:junit4]    > 	at org.apache.lucene.util.TestRuleMarkFailure$1.evaluate(TestRuleMarkFailure.java:48)
[junit4:junit4]    > 	at com.carrotsearch.randomizedtesting.RandomizedRunner.runSingleTest(RandomizedRunner.java:825)
[junit4:junit4]    > 	at com.carrotsearch.randomizedtesting.RandomizedRunner.access$700(RandomizedRunner.java:132)
[junit4:junit4]    > 	at com.carrotsearch.randomizedtesting.RandomizedRunner$3$1.run(RandomizedRunner.java:671)
[junit4:junit4]    > 	at com.carrotsearch.randomizedtesting.RandomizedRunner$3.evaluate(RandomizedRunner.java:697)
[junit4:junit4]    > 	at com.carrotsearch.randomizedtesting.RandomizedRunner$4.evaluate(RandomizedRunner.java:736)
[junit4:junit4]    > 	at com.carrotsearch.randomizedtesting.RandomizedRunner$5.evaluate(RandomizedRunner.java:747)
[junit4:junit4]    > 	at com.carrotsearch.randomizedtesting.rules.SystemPropertiesRestoreRule$1.evaluate(SystemPropertiesRestoreRule.java:53)
[junit4:junit4]    > 	at org.apache.lucene.util.AbstractBeforeAfterRule$1.evaluate(AbstractBeforeAfterRule.java:45)
[junit4:junit4]    > 	at org.apache.lucene.util.TestRuleReportUncaughtExceptions$1.evaluate(TestRuleReportUncaughtExceptions.java:68)
[junit4:junit4]    > 	at org.apache.lucene.util.TestRuleStoreClassName$1.evaluate(TestRuleStoreClassName.java:38)
[junit4:junit4]    > 	at org.apache.lucene.util.TestRuleIcuHack$1.evaluate(TestRuleIcuHack.java:51)
[junit4:junit4]    > 	at com.carrotsearch.randomizedtesting.rules.SystemPropertiesInvariantRule$1.evaluate(SystemPropertiesInvariantRule.java:55)
[junit4:junit4]    > 	at org.apache.lucene.util.TestRuleNoInstanceHooksOverrides$1.evaluate(TestRuleNoInstanceHooksOverrides.java:53)
[junit4:junit4]    > 	at org.apache.lucene.util.TestRuleNoStaticHooksShadowing$1.evaluate(TestRuleNoStaticHooksShadowing.java:52)
[junit4:junit4]    > 	at org.apache.lucene.util.TestRuleAssertionsRequired$1.evaluate(TestRuleAssertionsRequired.java:36)
[junit4:junit4]    > 	at org.apache.lucene.util.TestRuleMarkFailure$1.evaluate(TestRuleMarkFailure.java:48)
[junit4:junit4]    > 	at org.apache.lucene.util.TestRuleIgnoreAfterMaxFailures$1.evaluate(TestRuleIgnoreAfterMaxFailures.java:70)
[junit4:junit4]    > 	at org.apache.lucene.util.TestRuleIgnoreTestSuites$1.evaluate(TestRuleIgnoreTestSuites.java:55)
[junit4:junit4]    > 	at com.carrotsearch.randomizedtesting.RandomizedRunner.runSuite(RandomizedRunner.java:605)
[junit4:junit4]    > 	at com.carrotsearch.randomizedtesting.RandomizedRunner.access$400(RandomizedRunner.java:132)
[junit4:junit4]    > 	at com.carrotsearch.randomizedtesting.RandomizedRunner$2.run(RandomizedRunner.java:551)
[junit4:junit4]    > Caused by: java.lang.NullPointerException
[junit4:junit4]    > 	at org.apache.lucene.search.suggest.fst.FSTCompletionLookup.lookup(FSTCompletionLookup.java:240)
[junit4:junit4]    > 	at org.apache.solr.spelling.suggest.Suggester.getSuggestions(Suggester.java:188)
[junit4:junit4]    > 	at org.apache.solr.handler.component.SpellCheckComponent.process(SpellCheckComponent.java:172)
[junit4:junit4]    > 	at org.apache.solr.handler.component.SearchHandler.handleRequestBody(SearchHandler.java:206)
[junit4:junit4]    > 	at org.apache.solr.handler.RequestHandlerBase.handleRequest(RequestHandlerBase.java:129)
[junit4:junit4]    > 	at org.apache.solr.core.SolrCore.execute(SolrCore.java:1619)
[junit4:junit4]    > 	at org.apache.solr.util.TestHarness.query(TestHarness.java:330)
[junit4:junit4]    > 	at org.apache.solr.util.TestHarness.query(TestHarness.java:313)
[junit4:junit4]    > 	at org.apache.solr.SolrTestCaseJ4.assertQ(SolrTestCaseJ4.java:461)
[junit4:junit4]    > 	... 41 more
[junit4:junit4]    > 
[junit4:junit4]   2> 307 T840 oas.SolrTestCaseJ4.setUp ###Starting testSuggestions
[junit4:junit4]   2> ASYNC  NEW_CORE C90 name=collection1 org.apache.solr.core.SolrCore@5593de09
[junit4:junit4]   2> 316 T840 C90 oasc.SolrDeletionPolicy.onInit SolrDeletionPolicy.onInit:
commits:num=1
[junit4:junit4]   2> 		commit{dir=MockDirWrapper(org.apache.lucene.store.SimpleFSDirectory@C:\Jenkins\workspace\Lucene-Solr-4.x-Windows-Java6-64\solr\build\solr-core\test\J0\solrtest-SuggesterFSTTest-1342025223779\index
lockFactory=org.apache.lucene.store.NativeFSLockFactory@2af4336e),segFN=segments_1,generation=1,filenames=[segments_1]
[junit4:junit4]   2> 316 T840 C90 oasc.SolrDeletionPolicy.updateCommits newest commit =
1
[junit4:junit4]   2> 318 T840 C90 UPDATE [collection1] webapp=null path=null params={}
{add=[1]} 0 6
[junit4:junit4]   2> 326 T840 C90 UPDATE [collection1] webapp=null path=null params={}
{add=[2]} 0 1
[junit4:junit4]   2> 334 T840 C90 UPDATE [collection1] webapp=null path=null params={}
{add=[3]} 0 1
[junit4:junit4]   2> 341 T840 C90 oasu.DirectUpdateHandler2.commit start commit{flags=0,version=0,optimize=false,openSearcher=true,waitSearcher=true,expungeDeletes=false,softCommit=false}
[junit4:junit4]   2> 351 T840 C90 oasc.SolrDeletionPolicy.onCommit SolrDeletionPolicy.onCommit:
commits:num=2
[junit4:junit4]   2> 		commit{dir=MockDirWrapper(org.apache.lucene.store.SimpleFSDirectory@C:\Jenkins\workspace\Lucene-Solr-4.x-Windows-Java6-64\solr\build\solr-core\test\J0\solrtest-SuggesterFSTTest-1342025223779\index
lockFactory=org.apache.lucene.store.NativeFSLockFactory@2af4336e),segFN=segments_1,generation=1,filenames=[segments_1]
[junit4:junit4]   2> 		commit{dir=MockDirWrapper(org.apache.lucene.store.SimpleFSDirectory@C:\Jenkins\workspace\Lucene-Solr-4.x-Windows-Java6-64\solr\build\solr-core\test\J0\solrtest-SuggesterFSTTest-1342025223779\index
lockFactory=org.apache.lucene.store.NativeFSLockFactory@2af4336e),segFN=segments_2,generation=2,filenames=[_0.fnm,
_0_MockSep_0.pos, _0_NestedPulsing_0.frq, _0_nrm.cfs, _0_NestedPulsing_0.tip, _0_NestedPulsing_0.prx,
_0_NestedPulsing_0.tim, _0_MockSep_0.tib, _0_MockSep_0.skp, _0_nrm.cfe, _0_SimpleText_0.pst,
segments_2, _0_MockSep_0.frq, _0.fdx, _0_MockSep_0.tii, _0.si, _0_MockSep_0.pyl, _0_MockSep_0.doc,
_0.fdt]
[junit4:junit4]   2> 351 T840 C90 oasc.SolrDeletionPolicy.updateCommits newest commit =
2
[junit4:junit4]   2> 351 T840 C90 oasc.SolrCore.getSearcher WARNING [collection1] PERFORMANCE
WARNING: Overlapping onDeckSearchers=2
[junit4:junit4]   2> 356 T840 C90 oass.SolrIndexSearcher.<init> Opening Searcher@e0e4d72
main
[junit4:junit4]   2> 357 T840 C90 oass.SolrIndexSearcher.getIndexDir WARNING WARNING: Directory
impl does not support setting indexDir: org.apache.lucene.store.MockDirectoryWrapper
[junit4:junit4]   2> 357 T840 C90 oasu.DirectUpdateHandler2.commit end_commit_flush
[junit4:junit4]   2> 358 T841 oasc.SolrCore.registerSearcher [collection1] Registered new
searcher Searcher@7d15266 main{StandardDirectoryReader(segments_1:1)}
[junit4:junit4]   2> 359 T841 oashc.SpellCheckComponent$SpellCheckerListener.newSearcher
Loading spell index for spellchecker: suggest
[junit4:junit4]   2> 359 T841 oasss.Suggester.reload reload()
[junit4:junit4]   2> 359 T841 oashc.SpellCheckComponent$SpellCheckerListener.newSearcher
SEVERE Exception in reloading spell check index for spellchecker: suggest java.io.FileNotFoundException:
C:\Jenkins\workspace\Lucene-Solr-4.x-Windows-Java6-64\solr\build\solr-core\test\J0\.\solrtest-SuggesterFSTTest-1342025223779\suggest\jaspell.dat
(The system cannot find the file specified)
[junit4:junit4]   2> 	at java.io.FileInputStream.open(Native Method)
[junit4:junit4]   2> 	at java.io.FileInputStream.<init>(FileInputStream.java:120)
[junit4:junit4]   2> 	at org.apache.solr.spelling.suggest.Suggester.reload(Suggester.java:164)
[junit4:junit4]   2> 	at org.apache.solr.handler.component.SpellCheckComponent$SpellCheckerListener.newSearcher(SpellCheckComponent.java:673)
[junit4:junit4]   2> 	at org.apache.solr.core.SolrCore$4.call(SolrCore.java:1399)
[junit4:junit4]   2> 	at java.util.concurrent.FutureTask$Sync.innerRun(FutureTask.java:303)
[junit4:junit4]   2> 	at java.util.concurrent.FutureTask.run(FutureTask.java:138)
[junit4:junit4]   2> 	at java.util.concurrent.ThreadPoolExecutor$Worker.runTask(ThreadPoolExecutor.java:886)
[junit4:junit4]   2> 	at java.util.concurrent.ThreadPoolExecutor$Worker.run(ThreadPoolExecutor.java:908)
[junit4:junit4]   2> 	at java.lang.Thread.run(Thread.java:662)
[junit4:junit4]   2> 
[junit4:junit4]   2> 359 T841 oashc.SpellCheckComponent$SpellCheckerListener.newSearcher
Loading spell index for spellchecker: suggest_tst
[junit4:junit4]   2> 359 T841 oasss.Suggester.reload reload()
[junit4:junit4]   2> 359 T841 oashc.SpellCheckComponent$SpellCheckerListener.newSearcher
SEVERE Exception in reloading spell check index for spellchecker: suggest_tst java.io.FileNotFoundException:
C:\Jenkins\workspace\Lucene-Solr-4.x-Windows-Java6-64\solr\build\solr-core\test\J0\.\solrtest-SuggesterFSTTest-1342025223779\suggest_tst\tst.dat
(The system cannot find the file specified)
[junit4:junit4]   2> 	at java.io.FileInputStream.open(Native Method)
[junit4:junit4]   2> 	at java.io.FileInputStream.<init>(FileInputStream.java:120)
[junit4:junit4]   2> 	at org.apache.solr.spelling.suggest.Suggester.reload(Suggester.java:164)
[junit4:junit4]   2> 	at org.apache.solr.handler.component.SpellCheckComponent$SpellCheckerListener.newSearcher(SpellCheckComponent.java:673)
[junit4:junit4]   2> 	at org.apache.solr.core.SolrCore$4.call(SolrCore.java:1399)
[junit4:junit4]   2> 	at java.util.concurrent.FutureTask$Sync.innerRun(FutureTask.java:303)
[junit4:junit4]   2> 	at java.util.concurrent.FutureTask.run(FutureTask.java:138)
[junit4:junit4]   2> 	at java.util.concurrent.ThreadPoolExecutor$Worker.runTask(ThreadPoolExecutor.java:886)
[junit4:junit4]   2> 	at java.util.concurrent.ThreadPoolExecutor$Worker.run(ThreadPoolExecutor.java:908)
[junit4:junit4]   2> 	at java.lang.Thread.run(Thread.java:662)
[junit4:junit4]   2> 
[junit4:junit4]   2> 360 T841 oashc.SpellCheckComponent$SpellCheckerListener.newSearcher
Loading spell index for spellchecker: suggest_fst
[junit4:junit4]   2> 360 T841 oasss.Suggester.reload reload()
[junit4:junit4]   2> 360 T841 oashc.SpellCheckComponent$SpellCheckerListener.newSearcher
SEVERE Exception in reloading spell check index for spellchecker: suggest_fst java.io.FileNotFoundException:
C:\Jenkins\workspace\Lucene-Solr-4.x-Windows-Java6-64\solr\build\solr-core\test\J0\.\solrtest-SuggesterFSTTest-1342025223779\suggest_fst\fst.bin
(The system cannot find the file specified)
[junit4:junit4]   2> 	at java.io.FileInputStream.open(Native Method)
[junit4:junit4]   2> 	at java.io.FileInputStream.<init>(FileInputStream.java:120)
[junit4:junit4]   2> 	at org.apache.solr.spelling.suggest.Suggester.reload(Suggester.java:164)
[junit4:junit4]   2> 	at org.apache.solr.handler.component.SpellCheckComponent$SpellCheckerListener.newSearcher(SpellCheckComponent.java:673)
[junit4:junit4]   2> 	at org.apache.solr.core.SolrCore$4.call(SolrCore.java:1399)
[junit4:junit4]   2> 	at java.util.concurrent.FutureTask$Sync.innerRun(FutureTask.java:303)
[junit4:junit4]   2> 	at java.util.concurrent.FutureTask.run(FutureTask.java:138)
[junit4:junit4]   2> 	at java.util.concurrent.ThreadPoolExecutor$Worker.runTask(ThreadPoolExecutor.java:886)
[junit4:junit4]   2> 	at java.util.concurrent.ThreadPoolExecutor$Worker.run(ThreadPoolExecutor.java:908)
[junit4:junit4]   2> 	at java.lang.Thread.run(Thread.java:662)
[junit4:junit4]   2> 
[junit4:junit4]   2> 360 T841 oashc.SpellCheckComponent$SpellCheckerListener.newSearcher
Loading spell index for spellchecker: suggest_wfst
[junit4:junit4]   2> 360 T841 oasss.Suggester.reload reload()
[junit4:junit4]   2> 360 T841 oashc.SpellCheckComponent$SpellCheckerListener.newSearcher
SEVERE Exception in reloading spell check index for spellchecker: suggest_wfst java.io.FileNotFoundException:
C:\Jenkins\workspace\Lucene-Solr-4.x-Windows-Java6-64\solr\build\solr-core\test\J0\.\solrtest-SuggesterFSTTest-1342025223779\suggest_wfst\wfst.bin
(The system cannot find the file specified)
[junit4:junit4]   2> 	at java.io.FileInputStream.open(Native Method)
[junit4:junit4]   2> 	at java.io.FileInputStream.<init>(FileInputStream.java:120)
[junit4:junit4]   2> 	at org.apache.solr.spelling.suggest.Suggester.reload(Suggester.java:164)
[junit4:junit4]   2> 	at org.apache.solr.handler.component.SpellCheckComponent$SpellCheckerListener.newSearcher(SpellCheckComponent.java:673)
[junit4:junit4]   2> 	at org.apache.solr.core.SolrCore$4.call(SolrCore.java:1399)
[junit4:junit4]   2> 	at java.util.concurrent.FutureTask$Sync.innerRun(FutureTask.java:303)
[junit4:junit4]   2> 	at java.util.concurrent.FutureTask.run(FutureTask.java:138)
[junit4:junit4]   2> 	at java.util.concurrent.ThreadPoolExecutor$Worker.runTask(ThreadPoolExecutor.java:886)
[junit4:junit4]   2> 	at java.util.concurrent.ThreadPoolExecutor$Worker.run(ThreadPoolExecutor.java:908)
[junit4:junit4]   2> 	at java.lang.Thread.run(Thread.java:662)
[junit4:junit4]   2> 
[junit4:junit4]   2> 363 T841 oasc.SolrCore.registerSearcher [collection1] Registered new
searcher Searcher@e0e4d72 main{StandardDirectoryReader(segments_2:3 _0(4.0):C3)}
[junit4:junit4]   2> 363 T840 C90 UPDATE [collection1] webapp=null path=null params={}
{commit=} 0 22
[junit4:junit4]   2> 366 T840 C90 oasc.SolrException.log SEVERE java.lang.NullPointerException
[junit4:junit4]   2> 		at org.apache.lucene.search.suggest.fst.FSTCompletionLookup.lookup(FSTCompletionLookup.java:240)
[junit4:junit4]   2> 		at org.apache.solr.spelling.suggest.Suggester.getSuggestions(Suggester.java:188)
[junit4:junit4]   2> 		at org.apache.solr.handler.component.SpellCheckComponent.process(SpellCheckComponent.java:172)
[junit4:junit4]   2> 		at org.apache.solr.handler.component.SearchHandler.handleRequestBody(SearchHandler.java:206)
[junit4:junit4]   2> 		at org.apache.solr.handler.RequestHandlerBase.handleRequest(RequestHandlerBase.java:129)
[junit4:junit4]   2> 		at org.apache.solr.core.SolrCore.execute(SolrCore.java:1619)
[junit4:junit4]   2> 		at org.apache.solr.util.TestHarness.query(TestHarness.java:330)
[junit4:junit4]   2> 		at org.apache.solr.util.TestHarness.query(TestHarness.java:313)
[junit4:junit4]   2> 		at org.apache.solr.SolrTestCaseJ4.assertQ(SolrTestCaseJ4.java:461)
[junit4:junit4]   2> 		at org.apache.solr.SolrTestCaseJ4.assertQ(SolrTestCaseJ4.java:454)
[junit4:junit4]   2> 		at org.apache.solr.spelling.suggest.SuggesterTest.testSuggestions(SuggesterTest.java:71)
[junit4:junit4]   2> 		at sun.reflect.NativeMethodAccessorImpl.invoke0(Native Method)
[junit4:junit4]   2> 		at sun.reflect.NativeMethodAccessorImpl.invoke(NativeMethodAccessorImpl.java:39)
[junit4:junit4]   2> 		at sun.reflect.DelegatingMethodAccessorImpl.invoke(DelegatingMethodAccessorImpl.java:25)
[junit4:junit4]   2> 		at java.lang.reflect.Method.invoke(Method.java:597)
[junit4:junit4]   2> 		at com.carrotsearch.randomizedtesting.RandomizedRunner.invoke(RandomizedRunner.java:1995)
[junit4:junit4]   2> 		at com.carrotsearch.randomizedtesting.RandomizedRunner.access$1100(RandomizedRunner.java:132)
[junit4:junit4]   2> 		at com.carrotsearch.randomizedtesting.RandomizedRunner$6.evaluate(RandomizedRunner.java:818)
[junit4:junit4]   2> 		at com.carrotsearch.randomizedtesting.RandomizedRunner$7.evaluate(RandomizedRunner.java:877)
[junit4:junit4]   2> 		at com.carrotsearch.randomizedtesting.RandomizedRunner$8.evaluate(RandomizedRunner.java:891)
[junit4:junit4]   2> 		at com.carrotsearch.randomizedtesting.rules.SystemPropertiesRestoreRule$1.evaluate(SystemPropertiesRestoreRule.java:53)
[junit4:junit4]   2> 		at org.apache.lucene.util.TestRuleSetupTeardownChained$1.evaluate(TestRuleSetupTeardownChained.java:50)
[junit4:junit4]   2> 		at org.apache.lucene.util.TestRuleFieldCacheSanity$1.evaluate(TestRuleFieldCacheSanity.java:32)
[junit4:junit4]   2> 		at org.apache.lucene.util.AbstractBeforeAfterRule$1.evaluate(AbstractBeforeAfterRule.java:45)
[junit4:junit4]   2> 		at com.carrotsearch.randomizedtesting.rules.SystemPropertiesInvariantRule$1.evaluate(SystemPropertiesInvariantRule.java:55)
[junit4:junit4]   2> 		at org.apache.lucene.util.TestRuleReportUncaughtExceptions$1.evaluate(TestRuleReportUncaughtExceptions.java:68)
[junit4:junit4]   2> 		at org.apache.lucene.util.TestRuleThreadAndTestName$1.evaluate(TestRuleThreadAndTestName.java:48)
[junit4:junit4]   2> 		at org.apache.lucene.util.TestRuleIgnoreAfterMaxFailures$1.evaluate(TestRuleIgnoreAfterMaxFailures.java:70)
[junit4:junit4]   2> 		at org.apache.lucene.util.TestRuleMarkFailure$1.evaluate(TestRuleMarkFailure.java:48)
[junit4:junit4]   2> 		at com.carrotsearch.randomizedtesting.RandomizedRunner.runSingleTest(RandomizedRunner.java:825)
[junit4:junit4]   2> 		at com.carrotsearch.randomizedtesting.RandomizedRunner.access$700(RandomizedRunner.java:132)
[junit4:junit4]   2> 		at com.carrotsearch.randomizedtesting.RandomizedRunner$3$1.run(RandomizedRunner.java:671)
[junit4:junit4]   2> 		at com.carrotsearch.randomizedtesting.RandomizedRunner$3.evaluate(RandomizedRunner.java:697)
[junit4:junit4]   2> 		at com.carrotsearch.randomizedtesting.RandomizedRunner$4.evaluate(RandomizedRunner.java:736)
[junit4:junit4]   2> 		at com.carrotsearch.randomizedtesting.RandomizedRunner$5.evaluate(RandomizedRunner.java:747)
[junit4:junit4]   2> 		at com.carrotsearch.randomizedtesting.rules.SystemPropertiesRestoreRule$1.evaluate(SystemPropertiesRestoreRule.java:53)
[junit4:junit4]   2> 		at org.apache.lucene.util.AbstractBeforeAfterRule$1.evaluate(AbstractBeforeAfterRule.java:45)
[junit4:junit4]   2> 		at org.apache.lucene.util.TestRuleReportUncaughtExceptions$1.evaluate(TestRuleReportUncaughtExceptions.java:68)
[junit4:junit4]   2> 		at org.apache.lucene.util.TestRuleStoreClassName$1.evaluate(TestRuleStoreClassName.java:38)
[junit4:junit4]   2> 		at org.apache.lucene.util.TestRuleIcuHack$1.evaluate(TestRuleIcuHack.java:51)
[junit4:junit4]   2> 		at com.carrotsearch.randomizedtesting.rules.SystemPropertiesInvariantRule$1.evaluate(SystemPropertiesInvariantRule.java:55)
[junit4:junit4]   2> 		at org.apache.lucene.util.TestRuleNoInstanceHooksOverrides$1.evaluate(TestRuleNoInstanceHooksOverrides.java:53)
[junit4:junit4]   2> 		at org.apache.lucene.util.TestRuleNoStaticHooksShadowing$1.evaluate(TestRuleNoStaticHooksShadowing.java:52)
[junit4:junit4]   2> 		at org.apache.lucene.util.TestRuleAssertionsRequired$1.evaluate(TestRuleAssertionsRequired.java:36)
[junit4:junit4]   2> 		at org.apache.lucene.util.TestRuleMarkFailure$1.evaluate(TestRuleMarkFailure.java:48)
[junit4:junit4]   2> 		at org.apache.lucene.util.TestRuleIgnoreAfterMaxFailures$1.evaluate(TestRuleIgnoreAfterMaxFailures.java:70)
[junit4:junit4]   2> 		at org.apache.lucene.util.TestRuleIgnoreTestSuites$1.evaluate(TestRuleIgnoreTestSuites.java:55)
[junit4:junit4]   2> 		at com.carrotsearch.randomizedtesting.RandomizedRunner.runSuite(RandomizedRunner.java:605)
[junit4:junit4]   2> 		at com.carrotsearch.randomizedtesting.RandomizedRunner.access$400(RandomizedRunner.java:132)
[junit4:junit4]   2> 		at com.carrotsearch.randomizedtesting.RandomizedRunner$2.run(RandomizedRunner.java:551)
[junit4:junit4]   2> 	
[junit4:junit4]   2> 366 T840 C90 REQ [collection1] webapp=null path=null params={q=ac&spellcheck.count=2&qt=/suggest_fst&spellcheck.onlyMorePopular=true}
status=500 QTime=1 
[junit4:junit4]   2> 366 T840 oasc.SolrException.log SEVERE REQUEST FAILED: q=ac&spellcheck.count=2&qt=/suggest_fst&spellcheck.onlyMorePopular=true:java.lang.NullPointerException
[junit4:junit4]   2> 		at org.apache.lucene.search.suggest.fst.FSTCompletionLookup.lookup(FSTCompletionLookup.java:240)
[junit4:junit4]   2> 		at org.apache.solr.spelling.suggest.Suggester.getSuggestions(Suggester.java:188)
[junit4:junit4]   2> 		at org.apache.solr.handler.component.SpellCheckComponent.process(SpellCheckComponent.java:172)
[junit4:junit4]   2> 		at org.apache.solr.handler.component.SearchHandler.handleRequestBody(SearchHandler.java:206)
[junit4:junit4]   2> 		at org.apache.solr.handler.RequestHandlerBase.handleRequest(RequestHandlerBase.java:129)
[junit4:junit4]   2> 		at org.apache.solr.core.SolrCore.execute(SolrCore.java:1619)
[junit4:junit4]   2> 		at org.apache.solr.util.TestHarness.query(TestHarness.java:330)
[junit4:junit4]   2> 		at org.apache.solr.util.TestHarness.query(TestHarness.java:313)
[junit4:junit4]   2> 		at org.apache.solr.SolrTestCaseJ4.assertQ(SolrTestCaseJ4.java:461)
[junit4:junit4]   2> 		at org.apache.solr.SolrTestCaseJ4.assertQ(SolrTestCaseJ4.java:454)
[junit4:junit4]   2> 		at org.apache.solr.spelling.suggest.SuggesterTest.testSuggestions(SuggesterTest.java:71)
[junit4:junit4]   2> 		at sun.reflect.NativeMethodAccessorImpl.invoke0(Native Method)
[junit4:junit4]   2> 		at sun.reflect.NativeMethodAccessorImpl.invoke(NativeMethodAccessorImpl.java:39)
[junit4:junit4]   2> 		at sun.reflect.DelegatingMethodAccessorImpl.invoke(DelegatingMethodAccessorImpl.java:25)
[junit4:junit4]   2> 		at java.lang.reflect.Method.invoke(Method.java:597)
[junit4:junit4]   2> 		at com.carrotsearch.randomizedtesting.RandomizedRunner.invoke(RandomizedRunner.java:1995)
[junit4:junit4]   2> 		at com.carrotsearch.randomizedtesting.RandomizedRunner.access$1100(RandomizedRunner.java:132)
[junit4:junit4]   2> 		at com.carrotsearch.randomizedtesting.RandomizedRunner$6.evaluate(RandomizedRunner.java:818)
[junit4:junit4]   2> 		at com.carrotsearch.randomizedtesting.RandomizedRunner$7.evaluate(RandomizedRunner.java:877)
[junit4:junit4]   2> 		at com.carrotsearch.randomizedtesting.RandomizedRunner$8.evaluate(RandomizedRunner.java:891)
[junit4:junit4]   2> 		at com.carrotsearch.randomizedtesting.rules.SystemPropertiesRestoreRule$1.evaluate(SystemPropertiesRestoreRule.java:53)
[junit4:junit4]   2> 		at org.apache.lucene.util.TestRuleSetupTeardownChained$1.evaluate(TestRuleSetupTeardownChained.java:50)
[junit4:junit4]   2> 		at org.apache.lucene.util.TestRuleFieldCacheSanity$1.evaluate(TestRuleFieldCacheSanity.java:32)
[junit4:junit4]   2> 		at org.apache.lucene.util.AbstractBeforeAfterRule$1.evaluate(AbstractBeforeAfterRule.java:45)
[junit4:junit4]   2> 		at com.carrotsearch.randomizedtesting.rules.SystemPropertiesInvariantRule$1.evaluate(SystemPropertiesInvariantRule.java:55)
[junit4:junit4]   2> 		at org.apache.lucene.util.TestRuleReportUncaughtExceptions$1.evaluate(TestRuleReportUncaughtExceptions.java:68)
[junit4:junit4]   2> 		at org.apache.lucene.util.TestRuleThreadAndTestName$1.evaluate(TestRuleThreadAndTestName.java:48)
[junit4:junit4]   2> 		at org.apache.lucene.util.TestRuleIgnoreAfterMaxFailures$1.evaluate(TestRuleIgnoreAfterMaxFailures.java:70)
[junit4:junit4]   2> 		at org.apache.lucene.util.TestRuleMarkFailure$1.evaluate(TestRuleMarkFailure.java:48)
[junit4:junit4]   2> 		at com.carrotsearch.randomizedtesting.RandomizedRunner.runSingleTest(RandomizedRunner.java:825)
[junit4:junit4]   2> 		at com.carrotsearch.randomizedtesting.RandomizedRunner.access$700(RandomizedRunner.java:132)
[junit4:junit4]   2> 		at com.carrotsearch.randomizedtesting.RandomizedRunner$3$1.run(RandomizedRunner.java:671)
[junit4:junit4]   2> 		at com.carrotsearch.randomizedtesting.RandomizedRunner$3.evaluate(RandomizedRunner.java:697)
[junit4:junit4]   2> 		at com.carrotsearch.randomizedtesting.RandomizedRunner$4.evaluate(RandomizedRunner.java:736)
[junit4:junit4]   2> 		at com.carrotsearch.randomizedtesting.RandomizedRunner$5.evaluate(RandomizedRunner.java:747)
[junit4:junit4]   2> 		at com.carrotsearch.randomizedtesting.rules.SystemPropertiesRestoreRule$1.evaluate(SystemPropertiesRestoreRule.java:53)
[junit4:junit4]   2> 		at org.apache.lucene.util.AbstractBeforeAfterRule$1.evaluate(AbstractBeforeAfterRule.java:45)
[junit4:junit4]   2> 		at org.apache.lucene.util.TestRuleReportUncaughtExceptions$1.evaluate(TestRuleReportUncaughtExceptions.java:68)
[junit4:junit4]   2> 		at org.apache.lucene.util.TestRuleStoreClassName$1.evaluate(TestRuleStoreClassName.java:38)
[junit4:junit4]   2> 		at org.apache.lucene.util.TestRuleIcuHack$1.evaluate(TestRuleIcuHack.java:51)
[junit4:junit4]   2> 		at com.carrotsearch.randomizedtesting.rules.SystemPropertiesInvariantRule$1.evaluate(SystemPropertiesInvariantRule.java:55)
[junit4:junit4]   2> 		at org.apache.lucene.util.TestRuleNoInstanceHooksOverrides$1.evaluate(TestRuleNoInstanceHooksOverrides.java:53)
[junit4:junit4]   2> 		at org.apache.lucene.util.TestRuleNoStaticHooksShadowing$1.evaluate(TestRuleNoStaticHooksShadowing.java:52)
[junit4:junit4]   2> 		at org.apache.lucene.util.TestRuleAssertionsRequired$1.evaluate(TestRuleAssertionsRequired.java:36)
[junit4:junit4]   2> 		at org.apache.lucene.util.TestRuleMarkFailure$1.evaluate(TestRuleMarkFailure.java:48)
[junit4:junit4]   2> 		at org.apache.lucene.util.TestRuleIgnoreAfterMaxFailures$1.evaluate(TestRuleIgnoreAfterMaxFailures.java:70)
[junit4:junit4]   2> 		at org.apache.lucene.util.TestRuleIgnoreTestSuites$1.evaluate(TestRuleIgnoreTestSuites.java:55)
[junit4:junit4]   2> 		at com.carrotsearch.randomizedtesting.RandomizedRunner.runSuite(RandomizedRunner.java:605)
[junit4:junit4]   2> 		at com.carrotsearch.randomizedtesting.RandomizedRunner.access$400(RandomizedRunner.java:132)
[junit4:junit4]   2> 		at com.carrotsearch.randomizedtesting.RandomizedRunner$2.run(RandomizedRunner.java:551)
[junit4:junit4]   2> 	
[junit4:junit4]   2> 367 T840 oas.SolrTestCaseJ4.tearDown ###Ending testSuggestions
[junit4:junit4]   2> NOTE: reproduce with: ant test  -Dtestcase=SuggesterFSTTest -Dtests.method=testSuggestions
-Dtests.seed=F9183C5331C7F320 -Dtests.slow=true -Dtests.locale=es_PE -Dtests.timezone=Arctic/Longyearbyen
-Dtests.file.encoding=ISO-8859-1
[junit4:junit4]   2>
[junit4:junit4]    > (@AfterClass output)
[junit4:junit4]   2> 1823 T840 oas.SolrTestCaseJ4.deleteCore ###deleteCore
[junit4:junit4]   2> 1823 T840 oasc.CoreContainer.shutdown Shutting down CoreContainer
instance=2000005427
[junit4:junit4]   2> 1824 T840 oasc.SolrCore.close [collection1]  CLOSING SolrCore org.apache.solr.core.SolrCore@2031de7a
[junit4:junit4]   2> 1824 T840 oasc.SolrCore.closeSearcher [collection1] Closing main searcher
on request.
[junit4:junit4]   2> 1825 T840 oasu.DirectUpdateHandler2.close closing DirectUpdateHandler2{commits=0,autocommits=0,soft
autocommits=0,optimizes=0,rollbacks=0,expungeDeletes=0,docsPending=0,adds=0,deletesById=0,deletesByQuery=0,errors=0,cumulative_adds=0,cumulative_deletesById=0,cumulative_deletesByQuery=0,cumulative_errors=0}
[junit4:junit4]   2> NOTE: test params are: codec=Lucene40: {id=PostingsFormat(name=NestedPulsing),
text=PostingsFormat(name=MockSep), suggest=PostingsFormat(name=SimpleText), spell=PostingsFormat(name=SimpleText)},
sim=RandomSimilarityProvider(queryNorm=false,coord=true): {}, locale=es_PE, timezone=Arctic/Longyearbyen
[junit4:junit4]   2> NOTE: Windows 7 6.1 amd64/Sun Microsystems Inc. 1.6.0_32 (64-bit)/cpus=2,threads=1,free=89046456,total=223215616
[junit4:junit4]   2> NOTE: All tests run in this JVM: [TestIrishLowerCaseFilterFactory,
MinimalSchemaTest, TestLMDirichletSimilarityFactory, QueryParsingTest, DistanceFunctionTest,
TestBeiderMorseFilterFactory, TestUAX29URLEmailTokenizerFactory, TestOmitPositions, PrimitiveFieldTypeTest,
TestGreekLowerCaseFilterFactory, TestStandardFactories, RAMDirectoryFactoryTest, TestJapaneseReadingFormFilterFactory,
CloudStateTest, BadComponentTest, ShowFileRequestHandlerTest, NotRequiredUniqueKeyTest, TestIndonesianStemFilterFactory,
TestCharFilters, SearchHandlerTest, OpenExchangeRatesOrgProviderTest, TestFastLRUCache, TestPropInject,
TestRussianLightStemFilterFactory, StandardRequestHandlerTest, TestPortugueseLightStemFilterFactory,
TestRealTimeGet, LukeRequestHandlerTest, TestArabicFilters, TestSolrDeletionPolicy1, TestExtendedDismaxParser,
DirectUpdateHandlerOptimizeTest, TestCollationField, TestRussianFilters, TestRandomFaceting,
TestReplicationHandler, RequestHandlersTest, UUIDFieldTest, TestBrazilianStemFilterFactory,
TestDefaultSimilarityFactory, TestCodecSupport, DebugComponentTest, CacheHeaderTest, TestCJKTokenizerFactory,
DistributedQueryElevationComponentTest, TestJapaneseTokenizerFactory, TestCJKWidthFilterFactory,
BasicZkTest, SignatureUpdateProcessorFactoryTest, TestLuceneMatchVersion, TestStopFilterFactory,
LegacyHTMLStripCharFilterTest, TestHindiFilters, BasicDistributedZkTest, TestSlowSynonymFilter,
TestKStemFilterFactory, TestSynonymMap, TestHyphenationCompoundWordTokenFilterFactory, TestDelimitedPayloadTokenFilterFactory,
TestPersianNormalizationFilterFactory, TestKeywordMarkerFilterFactory, TestPatternReplaceCharFilterFactory,
TestNorwegianLightStemFilterFactory, TestRecovery, CopyFieldTest, DateMathParserTest, HighlighterConfigTest,
TestPseudoReturnFields, TestFrenchMinimalStemFilterFactory, QueryEqualityTest, TestFrenchLightStemFilterFactory,
XmlUpdateRequestHandlerTest, TestDocSet, TestGalicianMinimalStemFilterFactory, MBeansHandlerTest,
TestSuggestSpellingConverter, TestSynonymFilterFactory, TestConfig, TestBulgarianStemFilterFactory,
SuggesterWFSTTest, TestCJKBigramFilterFactory, TestJapanesePartOfSpeechStopFilterFactory,
SuggesterFSTTest]
[junit4:junit4]   2> 
[junit4:junit4] Completed in 1.88s, 4 tests, 1 error <<< FAILURES!

[...truncated 914 lines...]
BUILD FAILED
C:\Jenkins\workspace\Lucene-Solr-4.x-Windows-Java6-64\build.xml:29: The following error occurred
while executing this line:
C:\Jenkins\workspace\Lucene-Solr-4.x-Windows-Java6-64\solr\build.xml:144: The following error
occurred while executing this line:
C:\Jenkins\workspace\Lucene-Solr-4.x-Windows-Java6-64\lucene\module-build.xml:62: The following
error occurred while executing this line:
C:\Jenkins\workspace\Lucene-Solr-4.x-Windows-Java6-64\lucene\common-build.xml:1095: The following
error occurred while executing this line:
C:\Jenkins\workspace\Lucene-Solr-4.x-Windows-Java6-64\lucene\common-build.xml:792: There were
test failures: 299 suites, 1062 tests, 1 error, 10 ignored (5 assumptions)

Total time: 36 minutes 28 seconds
Build step 'Invoke Ant' marked build as failure
Recording test results
Email was triggered for: Failure
Sending email for trigger: Failure




Mime
View raw message