lucene-dev mailing list archives

Site index · List index
Message view « Date » · « Thread »
Top « Date » · « Thread »
From Policeman Jenkins Server <jenk...@sd-datasolutions.de>
Subject [JENKINS] Lucene-Solr-trunk-Linux (64bit/jdk1.8.0-ea-b49) - Build # 7 - Still Failing!
Date Mon, 30 Jul 2012 00:19:18 GMT
Build: http://jenkins.sd-datasolutions.de/job/Lucene-Solr-trunk-Linux/7/
Java: 64bit/jdk1.8.0-ea-b49

1 tests failed.
FAILED:  org.apache.solr.handler.component.DistributedQueryElevationComponentTest.testDistribSearch

Error Message:
.responseHeader.params.size()==9,9skipped=4,5

Stack Trace:
junit.framework.AssertionFailedError: .responseHeader.params.size()==9,9skipped=4,5
	at __randomizedtesting.SeedInfo.seed([C8A0A39FF82453F8:49462D878F7B33C4]:0)
	at junit.framework.Assert.fail(Assert.java:50)
	at org.apache.solr.BaseDistributedSearchTestCase.compareResponses(BaseDistributedSearchTestCase.java:670)
	at org.apache.solr.BaseDistributedSearchTestCase.query(BaseDistributedSearchTestCase.java:392)
	at org.apache.solr.handler.component.DistributedQueryElevationComponentTest.doTest(DistributedQueryElevationComponentTest.java:81)
	at org.apache.solr.BaseDistributedSearchTestCase.testDistribSearch(BaseDistributedSearchTestCase.java:679)
	at sun.reflect.NativeMethodAccessorImpl.invoke0(Native Method)
	at sun.reflect.NativeMethodAccessorImpl.invoke(NativeMethodAccessorImpl.java:57)
	at sun.reflect.DelegatingMethodAccessorImpl.invoke(DelegatingMethodAccessorImpl.java:43)
	at java.lang.reflect.Method.invoke(Method.java:474)
	at com.carrotsearch.randomizedtesting.RandomizedRunner.invoke(RandomizedRunner.java:1995)
	at com.carrotsearch.randomizedtesting.RandomizedRunner.access$1100(RandomizedRunner.java:132)
	at com.carrotsearch.randomizedtesting.RandomizedRunner$6.evaluate(RandomizedRunner.java:818)
	at com.carrotsearch.randomizedtesting.RandomizedRunner$7.evaluate(RandomizedRunner.java:877)
	at com.carrotsearch.randomizedtesting.RandomizedRunner$8.evaluate(RandomizedRunner.java:891)
	at com.carrotsearch.randomizedtesting.rules.SystemPropertiesRestoreRule$1.evaluate(SystemPropertiesRestoreRule.java:53)
	at org.apache.lucene.util.TestRuleSetupTeardownChained$1.evaluate(TestRuleSetupTeardownChained.java:50)
	at org.apache.lucene.util.TestRuleFieldCacheSanity$1.evaluate(TestRuleFieldCacheSanity.java:32)
	at org.apache.lucene.util.AbstractBeforeAfterRule$1.evaluate(AbstractBeforeAfterRule.java:45)
	at com.carrotsearch.randomizedtesting.rules.SystemPropertiesInvariantRule$1.evaluate(SystemPropertiesInvariantRule.java:55)
	at org.apache.lucene.util.TestRuleReportUncaughtExceptions$1.evaluate(TestRuleReportUncaughtExceptions.java:68)
	at org.apache.lucene.util.TestRuleThreadAndTestName$1.evaluate(TestRuleThreadAndTestName.java:48)
	at org.apache.lucene.util.TestRuleIgnoreAfterMaxFailures$1.evaluate(TestRuleIgnoreAfterMaxFailures.java:70)
	at org.apache.lucene.util.TestRuleMarkFailure$1.evaluate(TestRuleMarkFailure.java:48)
	at com.carrotsearch.randomizedtesting.RandomizedRunner.runSingleTest(RandomizedRunner.java:825)
	at com.carrotsearch.randomizedtesting.RandomizedRunner.access$700(RandomizedRunner.java:132)
	at com.carrotsearch.randomizedtesting.RandomizedRunner$3$1.run(RandomizedRunner.java:671)
	at com.carrotsearch.randomizedtesting.RandomizedRunner$3.evaluate(RandomizedRunner.java:697)
	at com.carrotsearch.randomizedtesting.RandomizedRunner$4.evaluate(RandomizedRunner.java:736)
	at com.carrotsearch.randomizedtesting.RandomizedRunner$5.evaluate(RandomizedRunner.java:747)
	at com.carrotsearch.randomizedtesting.rules.SystemPropertiesRestoreRule$1.evaluate(SystemPropertiesRestoreRule.java:53)
	at org.apache.lucene.util.AbstractBeforeAfterRule$1.evaluate(AbstractBeforeAfterRule.java:45)
	at org.apache.lucene.util.TestRuleReportUncaughtExceptions$1.evaluate(TestRuleReportUncaughtExceptions.java:68)
	at org.apache.lucene.util.TestRuleStoreClassName$1.evaluate(TestRuleStoreClassName.java:38)
	at com.carrotsearch.randomizedtesting.rules.SystemPropertiesInvariantRule$1.evaluate(SystemPropertiesInvariantRule.java:55)
	at org.apache.lucene.util.TestRuleNoInstanceHooksOverrides$1.evaluate(TestRuleNoInstanceHooksOverrides.java:53)
	at org.apache.lucene.util.TestRuleNoStaticHooksShadowing$1.evaluate(TestRuleNoStaticHooksShadowing.java:52)
	at org.apache.lucene.util.TestRuleAssertionsRequired$1.evaluate(TestRuleAssertionsRequired.java:36)
	at org.apache.lucene.util.TestRuleMarkFailure$1.evaluate(TestRuleMarkFailure.java:48)
	at org.apache.lucene.util.TestRuleIgnoreAfterMaxFailures$1.evaluate(TestRuleIgnoreAfterMaxFailures.java:70)
	at org.apache.lucene.util.TestRuleIgnoreTestSuites$1.evaluate(TestRuleIgnoreTestSuites.java:55)
	at com.carrotsearch.randomizedtesting.RandomizedRunner.runSuite(RandomizedRunner.java:605)
	at com.carrotsearch.randomizedtesting.RandomizedRunner.access$400(RandomizedRunner.java:132)
	at com.carrotsearch.randomizedtesting.RandomizedRunner$2.run(RandomizedRunner.java:551)




Build Log:
[...truncated 7511 lines...]
[junit4:junit4] Suite: org.apache.solr.handler.component.DistributedQueryElevationComponentTest
[junit4:junit4] FAILURE 1.25s J0 | DistributedQueryElevationComponentTest.testDistribSearch
[junit4:junit4]    > Throwable #1: junit.framework.AssertionFailedError: .responseHeader.params.size()==9,9skipped=4,5
[junit4:junit4]    > 	at __randomizedtesting.SeedInfo.seed([C8A0A39FF82453F8:49462D878F7B33C4]:0)
[junit4:junit4]    > 	at junit.framework.Assert.fail(Assert.java:50)
[junit4:junit4]    > 	at org.apache.solr.BaseDistributedSearchTestCase.compareResponses(BaseDistributedSearchTestCase.java:670)
[junit4:junit4]    > 	at org.apache.solr.BaseDistributedSearchTestCase.query(BaseDistributedSearchTestCase.java:392)
[junit4:junit4]    > 	at org.apache.solr.handler.component.DistributedQueryElevationComponentTest.doTest(DistributedQueryElevationComponentTest.java:81)
[junit4:junit4]    > 	at org.apache.solr.BaseDistributedSearchTestCase.testDistribSearch(BaseDistributedSearchTestCase.java:679)
[junit4:junit4]    > 	at sun.reflect.NativeMethodAccessorImpl.invoke0(Native Method)
[junit4:junit4]    > 	at sun.reflect.NativeMethodAccessorImpl.invoke(NativeMethodAccessorImpl.java:57)
[junit4:junit4]    > 	at sun.reflect.DelegatingMethodAccessorImpl.invoke(DelegatingMethodAccessorImpl.java:43)
[junit4:junit4]    > 	at java.lang.reflect.Method.invoke(Method.java:474)
[junit4:junit4]    > 	at com.carrotsearch.randomizedtesting.RandomizedRunner.invoke(RandomizedRunner.java:1995)
[junit4:junit4]    > 	at com.carrotsearch.randomizedtesting.RandomizedRunner.access$1100(RandomizedRunner.java:132)
[junit4:junit4]    > 	at com.carrotsearch.randomizedtesting.RandomizedRunner$6.evaluate(RandomizedRunner.java:818)
[junit4:junit4]    > 	at com.carrotsearch.randomizedtesting.RandomizedRunner$7.evaluate(RandomizedRunner.java:877)
[junit4:junit4]    > 	at com.carrotsearch.randomizedtesting.RandomizedRunner$8.evaluate(RandomizedRunner.java:891)
[junit4:junit4]    > 	at com.carrotsearch.randomizedtesting.rules.SystemPropertiesRestoreRule$1.evaluate(SystemPropertiesRestoreRule.java:53)
[junit4:junit4]    > 	at org.apache.lucene.util.TestRuleSetupTeardownChained$1.evaluate(TestRuleSetupTeardownChained.java:50)
[junit4:junit4]    > 	at org.apache.lucene.util.TestRuleFieldCacheSanity$1.evaluate(TestRuleFieldCacheSanity.java:32)
[junit4:junit4]    > 	at org.apache.lucene.util.AbstractBeforeAfterRule$1.evaluate(AbstractBeforeAfterRule.java:45)
[junit4:junit4]    > 	at com.carrotsearch.randomizedtesting.rules.SystemPropertiesInvariantRule$1.evaluate(SystemPropertiesInvariantRule.java:55)
[junit4:junit4]    > 	at org.apache.lucene.util.TestRuleReportUncaughtExceptions$1.evaluate(TestRuleReportUncaughtExceptions.java:68)
[junit4:junit4]    > 	at org.apache.lucene.util.TestRuleThreadAndTestName$1.evaluate(TestRuleThreadAndTestName.java:48)
[junit4:junit4]    > 	at org.apache.lucene.util.TestRuleIgnoreAfterMaxFailures$1.evaluate(TestRuleIgnoreAfterMaxFailures.java:70)
[junit4:junit4]    > 	at org.apache.lucene.util.TestRuleMarkFailure$1.evaluate(TestRuleMarkFailure.java:48)
[junit4:junit4]    > 	at com.carrotsearch.randomizedtesting.RandomizedRunner.runSingleTest(RandomizedRunner.java:825)
[junit4:junit4]    > 	at com.carrotsearch.randomizedtesting.RandomizedRunner.access$700(RandomizedRunner.java:132)
[junit4:junit4]    > 	at com.carrotsearch.randomizedtesting.RandomizedRunner$3$1.run(RandomizedRunner.java:671)
[junit4:junit4]    > 	at com.carrotsearch.randomizedtesting.RandomizedRunner$3.evaluate(RandomizedRunner.java:697)
[junit4:junit4]    > 	at com.carrotsearch.randomizedtesting.RandomizedRunner$4.evaluate(RandomizedRunner.java:736)
[junit4:junit4]    > 	at com.carrotsearch.randomizedtesting.RandomizedRunner$5.evaluate(RandomizedRunner.java:747)
[junit4:junit4]    > 	at com.carrotsearch.randomizedtesting.rules.SystemPropertiesRestoreRule$1.evaluate(SystemPropertiesRestoreRule.java:53)
[junit4:junit4]    > 	at org.apache.lucene.util.AbstractBeforeAfterRule$1.evaluate(AbstractBeforeAfterRule.java:45)
[junit4:junit4]    > 	at org.apache.lucene.util.TestRuleReportUncaughtExceptions$1.evaluate(TestRuleReportUncaughtExceptions.java:68)
[junit4:junit4]    > 	at org.apache.lucene.util.TestRuleStoreClassName$1.evaluate(TestRuleStoreClassName.java:38)
[junit4:junit4]    > 	at com.carrotsearch.randomizedtesting.rules.SystemPropertiesInvariantRule$1.evaluate(SystemPropertiesInvariantRule.java:55)
[junit4:junit4]    > 	at org.apache.lucene.util.TestRuleNoInstanceHooksOverrides$1.evaluate(TestRuleNoInstanceHooksOverrides.java:53)
[junit4:junit4]    > 	at org.apache.lucene.util.TestRuleNoStaticHooksShadowing$1.evaluate(TestRuleNoStaticHooksShadowing.java:52)
[junit4:junit4]    > 	at org.apache.lucene.util.TestRuleAssertionsRequired$1.evaluate(TestRuleAssertionsRequired.java:36)
[junit4:junit4]    > 	at org.apache.lucene.util.TestRuleMarkFailure$1.evaluate(TestRuleMarkFailure.java:48)
[junit4:junit4]    > 	at org.apache.lucene.util.TestRuleIgnoreAfterMaxFailures$1.evaluate(TestRuleIgnoreAfterMaxFailures.java:70)
[junit4:junit4]    > 	at org.apache.lucene.util.TestRuleIgnoreTestSuites$1.evaluate(TestRuleIgnoreTestSuites.java:55)
[junit4:junit4]    > 	at com.carrotsearch.randomizedtesting.RandomizedRunner.runSuite(RandomizedRunner.java:605)
[junit4:junit4]    > 	at com.carrotsearch.randomizedtesting.RandomizedRunner.access$400(RandomizedRunner.java:132)
[junit4:junit4]    > 	at com.carrotsearch.randomizedtesting.RandomizedRunner$2.run(RandomizedRunner.java:551)
[junit4:junit4]    > 
[junit4:junit4]   2> 1 T2791 oas.SolrTestCaseJ4.setUp ###Starting testDistribSearch
[junit4:junit4]   2> 1 T2791 oejs.Server.doStart jetty-8.1.2.v20120308
[junit4:junit4]   2> 3 T2791 oejs.AbstractConnector.doStart Started SocketConnector@0.0.0.0:33736
[junit4:junit4]   2> 3 T2791 oasc.SolrResourceLoader.locateSolrHome JNDI not configured for solr (NoInitialContextEx)
[junit4:junit4]   2> 3 T2791 oasc.SolrResourceLoader.locateSolrHome using system property solr.solr.home: /mnt/ssd/jenkins/workspace/Lucene-Solr-trunk-Linux/checkout/solr/build/solr-core/test-files/solr
[junit4:junit4]   2> 3 T2791 oasc.SolrResourceLoader.<init> new SolrResourceLoader for deduced Solr Home: '/mnt/ssd/jenkins/workspace/Lucene-Solr-trunk-Linux/checkout/solr/build/solr-core/test-files/solr/'
[junit4:junit4]   2> 9 T2791 oass.SolrDispatchFilter.init SolrDispatchFilter.init()
[junit4:junit4]   2> 10 T2791 oasc.SolrResourceLoader.locateSolrHome JNDI not configured for solr (NoInitialContextEx)
[junit4:junit4]   2> 10 T2791 oasc.SolrResourceLoader.locateSolrHome using system property solr.solr.home: /mnt/ssd/jenkins/workspace/Lucene-Solr-trunk-Linux/checkout/solr/build/solr-core/test-files/solr
[junit4:junit4]   2> 10 T2791 oasc.CoreContainer$Initializer.initialize looking for solr.xml: /mnt/ssd/jenkins/workspace/Lucene-Solr-trunk-Linux/checkout/solr/build/solr-core/test-files/solr/solr.xml
[junit4:junit4]   2> 10 T2791 oasc.CoreContainer.<init> New CoreContainer 1426199815
[junit4:junit4]   2> 10 T2791 oasc.CoreContainer.load Loading CoreContainer using Solr Home: '/mnt/ssd/jenkins/workspace/Lucene-Solr-trunk-Linux/checkout/solr/build/solr-core/test-files/solr/'
[junit4:junit4]   2> 11 T2791 oasc.SolrResourceLoader.<init> new SolrResourceLoader for directory: '/mnt/ssd/jenkins/workspace/Lucene-Solr-trunk-Linux/checkout/solr/build/solr-core/test-files/solr/'
[junit4:junit4]   2> 18 T2791 oasc.CoreContainer.load Registering Log Listener
[junit4:junit4]   2> 26 T2791 oasc.CoreContainer.create Creating SolrCore 'collection1' using instanceDir: /mnt/ssd/jenkins/workspace/Lucene-Solr-trunk-Linux/checkout/solr/build/solr-core/test-files/solr/collection1
[junit4:junit4]   2> 26 T2791 oasc.SolrResourceLoader.<init> new SolrResourceLoader for directory: '/mnt/ssd/jenkins/workspace/Lucene-Solr-trunk-Linux/checkout/solr/build/solr-core/test-files/solr/collection1/'
[junit4:junit4]   2> 27 T2791 oasc.SolrResourceLoader.replaceClassLoader Adding 'file:/mnt/ssd/jenkins/workspace/Lucene-Solr-trunk-Linux/checkout/solr/build/solr-core/test-files/solr/collection1/lib/README' to classloader
[junit4:junit4]   2> 27 T2791 oasc.SolrResourceLoader.replaceClassLoader Adding 'file:/mnt/ssd/jenkins/workspace/Lucene-Solr-trunk-Linux/checkout/solr/build/solr-core/test-files/solr/collection1/lib/classes/' to classloader
[junit4:junit4]   2> 49 T2791 oasc.SolrConfig.<init> Using Lucene MatchVersion: LUCENE_50
[junit4:junit4]   2> 74 T2791 oasc.SolrConfig.<init> Loaded SolrConfig: solrconfig-elevate.xml
[junit4:junit4]   2> 75 T2791 oass.IndexSchema.readSchema Reading Solr Schema
[junit4:junit4]   2> 76 T2791 oass.IndexSchema.readSchema Schema name=example
[junit4:junit4]   2> 183 T2791 oass.IndexSchema.readSchema default search field in schema is text
[junit4:junit4]   2> 185 T2791 oass.IndexSchema.readSchema unique key field: id
[junit4:junit4]   2> 187 T2791 oasc.SolrCore.<init> [collection1] Opening new SolrCore at /mnt/ssd/jenkins/workspace/Lucene-Solr-trunk-Linux/checkout/solr/build/solr-core/test-files/solr/collection1/, dataDir=./org.apache.solr.handler.component.DistributedQueryElevationComponentTest-1343607533867/control/data/
[junit4:junit4]   2> 187 T2791 oasc.JmxMonitoredMap.<init> JMX monitoring is enabled. Adding Solr mbeans to JMX Server: com.sun.jmx.mbeanserver.JmxMBeanServer@39b4cec7
[junit4:junit4]   2> 187 T2791 oasc.SolrCore.getNewIndexDir WARNING New index directory detected: old=null new=./org.apache.solr.handler.component.DistributedQueryElevationComponentTest-1343607533867/control/data/index/
[junit4:junit4]   2> 188 T2791 oasc.SolrCore.initIndex WARNING [collection1] Solr index directory './org.apache.solr.handler.component.DistributedQueryElevationComponentTest-1343607533867/control/data/index' doesn't exist. Creating new index...
[junit4:junit4]   2> 188 T2791 oasc.SolrDeletionPolicy.onCommit SolrDeletionPolicy.onCommit: commits:num=1
[junit4:junit4]   2> 		commit{dir=MockDirWrapper(org.apache.lucene.store.RAMDirectory@148d903 lockFactory=org.apache.lucene.store.SingleInstanceLockFactory@4f6c3b55),segFN=segments_1,generation=1,filenames=[segments_1]
[junit4:junit4]   2> 189 T2791 oasc.SolrDeletionPolicy.updateCommits newest commit = 1
[junit4:junit4]   2> 189 T2791 oasc.RequestHandlers.initHandlersFromConfig created /update: solr.UpdateRequestHandler
[junit4:junit4]   2> 189 T2791 oasc.RequestHandlers.initHandlersFromConfig created /elevate: org.apache.solr.handler.component.SearchHandler
[junit4:junit4]   2> 190 T2791 oasc.RequestHandlers.initHandlersFromConfig created /dataElevate: org.apache.solr.handler.component.SearchHandler
[junit4:junit4]   2> 190 T2791 oashl.XMLLoader.init xsltCacheLifetimeSeconds=60
[junit4:junit4]   2> 190 T2791 oasc.RequestHandlers.initHandlersFromConfig WARNING no default request handler is registered (either '/select' or 'standard')
[junit4:junit4]   2> 191 T2791 oasc.SolrCore.initDeprecatedSupport WARNING solrconfig.xml uses deprecated <admin/gettableFiles>, Please update your config to use the ShowFileRequestHandler.
[junit4:junit4]   2> 192 T2791 oasc.SolrCore.initDeprecatedSupport WARNING adding ShowFileRequestHandler with hidden files: [BAD-MP-SOLRCONFIG.XML, SCHEMA-BM25.XML, PROTWORDS.TXT, SCHEMA-STOP-KEEP.XML, STOP-2.TXT, SCHEMA-NUMERIC.XML, SCHEMA-NOT-REQUIRED-UNIQUE-KEY.XML, SOLRCONFIG-TRANSFORMERS.XML, BAD-SCHEMA-DUP-FIELDTYPE.XML, SOLRCONFIG-TLOG.XML, SOLRCONFIG-NOCACHE.XML, SOLRCONFIG-MERGEPOLICY.XML, ELEVATE.XML, SOLRCONFIG-TERMINDEX.XML, SOLRCONFIG-DELPOLICY2.XML, TRIVIAL.UPDATEPROCESSOR0.JS, SOLRCONFIG-ENABLEPLUGIN.XML, SOLRCONFIG-QUERYSENDER.XML, SOLRCONFIG-MASTER1.XML, STOP-SNOWBALL.TXT, SOLRCONFIG-SPELLCHECKER.XML, SOLRCONFIG-SOLR-749.XML, SOLRCONFIG-MASTER1-KEEPONEBACKUP.XML, BAD-SCHEMA-EXTERNAL-FILEFIELD.XML, SOLRCONFIG-MASTER3.XML, DA_UTF8.XML, BAD-SCHEMA-NOT-INDEXED-BUT-TF.XML, SCHEMA-PHRASESUGGEST.XML, SOLRCONFIG-DELPOLICY1.XML, BAD-SOLRCONFIG-MISSING-SCRIPTFILE.XML, CONDITIONAL.UPDATEPROCESSOR.JS, SCHEMA-LMJELINEKMERCER.XML, SOLRCONFIG-PROPINJECT.XML, BAD-SCHEMA-DUP-FIELD.XML, SCHEMA-COLLATE.XML, SOLRCONFIG-MASTER.XML, SCHEMA-MINIMAL.XML, THROW.ERROR.ON.ADD.UPDATEPROCESSOR.JS, SOLRCONFIG_PERF.XML, STEMDICT.TXT, COMPOUNDDICTIONARY.TXT, STOPWORDS.TXT, HUNSPELL-TEST.DIC, KEEP-1.TXT, SCHEMA.XML, SOLRCONFIG-SPELLCHECKCOMPONENT.XML, OPEN-EXCHANGE-RATES.JSON, HUNSPELL-TEST.AFF, STOP-1.TXT, BAD-SCHEMA-UNIQUEKEY-IS-COPYFIELD-DEST.XML, SCHEMA-REQUIRED-FIELDS.XML, STOPWITHBOM.TXT, SOLRCONFIG-SCRIPT-UPDATEPROCESSOR.XML, SCHEMA-LUCENEMATCHVERSION.XML, SOLRCONFIG-CACHING.XML, TRIVIAL.UPDATEPROCESSOR1.JS, SCHEMA11.XML, SOLRCONFIG-LAZYWRITER.XML, STOPTYPES-2.TXT, BAD-SCHEMA-NONTEXT-ANALYZER.XML, SOLRCONFIG-SLAVE1.XML, SCHEMA-IB.XML, SOLRCONFIG-ELEVATE.XML, SOLRCONFIG-XINCLUDE.XML, SOLRCONFIG-SLAVE.XML, SOLRCONFIG_CODEC.XML, MAPPING-ISOLATIN1ACCENT.TXT, SOLRCONFIG-HIGHLIGHT.XML, STOPWORDSWRONGENCODING.TXT, KEEP-2.TXT, SOLRCONFIG-MASTER2.XML, SYNONYMS.TXT, SOLRCONFIG-SIMPLELOCK.XML, SOLRCONFIG-SOLCOREPROPERTIES.XML, BAD_SOLRCONFIG.XML, SCHEMA-DFR.XML, BAD-SCHEMA-UNIQUEKEY-USES-DEFAULT.XML, SCHEMA-REPLICATION1.XML, SOLRCONFIG-ALTDIRECTORY.XML, SCHEMASURROUND.XML, SCHEMA-FOLDING.XML, SOLRCONFIG-QUERYSENDER-NOQUERY.XML, SCHEMA-REVERSED.XML, XSLT, CURRENCY.XML, SCHEMA_CODEC.XML, SOLRCONFIG-PHRASESUGGEST.XML, WDFTYPES.TXT, SOLRCONFIG-FUNCTIONQUERY.XML, SCHEMA12.XML, SCHEMA-CHARFILTERS.XML, SCHEMA-SIM.XML, FRENCHARTICLES.TXT, MISSING.FUNCTIONS.UPDATEPROCESSOR.JS, SCHEMA-TRIE.XML, SCHEMA-COPYFIELD-TEST.XML, SOLRCONFIG-UPDATE-PROCESSOR-CHAINS.XML, SCHEMA-TFIDF.XML, SOLRCONFIG-REPEATER.XML, STOPTYPES-1.TXT, BAD-SOLRCONFIG-BOGUS-SCRIPTENGINE-NAME.XML, BAD-SCHEMA-OMIT-TF-BUT-NOT-POS.XML, SOLRCONFIG-BASIC.XML, SCHEMA-SPELLCHECKER.XML, SCHEMA15.XML, SOLRCONFIG-NATIVELOCK.XML, OLD_SYNONYMS.TXT, DA_COMPOUNDDICTIONARY.TXT, SCHEMA-BINARYFIELD.XML, SCHEMA-REPLICATION2.XML, MISSLEADING.EXTENSION.UPDATEPROCESSOR.JS.TXT, PHRASESUGGEST.TXT, BAD-SCHEMA-NOT-INDEXED-BUT-POS.XML, HYPHENATION.DTD, ADDFIELDS.UPDATEPROCESSOR.JS, SOLRCONFIG-PROPINJECT-INDEXDEFAULT.XML, BAD-SCHEMA-CODEC-GLOBAL-VS-FT-MISMATCH.XML, SOLRCONFIG-REQHANDLER.INCL, BAD-SCHEMA-SIM-GLOBAL-VS-FT-MISMATCH.XML, BAD-SOLRCONFIG-INVALID-SCRIPTFILE.XML, BAD-SCHEMA-NOT-INDEXED-BUT-NORMS.XML, SCHEMA-LMDIRICHLET.XML, BAD-SCHEMA-DUP-DYNAMICFIELD.XML]
[junit4:junit4]   2> 193 T2791 oass.SolrIndexSearcher.<init> Opening Searcher@71defd main
[junit4:junit4]   2> 193 T2791 oass.SolrIndexSearcher.getIndexDir WARNING WARNING: Directory impl does not support setting indexDir: org.apache.lucene.store.MockDirectoryWrapper
[junit4:junit4]   2> 193 T2791 oasu.CommitTracker.<init> Hard AutoCommit: disabled
[junit4:junit4]   2> 194 T2791 oasu.CommitTracker.<init> Soft AutoCommit: disabled
[junit4:junit4]   2> 194 T2791 oashc.QueryElevationComponent.inform Loading QueryElevation from: /mnt/ssd/jenkins/workspace/Lucene-Solr-trunk-Linux/checkout/solr/build/solr-core/test-files/solr/collection1/conf/elevate.xml
[junit4:junit4]   2> 199 T2791 oashc.QueryElevationComponent.inform Loading QueryElevation from: /mnt/ssd/jenkins/workspace/Lucene-Solr-trunk-Linux/checkout/solr/build/solr-core/test-files/solr/collection1/conf/elevate.xml
[junit4:junit4]   2> 203 T2791 oashc.HttpShardHandlerFactory.getParameter Setting socketTimeout to: 0
[junit4:junit4]   2> 204 T2791 oashc.HttpShardHandlerFactory.getParameter Setting urlScheme to: http://
[junit4:junit4]   2> 204 T2791 oashc.HttpShardHandlerFactory.getParameter Setting connTimeout to: 0
[junit4:junit4]   2> 204 T2791 oashc.HttpShardHandlerFactory.getParameter Setting maxConnectionsPerHost to: 20
[junit4:junit4]   2> 204 T2791 oashc.HttpShardHandlerFactory.getParameter Setting corePoolSize to: 0
[junit4:junit4]   2> 205 T2791 oashc.HttpShardHandlerFactory.getParameter Setting maximumPoolSize to: 2147483647
[junit4:junit4]   2> 205 T2791 oashc.HttpShardHandlerFactory.getParameter Setting maxThreadIdleTime to: 5
[junit4:junit4]   2> 205 T2791 oashc.HttpShardHandlerFactory.getParameter Setting sizeOfQueue to: -1
[junit4:junit4]   2> 205 T2791 oashc.HttpShardHandlerFactory.getParameter Setting fairnessPolicy to: false
[junit4:junit4]   2> 205 T2791 oascsi.HttpClientUtil.createClient Creating new http client, config:maxConnectionsPerHost=20&maxConnections=10000&socketTimeout=0&connTimeout=0&retry=false
[junit4:junit4]   2> 207 T2801 oasc.SolrCore.registerSearcher [collection1] Registered new searcher Searcher@71defd main{StandardDirectoryReader(segments_1:1)}
[junit4:junit4]   2> 207 T2791 oasc.CoreContainer.register registering core: collection1
[junit4:junit4]   2> 207 T2791 oass.SolrDispatchFilter.init user.dir=/mnt/ssd/jenkins/workspace/Lucene-Solr-trunk-Linux/checkout/solr/build/solr-core/test/J0
[junit4:junit4]   2> 208 T2791 oass.SolrDispatchFilter.init SolrDispatchFilter.init() done
[junit4:junit4]   2> 208 T2791 oascsi.HttpClientUtil.createClient Creating new http client, config:maxConnections=128&maxConnectionsPerHost=32&followRedirects=false
[junit4:junit4]   2> 209 T2791 oejs.Server.doStart jetty-8.1.2.v20120308
[junit4:junit4]   2> 211 T2791 oejs.AbstractConnector.doStart Started SocketConnector@0.0.0.0:54592
[junit4:junit4]   2> 211 T2791 oasc.SolrResourceLoader.locateSolrHome JNDI not configured for solr (NoInitialContextEx)
[junit4:junit4]   2> 211 T2791 oasc.SolrResourceLoader.locateSolrHome using system property solr.solr.home: /mnt/ssd/jenkins/workspace/Lucene-Solr-trunk-Linux/checkout/solr/build/solr-core/test-files/solr
[junit4:junit4]   2> 212 T2791 oasc.SolrResourceLoader.<init> new SolrResourceLoader for deduced Solr Home: '/mnt/ssd/jenkins/workspace/Lucene-Solr-trunk-Linux/checkout/solr/build/solr-core/test-files/solr/'
[junit4:junit4]   2> 217 T2791 oass.SolrDispatchFilter.init SolrDispatchFilter.init()
[junit4:junit4]   2> 217 T2791 oasc.SolrResourceLoader.locateSolrHome JNDI not configured for solr (NoInitialContextEx)
[junit4:junit4]   2> 217 T2791 oasc.SolrResourceLoader.locateSolrHome using system property solr.solr.home: /mnt/ssd/jenkins/workspace/Lucene-Solr-trunk-Linux/checkout/solr/build/solr-core/test-files/solr
[junit4:junit4]   2> 218 T2791 oasc.CoreContainer$Initializer.initialize looking for solr.xml: /mnt/ssd/jenkins/workspace/Lucene-Solr-trunk-Linux/checkout/solr/build/solr-core/test-files/solr/solr.xml
[junit4:junit4]   2> 218 T2791 oasc.CoreContainer.<init> New CoreContainer 1734799568
[junit4:junit4]   2> 218 T2791 oasc.CoreContainer.load Loading CoreContainer using Solr Home: '/mnt/ssd/jenkins/workspace/Lucene-Solr-trunk-Linux/checkout/solr/build/solr-core/test-files/solr/'
[junit4:junit4]   2> 218 T2791 oasc.SolrResourceLoader.<init> new SolrResourceLoader for directory: '/mnt/ssd/jenkins/workspace/Lucene-Solr-trunk-Linux/checkout/solr/build/solr-core/test-files/solr/'
[junit4:junit4]   2> 225 T2791 oasc.CoreContainer.load Registering Log Listener
[junit4:junit4]   2> 233 T2791 oasc.CoreContainer.create Creating SolrCore 'collection1' using instanceDir: /mnt/ssd/jenkins/workspace/Lucene-Solr-trunk-Linux/checkout/solr/build/solr-core/test-files/solr/collection1
[junit4:junit4]   2> 233 T2791 oasc.SolrResourceLoader.<init> new SolrResourceLoader for directory: '/mnt/ssd/jenkins/workspace/Lucene-Solr-trunk-Linux/checkout/solr/build/solr-core/test-files/solr/collection1/'
[junit4:junit4]   2> 234 T2791 oasc.SolrResourceLoader.replaceClassLoader Adding 'file:/mnt/ssd/jenkins/workspace/Lucene-Solr-trunk-Linux/checkout/solr/build/solr-core/test-files/solr/collection1/lib/README' to classloader
[junit4:junit4]   2> 234 T2791 oasc.SolrResourceLoader.replaceClassLoader Adding 'file:/mnt/ssd/jenkins/workspace/Lucene-Solr-trunk-Linux/checkout/solr/build/solr-core/test-files/solr/collection1/lib/classes/' to classloader
[junit4:junit4]   2> 249 T2791 oasc.SolrConfig.<init> Using Lucene MatchVersion: LUCENE_50
[junit4:junit4]   2> 273 T2791 oasc.SolrConfig.<init> Loaded SolrConfig: solrconfig-elevate.xml
[junit4:junit4]   2> 273 T2791 oass.IndexSchema.readSchema Reading Solr Schema
[junit4:junit4]   2> 275 T2791 oass.IndexSchema.readSchema Schema name=example
[junit4:junit4]   2> 386 T2791 oass.IndexSchema.readSchema default search field in schema is text
[junit4:junit4]   2> 388 T2791 oass.IndexSchema.readSchema unique key field: id
[junit4:junit4]   2> 390 T2791 oasc.SolrCore.<init> [collection1] Opening new SolrCore at /mnt/ssd/jenkins/workspace/Lucene-Solr-trunk-Linux/checkout/solr/build/solr-core/test-files/solr/collection1/, dataDir=./org.apache.solr.handler.component.DistributedQueryElevationComponentTest-1343607533867/shard0/data/
[junit4:junit4]   2> 390 T2791 oasc.JmxMonitoredMap.<init> JMX monitoring is enabled. Adding Solr mbeans to JMX Server: com.sun.jmx.mbeanserver.JmxMBeanServer@39b4cec7
[junit4:junit4]   2> 390 T2791 oasc.SolrCore.getNewIndexDir WARNING New index directory detected: old=null new=./org.apache.solr.handler.component.DistributedQueryElevationComponentTest-1343607533867/shard0/data/index/
[junit4:junit4]   2> 391 T2791 oasc.SolrCore.initIndex WARNING [collection1] Solr index directory './org.apache.solr.handler.component.DistributedQueryElevationComponentTest-1343607533867/shard0/data/index' doesn't exist. Creating new index...
[junit4:junit4]   2> 392 T2791 oasc.SolrDeletionPolicy.onCommit SolrDeletionPolicy.onCommit: commits:num=1
[junit4:junit4]   2> 		commit{dir=MockDirWrapper(org.apache.lucene.store.SimpleFSDirectory@/mnt/ssd/jenkins/workspace/Lucene-Solr-trunk-Linux/checkout/solr/build/solr-core/test/J0/index3056730576tmp lockFactory=org.apache.lucene.store.SingleInstanceLockFactory@32165747),segFN=segments_1,generation=1,filenames=[segments_1]
[junit4:junit4]   2> 393 T2791 oasc.SolrDeletionPolicy.updateCommits newest commit = 1
[junit4:junit4]   2> 393 T2791 oasc.RequestHandlers.initHandlersFromConfig created /update: solr.UpdateRequestHandler
[junit4:junit4]   2> 394 T2791 oasc.RequestHandlers.initHandlersFromConfig created /elevate: org.apache.solr.handler.component.SearchHandler
[junit4:junit4]   2> 394 T2791 oasc.RequestHandlers.initHandlersFromConfig created /dataElevate: org.apache.solr.handler.component.SearchHandler
[junit4:junit4]   2> 394 T2791 oashl.XMLLoader.init xsltCacheLifetimeSeconds=60
[junit4:junit4]   2> 395 T2791 oasc.RequestHandlers.initHandlersFromConfig WARNING no default request handler is registered (either '/select' or 'standard')
[junit4:junit4]   2> 395 T2791 oasc.SolrCore.initDeprecatedSupport WARNING solrconfig.xml uses deprecated <admin/gettableFiles>, Please update your config to use the ShowFileRequestHandler.
[junit4:junit4]   2> 396 T2791 oasc.SolrCore.initDeprecatedSupport WARNING adding ShowFileRequestHandler with hidden files: [BAD-MP-SOLRCONFIG.XML, SCHEMA-BM25.XML, PROTWORDS.TXT, SCHEMA-STOP-KEEP.XML, STOP-2.TXT, SCHEMA-NUMERIC.XML, SCHEMA-NOT-REQUIRED-UNIQUE-KEY.XML, SOLRCONFIG-TRANSFORMERS.XML, BAD-SCHEMA-DUP-FIELDTYPE.XML, SOLRCONFIG-TLOG.XML, SOLRCONFIG-NOCACHE.XML, SOLRCONFIG-MERGEPOLICY.XML, ELEVATE.XML, SOLRCONFIG-TERMINDEX.XML, SOLRCONFIG-DELPOLICY2.XML, TRIVIAL.UPDATEPROCESSOR0.JS, SOLRCONFIG-ENABLEPLUGIN.XML, SOLRCONFIG-QUERYSENDER.XML, SOLRCONFIG-MASTER1.XML, STOP-SNOWBALL.TXT, SOLRCONFIG-SPELLCHECKER.XML, SOLRCONFIG-SOLR-749.XML, SOLRCONFIG-MASTER1-KEEPONEBACKUP.XML, BAD-SCHEMA-EXTERNAL-FILEFIELD.XML, SOLRCONFIG-MASTER3.XML, DA_UTF8.XML, BAD-SCHEMA-NOT-INDEXED-BUT-TF.XML, SCHEMA-PHRASESUGGEST.XML, SOLRCONFIG-DELPOLICY1.XML, BAD-SOLRCONFIG-MISSING-SCRIPTFILE.XML, CONDITIONAL.UPDATEPROCESSOR.JS, SCHEMA-LMJELINEKMERCER.XML, SOLRCONFIG-PROPINJECT.XML, BAD-SCHEMA-DUP-FIELD.XML, SCHEMA-COLLATE.XML, SOLRCONFIG-MASTER.XML, SCHEMA-MINIMAL.XML, THROW.ERROR.ON.ADD.UPDATEPROCESSOR.JS, SOLRCONFIG_PERF.XML, STEMDICT.TXT, COMPOUNDDICTIONARY.TXT, STOPWORDS.TXT, HUNSPELL-TEST.DIC, KEEP-1.TXT, SCHEMA.XML, SOLRCONFIG-SPELLCHECKCOMPONENT.XML, OPEN-EXCHANGE-RATES.JSON, HUNSPELL-TEST.AFF, STOP-1.TXT, BAD-SCHEMA-UNIQUEKEY-IS-COPYFIELD-DEST.XML, SCHEMA-REQUIRED-FIELDS.XML, STOPWITHBOM.TXT, SOLRCONFIG-SCRIPT-UPDATEPROCESSOR.XML, SCHEMA-LUCENEMATCHVERSION.XML, SOLRCONFIG-CACHING.XML, TRIVIAL.UPDATEPROCESSOR1.JS, SCHEMA11.XML, SOLRCONFIG-LAZYWRITER.XML, STOPTYPES-2.TXT, BAD-SCHEMA-NONTEXT-ANALYZER.XML, SOLRCONFIG-SLAVE1.XML, SCHEMA-IB.XML, SOLRCONFIG-ELEVATE.XML, SOLRCONFIG-XINCLUDE.XML, SOLRCONFIG-SLAVE.XML, SOLRCONFIG_CODEC.XML, MAPPING-ISOLATIN1ACCENT.TXT, SOLRCONFIG-HIGHLIGHT.XML, STOPWORDSWRONGENCODING.TXT, KEEP-2.TXT, SOLRCONFIG-MASTER2.XML, SYNONYMS.TXT, SOLRCONFIG-SIMPLELOCK.XML, SOLRCONFIG-SOLCOREPROPERTIES.XML, BAD_SOLRCONFIG.XML, SCHEMA-DFR.XML, BAD-SCHEMA-UNIQUEKEY-USES-DEFAULT.XML, SCHEMA-REPLICATION1.XML, SOLRCONFIG-ALTDIRECTORY.XML, SCHEMASURROUND.XML, SCHEMA-FOLDING.XML, SOLRCONFIG-QUERYSENDER-NOQUERY.XML, SCHEMA-REVERSED.XML, XSLT, CURRENCY.XML, SCHEMA_CODEC.XML, SOLRCONFIG-PHRASESUGGEST.XML, WDFTYPES.TXT, SOLRCONFIG-FUNCTIONQUERY.XML, SCHEMA12.XML, SCHEMA-CHARFILTERS.XML, SCHEMA-SIM.XML, FRENCHARTICLES.TXT, MISSING.FUNCTIONS.UPDATEPROCESSOR.JS, SCHEMA-TRIE.XML, SCHEMA-COPYFIELD-TEST.XML, SOLRCONFIG-UPDATE-PROCESSOR-CHAINS.XML, SCHEMA-TFIDF.XML, SOLRCONFIG-REPEATER.XML, STOPTYPES-1.TXT, BAD-SOLRCONFIG-BOGUS-SCRIPTENGINE-NAME.XML, BAD-SCHEMA-OMIT-TF-BUT-NOT-POS.XML, SOLRCONFIG-BASIC.XML, SCHEMA-SPELLCHECKER.XML, SCHEMA15.XML, SOLRCONFIG-NATIVELOCK.XML, OLD_SYNONYMS.TXT, DA_COMPOUNDDICTIONARY.TXT, SCHEMA-BINARYFIELD.XML, SCHEMA-REPLICATION2.XML, MISSLEADING.EXTENSION.UPDATEPROCESSOR.JS.TXT, PHRASESUGGEST.TXT, BAD-SCHEMA-NOT-INDEXED-BUT-POS.XML, HYPHENATION.DTD, ADDFIELDS.UPDATEPROCESSOR.JS, SOLRCONFIG-PROPINJECT-INDEXDEFAULT.XML, BAD-SCHEMA-CODEC-GLOBAL-VS-FT-MISMATCH.XML, SOLRCONFIG-REQHANDLER.INCL, BAD-SCHEMA-SIM-GLOBAL-VS-FT-MISMATCH.XML, BAD-SOLRCONFIG-INVALID-SCRIPTFILE.XML, BAD-SCHEMA-NOT-INDEXED-BUT-NORMS.XML, SCHEMA-LMDIRICHLET.XML, BAD-SCHEMA-DUP-DYNAMICFIELD.XML]
[junit4:junit4]   2> 398 T2791 oass.SolrIndexSearcher.<init> Opening Searcher@4412154c main
[junit4:junit4]   2> 398 T2791 oass.SolrIndexSearcher.getIndexDir WARNING WARNING: Directory impl does not support setting indexDir: org.apache.lucene.store.MockDirectoryWrapper
[junit4:junit4]   2> 398 T2791 oasu.CommitTracker.<init> Hard AutoCommit: disabled
[junit4:junit4]   2> 399 T2791 oasu.CommitTracker.<init> Soft AutoCommit: disabled
[junit4:junit4]   2> 399 T2791 oashc.QueryElevationComponent.inform Loading QueryElevation from: /mnt/ssd/jenkins/workspace/Lucene-Solr-trunk-Linux/checkout/solr/build/solr-core/test-files/solr/collection1/conf/elevate.xml
[junit4:junit4]   2> 404 T2791 oashc.QueryElevationComponent.inform Loading QueryElevation from: /mnt/ssd/jenkins/workspace/Lucene-Solr-trunk-Linux/checkout/solr/build/solr-core/test-files/solr/collection1/conf/elevate.xml
[junit4:junit4]   2> 410 T2791 oashc.HttpShardHandlerFactory.getParameter Setting socketTimeout to: 0
[junit4:junit4]   2> 410 T2791 oashc.HttpShardHandlerFactory.getParameter Setting urlScheme to: http://
[junit4:junit4]   2> 410 T2791 oashc.HttpShardHandlerFactory.getParameter Setting connTimeout to: 0
[junit4:junit4]   2> 411 T2791 oashc.HttpShardHandlerFactory.getParameter Setting maxConnectionsPerHost to: 20
[junit4:junit4]   2> 411 T2791 oashc.HttpShardHandlerFactory.getParameter Setting corePoolSize to: 0
[junit4:junit4]   2> 411 T2791 oashc.HttpShardHandlerFactory.getParameter Setting maximumPoolSize to: 2147483647
[junit4:junit4]   2> 411 T2791 oashc.HttpShardHandlerFactory.getParameter Setting maxThreadIdleTime to: 5
[junit4:junit4]   2> 411 T2791 oashc.HttpShardHandlerFactory.getParameter Setting sizeOfQueue to: -1
[junit4:junit4]   2> 412 T2791 oashc.HttpShardHandlerFactory.getParameter Setting fairnessPolicy to: false
[junit4:junit4]   2> 412 T2791 oascsi.HttpClientUtil.createClient Creating new http client, config:maxConnectionsPerHost=20&maxConnections=10000&socketTimeout=0&connTimeout=0&retry=false
[junit4:junit4]   2> 414 T2811 oasc.SolrCore.registerSearcher [collection1] Registered new searcher Searcher@4412154c main{StandardDirectoryReader(segments_1:1)}
[junit4:junit4]   2> 414 T2791 oasc.CoreContainer.register registering core: collection1
[junit4:junit4]   2> 414 T2791 oass.SolrDispatchFilter.init user.dir=/mnt/ssd/jenkins/workspace/Lucene-Solr-trunk-Linux/checkout/solr/build/solr-core/test/J0
[junit4:junit4]   2> 414 T2791 oass.SolrDispatchFilter.init SolrDispatchFilter.init() done
[junit4:junit4]   2> 414 T2791 oascsi.HttpClientUtil.createClient Creating new http client, config:maxConnections=128&maxConnectionsPerHost=32&followRedirects=false
[junit4:junit4]   2> 416 T2791 oejs.Server.doStart jetty-8.1.2.v20120308
[junit4:junit4]   2> 418 T2791 oejs.AbstractConnector.doStart Started SocketConnector@0.0.0.0:57899
[junit4:junit4]   2> 418 T2791 oasc.SolrResourceLoader.locateSolrHome JNDI not configured for solr (NoInitialContextEx)
[junit4:junit4]   2> 419 T2791 oasc.SolrResourceLoader.locateSolrHome using system property solr.solr.home: /mnt/ssd/jenkins/workspace/Lucene-Solr-trunk-Linux/checkout/solr/build/solr-core/test-files/solr
[junit4:junit4]   2> 419 T2791 oasc.SolrResourceLoader.<init> new SolrResourceLoader for deduced Solr Home: '/mnt/ssd/jenkins/workspace/Lucene-Solr-trunk-Linux/checkout/solr/build/solr-core/test-files/solr/'
[junit4:junit4]   2> 426 T2791 oass.SolrDispatchFilter.init SolrDispatchFilter.init()
[junit4:junit4]   2> 426 T2791 oasc.SolrResourceLoader.locateSolrHome JNDI not configured for solr (NoInitialContextEx)
[junit4:junit4]   2> 426 T2791 oasc.SolrResourceLoader.locateSolrHome using system property solr.solr.home: /mnt/ssd/jenkins/workspace/Lucene-Solr-trunk-Linux/checkout/solr/build/solr-core/test-files/solr
[junit4:junit4]   2> 427 T2791 oasc.CoreContainer$Initializer.initialize looking for solr.xml: /mnt/ssd/jenkins/workspace/Lucene-Solr-trunk-Linux/checkout/solr/build/solr-core/test-files/solr/solr.xml
[junit4:junit4]   2> 427 T2791 oasc.CoreContainer.<init> New CoreContainer 550018804
[junit4:junit4]   2> 427 T2791 oasc.CoreContainer.load Loading CoreContainer using Solr Home: '/mnt/ssd/jenkins/workspace/Lucene-Solr-trunk-Linux/checkout/solr/build/solr-core/test-files/solr/'
[junit4:junit4]   2> 427 T2791 oasc.SolrResourceLoader.<init> new SolrResourceLoader for directory: '/mnt/ssd/jenkins/workspace/Lucene-Solr-trunk-Linux/checkout/solr/build/solr-core/test-files/solr/'
[junit4:junit4]   2> 435 T2791 oasc.CoreContainer.load Registering Log Listener
[junit4:junit4]   2> 445 T2791 oasc.CoreContainer.create Creating SolrCore 'collection1' using instanceDir: /mnt/ssd/jenkins/workspace/Lucene-Solr-trunk-Linux/checkout/solr/build/solr-core/test-files/solr/collection1
[junit4:junit4]   2> 445 T2791 oasc.SolrResourceLoader.<init> new SolrResourceLoader for directory: '/mnt/ssd/jenkins/workspace/Lucene-Solr-trunk-Linux/checkout/solr/build/solr-core/test-files/solr/collection1/'
[junit4:junit4]   2> 445 T2791 oasc.SolrResourceLoader.replaceClassLoader Adding 'file:/mnt/ssd/jenkins/workspace/Lucene-Solr-trunk-Linux/checkout/solr/build/solr-core/test-files/solr/collection1/lib/README' to classloader
[junit4:junit4]   2> 446 T2791 oasc.SolrResourceLoader.replaceClassLoader Adding 'file:/mnt/ssd/jenkins/workspace/Lucene-Solr-trunk-Linux/checkout/solr/build/solr-core/test-files/solr/collection1/lib/classes/' to classloader
[junit4:junit4]   2> 464 T2791 oasc.SolrConfig.<init> Using Lucene MatchVersion: LUCENE_50
[junit4:junit4]   2> 489 T2791 oasc.SolrConfig.<init> Loaded SolrConfig: solrconfig-elevate.xml
[junit4:junit4]   2> 490 T2791 oass.IndexSchema.readSchema Reading Solr Schema
[junit4:junit4]   2> 492 T2791 oass.IndexSchema.readSchema Schema name=example
[junit4:junit4]   2> 642 T2791 oass.IndexSchema.readSchema default search field in schema is text
[junit4:junit4]   2> 644 T2791 oass.IndexSchema.readSchema unique key field: id
[junit4:junit4]   2> 647 T2791 oasc.SolrCore.<init> [collection1] Opening new SolrCore at /mnt/ssd/jenkins/workspace/Lucene-Solr-trunk-Linux/checkout/solr/build/solr-core/test-files/solr/collection1/, dataDir=./org.apache.solr.handler.component.DistributedQueryElevationComponentTest-1343607533867/shard1/data/
[junit4:junit4]   2> 647 T2791 oasc.JmxMonitoredMap.<init> JMX monitoring is enabled. Adding Solr mbeans to JMX Server: com.sun.jmx.mbeanserver.JmxMBeanServer@39b4cec7
[junit4:junit4]   2> 648 T2791 oasc.SolrCore.getNewIndexDir WARNING New index directory detected: old=null new=./org.apache.solr.handler.component.DistributedQueryElevationComponentTest-1343607533867/shard1/data/index/
[junit4:junit4]   2> 648 T2791 oasc.SolrCore.initIndex WARNING [collection1] Solr index directory './org.apache.solr.handler.component.DistributedQueryElevationComponentTest-1343607533867/shard1/data/index' doesn't exist. Creating new index...
[junit4:junit4]   2> 649 T2791 oasc.SolrDeletionPolicy.onCommit SolrDeletionPolicy.onCommit: commits:num=1
[junit4:junit4]   2> 		commit{dir=MockDirWrapper(org.apache.lucene.store.RAMDirectory@5737abc1 lockFactory=org.apache.lucene.store.SingleInstanceLockFactory@67215965),segFN=segments_1,generation=1,filenames=[segments_1]
[junit4:junit4]   2> 650 T2791 oasc.SolrDeletionPolicy.updateCommits newest commit = 1
[junit4:junit4]   2> 650 T2791 oasc.RequestHandlers.initHandlersFromConfig created /update: solr.UpdateRequestHandler
[junit4:junit4]   2> 651 T2791 oasc.RequestHandlers.initHandlersFromConfig created /elevate: org.apache.solr.handler.component.SearchHandler
[junit4:junit4]   2> 651 T2791 oasc.RequestHandlers.initHandlersFromConfig created /dataElevate: org.apache.solr.handler.component.SearchHandler
[junit4:junit4]   2> 652 T2791 oashl.XMLLoader.init xsltCacheLifetimeSeconds=60
[junit4:junit4]   2> 652 T2791 oasc.RequestHandlers.initHandlersFromConfig WARNING no default request handler is registered (either '/select' or 'standard')
[junit4:junit4]   2> 653 T2791 oasc.SolrCore.initDeprecatedSupport WARNING solrconfig.xml uses deprecated <admin/gettableFiles>, Please update your config to use the ShowFileRequestHandler.
[junit4:junit4]   2> 654 T2791 oasc.SolrCore.initDeprecatedSupport WARNING adding ShowFileRequestHandler with hidden files: [BAD-MP-SOLRCONFIG.XML, SCHEMA-BM25.XML, PROTWORDS.TXT, SCHEMA-STOP-KEEP.XML, STOP-2.TXT, SCHEMA-NUMERIC.XML, SCHEMA-NOT-REQUIRED-UNIQUE-KEY.XML, SOLRCONFIG-TRANSFORMERS.XML, BAD-SCHEMA-DUP-FIELDTYPE.XML, SOLRCONFIG-TLOG.XML, SOLRCONFIG-NOCACHE.XML, SOLRCONFIG-MERGEPOLICY.XML, ELEVATE.XML, SOLRCONFIG-TERMINDEX.XML, SOLRCONFIG-DELPOLICY2.XML, TRIVIAL.UPDATEPROCESSOR0.JS, SOLRCONFIG-ENABLEPLUGIN.XML, SOLRCONFIG-QUERYSENDER.XML, SOLRCONFIG-MASTER1.XML, STOP-SNOWBALL.TXT, SOLRCONFIG-SPELLCHECKER.XML, SOLRCONFIG-SOLR-749.XML, SOLRCONFIG-MASTER1-KEEPONEBACKUP.XML, BAD-SCHEMA-EXTERNAL-FILEFIELD.XML, SOLRCONFIG-MASTER3.XML, DA_UTF8.XML, BAD-SCHEMA-NOT-INDEXED-BUT-TF.XML, SCHEMA-PHRASESUGGEST.XML, SOLRCONFIG-DELPOLICY1.XML, BAD-SOLRCONFIG-MISSING-SCRIPTFILE.XML, CONDITIONAL.UPDATEPROCESSOR.JS, SCHEMA-LMJELINEKMERCER.XML, SOLRCONFIG-PROPINJECT.XML, BAD-SCHEMA-DUP-FIELD.XML, SCHEMA-COLLATE.XML, SOLRCONFIG-MASTER.XML, SCHEMA-MINIMAL.XML, THROW.ERROR.ON.ADD.UPDATEPROCESSOR.JS, SOLRCONFIG_PERF.XML, STEMDICT.TXT, COMPOUNDDICTIONARY.TXT, STOPWORDS.TXT, HUNSPELL-TEST.DIC, KEEP-1.TXT, SCHEMA.XML, SOLRCONFIG-SPELLCHECKCOMPONENT.XML, OPEN-EXCHANGE-RATES.JSON, HUNSPELL-TEST.AFF, STOP-1.TXT, BAD-SCHEMA-UNIQUEKEY-IS-COPYFIELD-DEST.XML, SCHEMA-REQUIRED-FIELDS.XML, STOPWITHBOM.TXT, SOLRCONFIG-SCRIPT-UPDATEPROCESSOR.XML, SCHEMA-LUCENEMATCHVERSION.XML, SOLRCONFIG-CACHING.XML, TRIVIAL.UPDATEPROCESSOR1.JS, SCHEMA11.XML, SOLRCONFIG-LAZYWRITER.XML, STOPTYPES-2.TXT, BAD-SCHEMA-NONTEXT-ANALYZER.XML, SOLRCONFIG-SLAVE1.XML, SCHEMA-IB.XML, SOLRCONFIG-ELEVATE.XML, SOLRCONFIG-XINCLUDE.XML, SOLRCONFIG-SLAVE.XML, SOLRCONFIG_CODEC.XML, MAPPING-ISOLATIN1ACCENT.TXT, SOLRCONFIG-HIGHLIGHT.XML, STOPWORDSWRONGENCODING.TXT, KEEP-2.TXT, SOLRCONFIG-MASTER2.XML, SYNONYMS.TXT, SOLRCONFIG-SIMPLELOCK.XML, SOLRCONFIG-SOLCOREPROPERTIES.XML, BAD_SOLRCONFIG.XML, SCHEMA-DFR.XML, BAD-SCHEMA-UNIQUEKEY-USES-DEFAULT.XML, SCHEMA-REPLICATION1.XML, SOLRCONFIG-ALTDIRECTORY.XML, SCHEMASURROUND.XML, SCHEMA-FOLDING.XML, SOLRCONFIG-QUERYSENDER-NOQUERY.XML, SCHEMA-REVERSED.XML, XSLT, CURRENCY.XML, SCHEMA_CODEC.XML, SOLRCONFIG-PHRASESUGGEST.XML, WDFTYPES.TXT, SOLRCONFIG-FUNCTIONQUERY.XML, SCHEMA12.XML, SCHEMA-CHARFILTERS.XML, SCHEMA-SIM.XML, FRENCHARTICLES.TXT, MISSING.FUNCTIONS.UPDATEPROCESSOR.JS, SCHEMA-TRIE.XML, SCHEMA-COPYFIELD-TEST.XML, SOLRCONFIG-UPDATE-PROCESSOR-CHAINS.XML, SCHEMA-TFIDF.XML, SOLRCONFIG-REPEATER.XML, STOPTYPES-1.TXT, BAD-SOLRCONFIG-BOGUS-SCRIPTENGINE-NAME.XML, BAD-SCHEMA-OMIT-TF-BUT-NOT-POS.XML, SOLRCONFIG-BASIC.XML, SCHEMA-SPELLCHECKER.XML, SCHEMA15.XML, SOLRCONFIG-NATIVELOCK.XML, OLD_SYNONYMS.TXT, DA_COMPOUNDDICTIONARY.TXT, SCHEMA-BINARYFIELD.XML, SCHEMA-REPLICATION2.XML, MISSLEADING.EXTENSION.UPDATEPROCESSOR.JS.TXT, PHRASESUGGEST.TXT, BAD-SCHEMA-NOT-INDEXED-BUT-POS.XML, HYPHENATION.DTD, ADDFIELDS.UPDATEPROCESSOR.JS, SOLRCONFIG-PROPINJECT-INDEXDEFAULT.XML, BAD-SCHEMA-CODEC-GLOBAL-VS-FT-MISMATCH.XML, SOLRCONFIG-REQHANDLER.INCL, BAD-SCHEMA-SIM-GLOBAL-VS-FT-MISMATCH.XML, BAD-SOLRCONFIG-INVALID-SCRIPTFILE.XML, BAD-SCHEMA-NOT-INDEXED-BUT-NORMS.XML, SCHEMA-LMDIRICHLET.XML, BAD-SCHEMA-DUP-DYNAMICFIELD.XML]
[junit4:junit4]   2> 656 T2791 oass.SolrIndexSearcher.<init> Opening Searcher@31af9b33 main
[junit4:junit4]   2> 657 T2791 oass.SolrIndexSearcher.getIndexDir WARNING WARNING: Directory impl does not support setting indexDir: org.apache.lucene.store.MockDirectoryWrapper
[junit4:junit4]   2> 657 T2791 oasu.CommitTracker.<init> Hard AutoCommit: disabled
[junit4:junit4]   2> 658 T2791 oasu.CommitTracker.<init> Soft AutoCommit: disabled
[junit4:junit4]   2> 658 T2791 oashc.QueryElevationComponent.inform Loading QueryElevation from: /mnt/ssd/jenkins/workspace/Lucene-Solr-trunk-Linux/checkout/solr/build/solr-core/test-files/solr/collection1/conf/elevate.xml
[junit4:junit4]   2> 663 T2791 oashc.QueryElevationComponent.inform Loading QueryElevation from: /mnt/ssd/jenkins/workspace/Lucene-Solr-trunk-Linux/checkout/solr/build/solr-core/test-files/solr/collection1/conf/elevate.xml
[junit4:junit4]   2> 668 T2791 oashc.HttpShardHandlerFactory.getParameter Setting socketTimeout to: 0
[junit4:junit4]   2> 668 T2791 oashc.HttpShardHandlerFactory.getParameter Setting urlScheme to: http://
[junit4:junit4]   2> 668 T2791 oashc.HttpShardHandlerFactory.getParameter Setting connTimeout to: 0
[junit4:junit4]   2> 669 T2791 oashc.HttpShardHandlerFactory.getParameter Setting maxConnectionsPerHost to: 20
[junit4:junit4]   2> 669 T2791 oashc.HttpShardHandlerFactory.getParameter Setting corePoolSize to: 0
[junit4:junit4]   2> 669 T2791 oashc.HttpShardHandlerFactory.getParameter Setting maximumPoolSize to: 2147483647
[junit4:junit4]   2> 669 T2791 oashc.HttpShardHandlerFactory.getParameter Setting maxThreadIdleTime to: 5
[junit4:junit4]   2> 669 T2791 oashc.HttpShardHandlerFactory.getParameter Setting sizeOfQueue to: -1
[junit4:junit4]   2> 669 T2791 oashc.HttpShardHandlerFactory.getParameter Setting fairnessPolicy to: false
[junit4:junit4]   2> 670 T2791 oascsi.HttpClientUtil.createClient Creating new http client, config:maxConnectionsPerHost=20&maxConnections=10000&socketTimeout=0&connTimeout=0&retry=false
[junit4:junit4]   2> 671 T2791 oasc.CoreContainer.register registering core: collection1
[junit4:junit4]   2> 672 T2821 oasc.SolrCore.registerSearcher [collection1] Registered new searcher Searcher@31af9b33 main{StandardDirectoryReader(segments_1:1)}
[junit4:junit4]   2> 672 T2791 oass.SolrDispatchFilter.init user.dir=/mnt/ssd/jenkins/workspace/Lucene-Solr-trunk-Linux/checkout/solr/build/solr-core/test/J0
[junit4:junit4]   2> 672 T2791 oass.SolrDispatchFilter.init SolrDispatchFilter.init() done
[junit4:junit4]   2> 672 T2791 oascsi.HttpClientUtil.createClient Creating new http client, config:maxConnections=128&maxConnectionsPerHost=32&followRedirects=false
[junit4:junit4]   2> 674 T2791 oejs.Server.doStart jetty-8.1.2.v20120308
[junit4:junit4]   2> 675 T2791 oejs.AbstractConnector.doStart Started SocketConnector@0.0.0.0:41746
[junit4:junit4]   2> 676 T2791 oasc.SolrResourceLoader.locateSolrHome JNDI not configured for solr (NoInitialContextEx)
[junit4:junit4]   2> 676 T2791 oasc.SolrResourceLoader.locateSolrHome using system property solr.solr.home: /mnt/ssd/jenkins/workspace/Lucene-Solr-trunk-Linux/checkout/solr/build/solr-core/test-files/solr
[junit4:junit4]   2> 676 T2791 oasc.SolrResourceLoader.<init> new SolrResourceLoader for deduced Solr Home: '/mnt/ssd/jenkins/workspace/Lucene-Solr-trunk-Linux/checkout/solr/build/solr-core/test-files/solr/'
[junit4:junit4]   2> 684 T2791 oass.SolrDispatchFilter.init SolrDispatchFilter.init()
[junit4:junit4]   2> 684 T2791 oasc.SolrResourceLoader.locateSolrHome JNDI not configured for solr (NoInitialContextEx)
[junit4:junit4]   2> 685 T2791 oasc.SolrResourceLoader.locateSolrHome using system property solr.solr.home: /mnt/ssd/jenkins/workspace/Lucene-Solr-trunk-Linux/checkout/solr/build/solr-core/test-files/solr
[junit4:junit4]   2> 685 T2791 oasc.CoreContainer$Initializer.initialize looking for solr.xml: /mnt/ssd/jenkins/workspace/Lucene-Solr-trunk-Linux/checkout/solr/build/solr-core/test-files/solr/solr.xml
[junit4:junit4]   2> 685 T2791 oasc.CoreContainer.<init> New CoreContainer 1952608078
[junit4:junit4]   2> 685 T2791 oasc.CoreContainer.load Loading CoreContainer using Solr Home: '/mnt/ssd/jenkins/workspace/Lucene-Solr-trunk-Linux/checkout/solr/build/solr-core/test-files/solr/'
[junit4:junit4]   2> 686 T2791 oasc.SolrResourceLoader.<init> new SolrResourceLoader for directory: '/mnt/ssd/jenkins/workspace/Lucene-Solr-trunk-Linux/checkout/solr/build/solr-core/test-files/solr/'
[junit4:junit4]   2> 696 T2791 oasc.CoreContainer.load Registering Log Listener
[junit4:junit4]   2> 706 T2791 oasc.CoreContainer.create Creating SolrCore 'collection1' using instanceDir: /mnt/ssd/jenkins/workspace/Lucene-Solr-trunk-Linux/checkout/solr/build/solr-core/test-files/solr/collection1
[junit4:junit4]   2> 706 T2791 oasc.SolrResourceLoader.<init> new SolrResourceLoader for directory: '/mnt/ssd/jenkins/workspace/Lucene-Solr-trunk-Linux/checkout/solr/build/solr-core/test-files/solr/collection1/'
[junit4:junit4]   2> 707 T2791 oasc.SolrResourceLoader.replaceClassLoader Adding 'file:/mnt/ssd/jenkins/workspace/Lucene-Solr-trunk-Linux/checkout/solr/build/solr-core/test-files/solr/collection1/lib/README' to classloader
[junit4:junit4]   2> 707 T2791 oasc.SolrResourceLoader.replaceClassLoader Adding 'file:/mnt/ssd/jenkins/workspace/Lucene-Solr-trunk-Linux/checkout/solr/build/solr-core/test-files/solr/collection1/lib/classes/' to classloader
[junit4:junit4]   2> 723 T2791 oasc.SolrConfig.<init> Using Lucene MatchVersion: LUCENE_50
[junit4:junit4]   2> 748 T2791 oasc.SolrConfig.<init> Loaded SolrConfig: solrconfig-elevate.xml
[junit4:junit4]   2> 749 T2791 oass.IndexSchema.readSchema Reading Solr Schema
[junit4:junit4]   2> 751 T2791 oass.IndexSchema.readSchema Schema name=example
[junit4:junit4]   2> 785 T2293 oasc.Overseer$CloudStateUpdater.amILeader WARNING  org.apache.zookeeper.KeeperException$ConnectionLossException: KeeperErrorCode = ConnectionLoss for /overseer_elect/leader
[junit4:junit4]   2> 	at org.apache.zookeeper.KeeperException.create(KeeperException.java:90)
[junit4:junit4]   2> 	at org.apache.zookeeper.KeeperException.create(KeeperException.java:42)
[junit4:junit4]   2> 	at org.apache.zookeeper.ZooKeeper.getData(ZooKeeper.java:927)
[junit4:junit4]   2> 	at org.apache.solr.common.cloud.SolrZkClient$7.execute(SolrZkClient.java:289)
[junit4:junit4]   2> 	at org.apache.solr.common.cloud.SolrZkClient$7.execute(SolrZkClient.java:286)
[junit4:junit4]   2> 	at org.apache.solr.common.cloud.ZkCmdExecutor.retryOperation(ZkCmdExecutor.java:67)
[junit4:junit4]   2> 	at org.apache.solr.common.cloud.SolrZkClient.getData(SolrZkClient.java:286)
[junit4:junit4]   2> 	at org.apache.solr.cloud.Overseer$CloudStateUpdater.amILeader(Overseer.java:187)
[junit4:junit4]   2> 	at org.apache.solr.cloud.Overseer$CloudStateUpdater.run(Overseer.java:113)
[junit4:junit4]   2> 	at java.lang.Thread.run(Thread.java:722)
[junit4:junit4]   2> 
[junit4:junit4]   2> 785 T2294 oasc.OverseerCollectionProcessor.run WARNING Overseer cannot talk to ZK
[junit4:junit4]   2> 786 T2293 oasc.Overseer$CloudStateUpdater.amILeader According to ZK I (id=88054652360720400-127.0.0.1:42252_solr-n_0000000013) am no longer a leader.
[junit4:junit4]   2> 855 T2791 oass.IndexSchema.readSchema default search field in schema is text
[junit4:junit4]   2> 857 T2791 oass.IndexSchema.readSchema unique key field: id
[junit4:junit4]   2> 859 T2791 oasc.SolrCore.<init> [collection1] Opening new SolrCore at /mnt/ssd/jenkins/workspace/Lucene-Solr-trunk-Linux/checkout/solr/build/solr-core/test-files/solr/collection1/, dataDir=./org.apache.solr.handler.component.DistributedQueryElevationComponentTest-1343607533867/shard2/data/
[junit4:junit4]   2> 859 T2791 oasc.JmxMonitoredMap.<init> JMX monitoring is enabled. Adding Solr mbeans to JMX Server: com.sun.jmx.mbeanserver.JmxMBeanServer@39b4cec7
[junit4:junit4]   2> 859 T2791 oasc.SolrCore.getNewIndexDir WARNING New index directory detected: old=null new=./org.apache.solr.handler.component.DistributedQueryElevationComponentTest-1343607533867/shard2/data/index/
[junit4:junit4]   2> 860 T2791 oasc.SolrCore.initIndex WARNING [collection1] Solr index directory './org.apache.solr.handler.component.DistributedQueryElevationComponentTest-1343607533867/shard2/data/index' doesn't exist. Creating new index...
[junit4:junit4]   2> 861 T2791 oasc.SolrDeletionPolicy.onCommit SolrDeletionPolicy.onCommit: commits:num=1
[junit4:junit4]   2> 		commit{dir=MockDirWrapper(org.apache.lucene.store.RAMDirectory@749644a5 lockFactory=org.apache.lucene.store.SingleInstanceLockFactory@e47ead4),segFN=segments_1,generation=1,filenames=[segments_1]
[junit4:junit4]   2> 861 T2791 oasc.SolrDeletionPolicy.updateCommits newest commit = 1
[junit4:junit4]   2> 862 T2791 oasc.RequestHandlers.initHandlersFromConfig created /update: solr.UpdateRequestHandler
[junit4:junit4]   2> 862 T2791 oasc.RequestHandlers.initHandlersFromConfig created /elevate: org.apache.solr.handler.component.SearchHandler
[junit4:junit4]   2> 862 T2791 oasc.RequestHandlers.initHandlersFromConfig created /dataElevate: org.apache.solr.handler.component.SearchHandler
[junit4:junit4]   2> 863 T2791 oashl.XMLLoader.init xsltCacheLifetimeSeconds=60
[junit4:junit4]   2> 863 T2791 oasc.RequestHandlers.initHandlersFromConfig WARNING no default request handler is registered (either '/select' or 'standard')
[junit4:junit4]   2> 864 T2791 oasc.SolrCore.initDeprecatedSupport WARNING solrconfig.xml uses deprecated <admin/gettableFiles>, Please update your config to use the ShowFileRequestHandler.
[junit4:junit4]   2> 865 T2791 oasc.SolrCore.initDeprecatedSupport WARNING adding ShowFileRequestHandler with hidden files: [BAD-MP-SOLRCONFIG.XML, SCHEMA-BM25.XML, PROTWORDS.TXT, SCHEMA-STOP-KEEP.XML, STOP-2.TXT, SCHEMA-NUMERIC.XML, SCHEMA-NOT-REQUIRED-UNIQUE-KEY.XML, SOLRCONFIG-TRANSFORMERS.XML, BAD-SCHEMA-DUP-FIELDTYPE.XML, SOLRCONFIG-TLOG.XML, SOLRCONFIG-NOCACHE.XML, SOLRCONFIG-MERGEPOLICY.XML, ELEVATE.XML, SOLRCONFIG-TERMINDEX.XML, SOLRCONFIG-DELPOLICY2.XML, TRIVIAL.UPDATEPROCESSOR0.JS, SOLRCONFIG-ENABLEPLUGIN.XML, SOLRCONFIG-QUERYSENDER.XML, SOLRCONFIG-MASTER1.XML, STOP-SNOWBALL.TXT, SOLRCONFIG-SPELLCHECKER.XML, SOLRCONFIG-SOLR-749.XML, SOLRCONFIG-MASTER1-KEEPONEBACKUP.XML, BAD-SCHEMA-EXTERNAL-FILEFIELD.XML, SOLRCONFIG-MASTER3.XML, DA_UTF8.XML, BAD-SCHEMA-NOT-INDEXED-BUT-TF.XML, SCHEMA-PHRASESUGGEST.XML, SOLRCONFIG-DELPOLICY1.XML, BAD-SOLRCONFIG-MISSING-SCRIPTFILE.XML, CONDITIONAL.UPDATEPROCESSOR.JS, SCHEMA-LMJELINEKMERCER.XML, SOLRCONFIG-PROPINJECT.XML, BAD-SCHEMA-DUP-FIELD.XML, SCHEMA-COLLATE.XML, SOLRCONFIG-MASTER.XML, SCHEMA-MINIMAL.XML, THROW.ERROR.ON.ADD.UPDATEPROCESSOR.JS, SOLRCONFIG_PERF.XML, STEMDICT.TXT, COMPOUNDDICTIONARY.TXT, STOPWORDS.TXT, HUNSPELL-TEST.DIC, KEEP-1.TXT, SCHEMA.XML, SOLRCONFIG-SPELLCHECKCOMPONENT.XML, OPEN-EXCHANGE-RATES.JSON, HUNSPELL-TEST.AFF, STOP-1.TXT, BAD-SCHEMA-UNIQUEKEY-IS-COPYFIELD-DEST.XML, SCHEMA-REQUIRED-FIELDS.XML, STOPWITHBOM.TXT, SOLRCONFIG-SCRIPT-UPDATEPROCESSOR.XML, SCHEMA-LUCENEMATCHVERSION.XML, SOLRCONFIG-CACHING.XML, TRIVIAL.UPDATEPROCESSOR1.JS, SCHEMA11.XML, SOLRCONFIG-LAZYWRITER.XML, STOPTYPES-2.TXT, BAD-SCHEMA-NONTEXT-ANALYZER.XML, SOLRCONFIG-SLAVE1.XML, SCHEMA-IB.XML, SOLRCONFIG-ELEVATE.XML, SOLRCONFIG-XINCLUDE.XML, SOLRCONFIG-SLAVE.XML, SOLRCONFIG_CODEC.XML, MAPPING-ISOLATIN1ACCENT.TXT, SOLRCONFIG-HIGHLIGHT.XML, STOPWORDSWRONGENCODING.TXT, KEEP-2.TXT, SOLRCONFIG-MASTER2.XML, SYNONYMS.TXT, SOLRCONFIG-SIMPLELOCK.XML, SOLRCONFIG-SOLCOREPROPERTIES.XML, BAD_SOLRCONFIG.XML, SCHEMA-DFR.XML, BAD-SCHEMA-UNIQUEKEY-USES-DEFAULT.XML, SCHEMA-REPLICATION1.XML, SOLRCONFIG-ALTDIRECTORY.XML, SCHEMASURROUND.XML, SCHEMA-FOLDING.XML, SOLRCONFIG-QUERYSENDER-NOQUERY.XML, SCHEMA-REVERSED.XML, XSLT, CURRENCY.XML, SCHEMA_CODEC.XML, SOLRCONFIG-PHRASESUGGEST.XML, WDFTYPES.TXT, SOLRCONFIG-FUNCTIONQUERY.XML, SCHEMA12.XML, SCHEMA-CHARFILTERS.XML, SCHEMA-SIM.XML, FRENCHARTICLES.TXT, MISSING.FUNCTIONS.UPDATEPROCESSOR.JS, SCHEMA-TRIE.XML, SCHEMA-COPYFIELD-TEST.XML, SOLRCONFIG-UPDATE-PROCESSOR-CHAINS.XML, SCHEMA-TFIDF.XML, SOLRCONFIG-REPEATER.XML, STOPTYPES-1.TXT, BAD-SOLRCONFIG-BOGUS-SCRIPTENGINE-NAME.XML, BAD-SCHEMA-OMIT-TF-BUT-NOT-POS.XML, SOLRCONFIG-BASIC.XML, SCHEMA-SPELLCHECKER.XML, SCHEMA15.XML, SOLRCONFIG-NATIVELOCK.XML, OLD_SYNONYMS.TXT, DA_COMPOUNDDICTIONARY.TXT, SCHEMA-BINARYFIELD.XML, SCHEMA-REPLICATION2.XML, MISSLEADING.EXTENSION.UPDATEPROCESSOR.JS.TXT, PHRASESUGGEST.TXT, BAD-SCHEMA-NOT-INDEXED-BUT-POS.XML, HYPHENATION.DTD, ADDFIELDS.UPDATEPROCESSOR.JS, SOLRCONFIG-PROPINJECT-INDEXDEFAULT.XML, BAD-SCHEMA-CODEC-GLOBAL-VS-FT-MISMATCH.XML, SOLRCONFIG-REQHANDLER.INCL, BAD-SCHEMA-SIM-GLOBAL-VS-FT-MISMATCH.XML, BAD-SOLRCONFIG-INVALID-SCRIPTFILE.XML, BAD-SCHEMA-NOT-INDEXED-BUT-NORMS.XML, SCHEMA-LMDIRICHLET.XML, BAD-SCHEMA-DUP-DYNAMICFIELD.XML]
[junit4:junit4]   2> 867 T2791 oass.SolrIndexSearcher.<init> Opening Searcher@3b9035c5 main
[junit4:junit4]   2> 867 T2791 oass.SolrIndexSearcher.getIndexDir WARNING WARNING: Directory impl does not support setting indexDir: org.apache.lucene.store.MockDirectoryWrapper
[junit4:junit4]   2> 867 T2791 oasu.CommitTracker.<init> Hard AutoCommit: disabled
[junit4:junit4]   2> 867 T2791 oasu.CommitTracker.<init> Soft AutoCommit: disabled
[junit4:junit4]   2> 868 T2791 oashc.QueryElevationComponent.inform Loading QueryElevation from: /mnt/ssd/jenkins/workspace/Lucene-Solr-trunk-Linux/checkout/solr/build/solr-core/test-files/solr/collection1/conf/elevate.xml
[junit4:junit4]   2> 873 T2791 oashc.QueryElevationComponent.inform Loading QueryElevation from: /mnt/ssd/jenkins/workspace/Lucene-Solr-trunk-Linux/checkout/solr/build/solr-core/test-files/solr/collection1/conf/elevate.xml
[junit4:junit4]   2> 878 T2791 oashc.HttpShardHandlerFactory.getParameter Setting socketTimeout to: 0
[junit4:junit4]   2> 879 T2791 oashc.HttpShardHandlerFactory.getParameter Setting urlScheme to: http://
[junit4:junit4]   2> 879 T2791 oashc.HttpShardHandlerFactory.getParameter Setting connTimeout to: 0
[junit4:junit4]   2> 879 T2791 oashc.HttpShardHandlerFactory.getParameter Setting maxConnectionsPerHost to: 20
[junit4:junit4]   2> 880 T2791 oashc.HttpShardHandlerFactory.getParameter Setting corePoolSize to: 0
[junit4:junit4]   2> 880 T2791 oashc.HttpShardHandlerFactory.getParameter Setting maximumPoolSize to: 2147483647
[junit4:junit4]   2> 880 T2791 oashc.HttpShardHandlerFactory.getParameter Setting maxThreadIdleTime to: 5
[junit4:junit4]   2> 880 T2791 oashc.HttpShardHandlerFactory.getParameter Setting sizeOfQueue to: -1
[junit4:junit4]   2> 881 T2791 oashc.HttpShardHandlerFactory.getParameter Setting fairnessPolicy to: false
[junit4:junit4]   2> 881 T2791 oascsi.HttpClientUtil.createClient Creating new http client, config:maxConnectionsPerHost=20&maxConnections=10000&socketTimeout=0&connTimeout=0&retry=false
[junit4:junit4]   2> 883 T2831 oasc.SolrCore.registerSearcher [collection1] Registered new searcher Searcher@3b9035c5 main{StandardDirectoryReader(segments_1:1)}
[junit4:junit4]   2> 883 T2791 oasc.CoreContainer.register registering core: collection1
[junit4:junit4]   2> 883 T2791 oass.SolrDispatchFilter.init user.dir=/mnt/ssd/jenkins/workspace/Lucene-Solr-trunk-Linux/checkout/solr/build/solr-core/test/J0
[junit4:junit4]   2> 883 T2791 oass.SolrDispatchFilter.init SolrDispatchFilter.init() done
[junit4:junit4]   2> 883 T2791 oascsi.HttpClientUtil.createClient Creating new http client, config:maxConnections=128&maxConnectionsPerHost=32&followRedirects=false
[junit4:junit4]   2> ASYNC  NEW_CORE C175 name=collection1 org.apache.solr.core.SolrCore@18acee2d
[junit4:junit4]   2> 889 T2794 C175 oasu.DirectUpdateHandler2.deleteAll [collection1] REMOVING ALL DOCUMENTS FROM INDEX
[junit4:junit4]   2> 890 T2794 C175 oasc.SolrDeletionPolicy.onInit SolrDeletionPolicy.onInit: commits:num=1
[junit4:junit4]   2> 		commit{dir=MockDirWrapper(org.apache.lucene.store.RAMDirectory@148d903 lockFactory=org.apache.lucene.store.SingleInstanceLockFactory@4f6c3b55),segFN=segments_1,generation=1,filenames=[segments_1]
[junit4:junit4]   2> 890 T2794 C175 oasc.SolrDeletionPolicy.updateCommits newest commit = 1
[junit4:junit4]   2> 890 T2794 C175 UPDATE [collection1] webapp=/solr path=/update params={version=2&wt=javabin} {deleteByQuery=*:*} 0 2
[junit4:junit4]   2> ASYNC  NEW_CORE C176 name=collection1 org.apache.solr.core.SolrCore@3b34b2c
[junit4:junit4]   2> 895 T2804 C176 oasu.DirectUpdateHandler2.deleteAll [collection1] REMOVING ALL DOCUMENTS FROM INDEX
[junit4:junit4]   2> 896 T2804 C176 oasc.SolrDeletionPolicy.onInit SolrDeletionPolicy.onInit: commits:num=1
[junit4:junit4]   2> 		commit{dir=MockDirWrapper(org.apache.lucene.store.SimpleFSDirectory@/mnt/ssd/jenkins/workspace/Lucene-Solr-trunk-Linux/checkout/solr/build/solr-core/test/J0/index3056730576tmp lockFactory=org.apache.lucene.store.SingleInstanceLockFactory@32165747),segFN=segments_1,generation=1,filenames=[segments_1]
[junit4:junit4]   2> 897 T2804 C176 oasc.SolrDeletionPolicy.updateCommits newest commit = 1
[junit4:junit4]   2> 897 T2804 C176 UPDATE [collection1] webapp=/solr path=/update params={version=2&wt=javabin} {deleteByQuery=*:*} 0 2
[junit4:junit4]   2> ASYNC  NEW_CORE C177 name=collection1 org.apache.solr.core.SolrCore@19770dfe
[junit4:junit4]   2> 902 T2814 C177 oasu.DirectUpdateHandler2.deleteAll [collection1] REMOVING ALL DOCUMENTS FROM INDEX
[junit4:junit4]   2> 903 T2814 C177 oasc.SolrDeletionPolicy.onInit SolrDeletionPolicy.onInit: commits:num=1
[junit4:junit4]   2> 		commit{dir=MockDirWrapper(org.apache.lucene.store.RAMDirectory@5737abc1 lockFactory=org.apache.lucene.store.SingleInstanceLockFactory@67215965),segFN=segments_1,generation=1,filenames=[segments_1]
[junit4:junit4]   2> 904 T2814 C177 oasc.SolrDeletionPolicy.updateCommits newest commit = 1
[junit4:junit4]   2> 904 T2814 C177 UPDATE [collection1] webapp=/solr path=/update params={version=2&wt=javabin} {deleteByQuery=*:*} 0 2
[junit4:junit4]   2> ASYNC  NEW_CORE C178 name=collection1 org.apache.solr.core.SolrCore@71240832
[junit4:junit4]   2> 908 T2824 C178 oasu.DirectUpdateHandler2.deleteAll [collection1] REMOVING ALL DOCUMENTS FROM INDEX
[junit4:junit4]   2> 909 T2824 C178 oasc.SolrDeletionPolicy.onInit SolrDeletionPolicy.onInit: commits:num=1
[junit4:junit4]   2> 		commit{dir=MockDirWrapper(org.apache.lucene.store.RAMDirectory@749644a5 lockFactory=org.apache.lucene.store.SingleInstanceLockFactory@e47ead4),segFN=segments_1,generation=1,filenames=[segments_1]
[junit4:junit4]   2> 909 T2824 C178 oasc.SolrDeletionPolicy.updateCommits newest commit = 1
[junit4:junit4]   2> 910 T2824 C178 UPDATE [collection1] webapp=/solr path=/update params={version=2&wt=javabin} {deleteByQuery=*:*} 0 3
[junit4:junit4]   2> 914 T2794 C175 UPDATE [collection1] webapp=/solr path=/update params={version=2&wt=javabin} {add=[1]} 0 1
[junit4:junit4]   2> 917 T2804 C176 UPDATE [collection1] webapp=/solr path=/update params={version=2&wt=javabin} {add=[1]} 0 1
[junit4:junit4]   2> 919 T2794 C175 UPDATE [collection1] webapp=/solr path=/update params={version=2&wt=javabin} {add=[2]} 0 1
[junit4:junit4]   2> 922 T2814 C177 UPDATE [collection1] webapp=/solr path=/update params={version=2&wt=javabin} {add=[2]} 0 1
[junit4:junit4]   2> 924 T2794 C175 UPDATE [collection1] webapp=/solr path=/update params={version=2&wt=javabin} {add=[3]} 0 1
[junit4:junit4]   2> 926 T2824 C178 UPDATE [collection1] webapp=/solr path=/update params={version=2&wt=javabin} {add=[3]} 0 0
[junit4:junit4]   2> 928 T2794 C175 UPDATE [collection1] webapp=/solr path=/update params={version=2&wt=javabin} {add=[4]} 0 0
[junit4:junit4]   2> 930 T2804 C176 UPDATE [collection1] webapp=/solr path=/update params={version=2&wt=javabin} {add=[4]} 0 0
[junit4:junit4]   2> 932 T2794 C175 UPDATE [collection1] webapp=/solr path=/update params={version=2&wt=javabin} {add=[5]} 0 0
[junit4:junit4]   2> 934 T2814 C177 UPDATE [collection1] webapp=/solr path=/update params={version=2&wt=javabin} {add=[5]} 0 0
[junit4:junit4]   2> 937 T2794 C175 UPDATE [collection1] webapp=/solr path=/update params={version=2&wt=javabin} {add=[6]} 0 1
[junit4:junit4]   2> 939 T2824 C178 UPDATE [collection1] webapp=/solr path=/update params={version=2&wt=javabin} {add=[6]} 0 1
[junit4:junit4]   2> 941 T2794 C175 UPDATE [collection1] webapp=/solr path=/update params={version=2&wt=javabin} {add=[7]} 0 1
[junit4:junit4]   2> 943 T2824 C178 UPDATE [collection1] webapp=/solr path=/update params={version=2&wt=javabin} {add=[7]} 0 1
[junit4:junit4]   2> 945 T2794 C175 oasu.DirectUpdateHandler2.commit start commit{flags=0,_version_=0,optimize=false,openSearcher=true,waitSearcher=true,expungeDeletes=false,softCommit=false}
[junit4:junit4]   2> 946 T2794 C175 oasc.SolrDeletionPolicy.onCommit SolrDeletionPolicy.onCommit: commits:num=2
[junit4:junit4]   2> 		commit{dir=MockDirWrapper(org.apache.lucene.store.RAMDirectory@148d903 lockFactory=org.apache.lucene.store.SingleInstanceLockFactory@4f6c3b55),segFN=segments_1,generation=1,filenames=[segments_1]
[junit4:junit4]   2> 		commit{dir=MockDirWrapper(org.apache.lucene.store.RAMDirectory@148d903 lockFactory=org.apache.lucene.store.SingleInstanceLockFactory@4f6c3b55),segFN=segments_2,generation=2,filenames=[_0_nrm.cfs, _0.si, _0.fdt, _0_NestedPulsing_0.tip, _0_Pulsing40_0.prx, _0_NestedPulsing_0.frq, _0_NestedPulsing_0.prx, segments_2, _0_nrm.cfe, _0_NestedPulsing_0.tim, _0_Pulsing40_0.tip, _0.fnm, _0.fdx, _0_Pulsing40_0.frq, _0_Pulsing40_0.tim]
[junit4:junit4]   2> 946 T2794 C175 oasc.SolrDeletionPolicy.updateCommits newest commit = 2
[junit4:junit4]   2> 947 T2794 C175 oass.SolrIndexSearcher.<init> Opening Searcher@24c83587 main
[junit4:junit4]   2> 948 T2794 C175 oass.SolrIndexSearcher.getIndexDir WARNING WARNING: Directory impl does not support setting indexDir: org.apache.lucene.store.MockDirectoryWrapper
[junit4:junit4]   2> 948 T2801 oasc.SolrCore.registerSearcher [collection1] Registered new searcher Searcher@24c83587 main{StandardDirectoryReader(segments_2:4 _0(5.0):C7)}
[junit4:junit4]   2> 948 T2794 C175 oasu.DirectUpdateHandler2.commit end_commit_flush
[junit4:junit4]   2> 949 T2794 C175 UPDATE [collection1] webapp=/solr path=/update params={commit=true&waitSearcher=true&softCommit=false&wt=javabin&version=2} {commit=} 0 5
[junit4:junit4]   2> 951 T2804 C176 oasu.DirectUpdateHandler2.commit start commit{flags=0,_version_=0,optimize=false,openSearcher=true,waitSearcher=true,expungeDeletes=false,softCommit=false}
[junit4:junit4]   2> 958 T2804 C176 oasc.SolrDeletionPolicy.onCommit SolrDeletionPolicy.onCommit: commits:num=2
[junit4:junit4]   2> 		commit{dir=MockDirWrapper(org.apache.lucene.store.SimpleFSDirectory@/mnt/ssd/jenkins/workspace/Lucene-Solr-trunk-Linux/checkout/solr/build/solr-core/test/J0/index3056730576tmp lockFactory=org.apache.lucene.store.SingleInstanceLockFactory@32165747),segFN=segments_1,generation=1,filenames=[segments_1]
[junit4:junit4]   2> 		commit{dir=MockDirWrapper(org.apache.lucene.store.SimpleFSDirectory@/mnt/ssd/jenkins/workspace/Lucene-Solr-trunk-Linux/checkout/solr/build/solr-core/test/J0/index3056730576tmp lockFactory=org.apache.lucene.store.SingleInstanceLockFactory@32165747),segFN=segments_2,generation=2,filenames=[_0_nrm.cfs, _0.si, _0.fdt, _0_NestedPulsing_0.tip, _0_Pulsing40_0.prx, _0_NestedPulsing_0.frq, _0_NestedPulsing_0.prx, segments_2, _0_nrm.cfe, _0_NestedPulsing_0.tim, _0_Pulsing40_0.tip, _0.fnm, _0.fdx, _0_Pulsing40_0.frq, _0_Pulsing40_0.tim]
[junit4:junit4]   2> 959 T2804 C176 oasc.SolrDeletionPolicy.updateCommits newest commit = 2
[junit4:junit4]   2> 961 T2804 C176 oass.SolrIndexSearcher.<init> Opening Searcher@35cbf519 main
[junit4:junit4]   2> 962 T2804 C176 oass.SolrIndexSearcher.getIndexDir WARNING WARNING: Directory impl does not support setting indexDir: org.apache.lucene.store.MockDirectoryWrapper
[junit4:junit4]   2> 962 T2804 C176 oasu.DirectUpdateHandler2.commit end_commit_flush
[junit4:junit4]   2> 962 T2811 oasc.SolrCore.registerSearcher [collection1] Registered new searcher Searcher@35cbf519 main{StandardDirectoryReader(segments_2:4 _0(5.0):C2)}
[junit4:junit4]   2> 963 T2804 C176 UPDATE [collection1] webapp=/solr path=/update params={commit=true&waitSearcher=true&softCommit=false&wt=javabin&version=2} {commit=} 0 12
[junit4:junit4]   2> 965 T2814 C177 oasu.DirectUpdateHandler2.commit start commit{flags=0,_version_=0,optimize=false,openSearcher=true,waitSearcher=true,expungeDeletes=false,softCommit=false}
[junit4:junit4]   2> 966 T2814 C177 oasc.SolrDeletionPolicy.onCommit SolrDeletionPolicy.onCommit: commits:num=2
[junit4:junit4]   2> 		commit{dir=MockDirWrapper(org.apache.lucene.store.RAMDirectory@5737abc1 lockFactory=org.apache.lucene.store.SingleInstanceLockFactory@67215965),segFN=segments_1,generation=1,filenames=[segments_1]
[junit4:junit4]   2> 		commit{dir=MockDirWrapper(org.apache.lucene.store.RAMDirectory@5737abc1 lockFactory=org.apache.lucene.store.SingleInstanceLockFactory@67215965),segFN=segments_2,generation=2,filenames=[_0_nrm.cfs, _0.si, _0.fdt, _0_NestedPulsing_0.tip, _0_Pulsing40_0.prx, _0_NestedPulsing_0.frq, _0_NestedPulsing_0.prx, segments_2, _0_nrm.cfe, _0_NestedPulsing_0.tim, _0_Pulsing40_0.tip, _0.fnm, _0.fdx, _0_Pulsing40_0.frq, _0_Pulsing40_0.tim]
[junit4:junit4]   2> 966 T2814 C177 oasc.SolrDeletionPolicy.updateCommits newest commit = 2
[junit4:junit4]   2> 967 T2814 C177 oass.SolrIndexSearcher.<init> Opening Searcher@7352225a main
[junit4:junit4]   2> 967 T2814 C177 oass.SolrIndexSearcher.getIndexDir WARNING WARNING: Directory impl does not support setting indexDir: org.apache.lucene.store.MockDirectoryWrapper
[junit4:junit4]   2> 968 T2814 C177 oasu.DirectUpdateHandler2.commit end_commit_flush
[junit4:junit4]   2> 968 T2821 oasc.SolrCore.registerSearcher [collection1] Registered new searcher Searcher@7352225a main{StandardDirectoryReader(segments_2:4 _0(5.0):C2)}
[junit4:junit4]   2> 969 T2814 C177 UPDATE [collection1] webapp=/solr path=/update params={commit=true&waitSearcher=true&softCommit=false&wt=javabin&version=2} {commit=} 0 5
[junit4:junit4]   2> 970 T2824 C178 oasu.DirectUpdateHandler2.commit start commit{flags=0,_version_=0,optimize=false,openSearcher=true,waitSearcher=true,expungeDeletes=false,softCommit=false}
[junit4:junit4]   2> 971 T2824 C178 oasc.SolrDeletionPolicy.onCommit SolrDeletionPolicy.onCommit: commits:num=2
[junit4:junit4]   2> 		commit{dir=MockDirWrapper(org.apache.lucene.store.RAMDirectory@749644a5 lockFactory=org.apache.lucene.store.SingleInstanceLockFactory@e47ead4),segFN=segments_1,generation=1,filenames=[segments_1]
[junit4:junit4]   2> 		commit{dir=MockDirWrapper(org.apache.lucene.store.RAMDirectory@749644a5 lockFactory=org.apache.lucene.store.SingleInstanceLockFactory@e47ead4),segFN=segments_2,generation=2,filenames=[_0_nrm.cfs, _0.si, _0.fdt, _0_NestedPulsing_0.tip, _0_Pulsing40_0.prx, _0_NestedPulsing_0.frq, _0_NestedPulsing_0.prx, segments_2, _0_nrm.cfe, _0_NestedPulsing_0.tim, _0_Pulsing40_0.tip, _0.fnm, _0.fdx, _0_Pulsing40_0.frq, _0_Pulsing40_0.tim]
[junit4:junit4]   2> 972 T2824 C178 oasc.SolrDeletionPolicy.updateCommits newest commit = 2
[junit4:junit4]   2> 972 T2824 C178 oass.SolrIndexSearcher.<init> Opening Searcher@3c5ffe5b main
[junit4:junit4]   2> 972 T2824 C178 oass.SolrIndexSearcher.getIndexDir WARNING WARNING: Directory impl does not support setting indexDir: org.apache.lucene.store.MockDirectoryWrapper
[junit4:junit4]   2> 972 T2824 C178 oasu.DirectUpdateHandler2.commit end_commit_flush
[junit4:junit4]   2> 973 T2831 oasc.SolrCore.registerSearcher [collection1] Registered new searcher Searcher@3c5ffe5b main{StandardDirectoryReader(segments_2:4 _0(5.0):C3)}
[junit4:junit4]   2> 973 T2824 C178 UPDATE [collection1] webapp=/solr path=/update params={commit=true&waitSearcher=true&softCommit=false&wt=javabin&version=2} {commit=} 0 3
[junit4:junit4]   2> 976 T2794 C175 REQ [collection1] webapp=/solr path=/elevate params={q=*:*&shards.qt=/elevate&qt=/elevate&distrib=false&fl=id,+score,+[elevated]&wt=javabin&version=2&rows=500&sort=id+desc} hits=7 status=0 QTime=1 
[junit4:junit4]   2> 997 T2815 C177 REQ [collection1] webapp=/solr path=/elevate params={NOW=1343607534846&shards.qt=/elevate&q=*:*&wt=javabin&version=2&isShard=true&qt=/elevate&distrib=false&fsv=true&fl=id,score&start=0&rows=500&shard.url=localhost:57899/solr&sort=id+desc} hits=2 status=0 QTime=1 
[junit4:junit4]   2> 997 T2825 C178 REQ [collection1] webapp=/solr path=/elevate params={NOW=1343607534846&shards.qt=/elevate&q=*:*&wt=javabin&version=2&isShard=true&qt=/elevate&distrib=false&fsv=true&fl=id,score&start=0&rows=500&shard.url=localhost:41746/solr&sort=id+desc} hits=3 status=0 QTime=1 
[junit4:junit4]   2> 999 T2805 C176 REQ [collection1] webapp=/solr path=/elevate params={NOW=1343607534846&shards.qt=/elevate&q=*:*&wt=javabin&version=2&isShard=true&qt=/elevate&distrib=false&fsv=true&fl=id,score&start=0&rows=500&shard.url=localhost:54592/solr|[::1]:33332/solr&sort=id+desc} hits=2 status=0 QTime=0 
[junit4:junit4]   2> 1002 T2825 C178 REQ [collection1] webapp=/solr path=/elevate params={ids=7.0,6.0,3.0&q=*:*&shards.qt=/elevate&NOW=1343607534846&wt=javabin&version=2&isShard=true&qt=/elevate&distrib=false&fl=id,+score,+[elevated]&rows=500&shard.url=localhost:41746/solr} status=0 QTime=0 
[junit4:junit4]   2> 1002 T2805 C176 REQ [collection1] webapp=/solr path=/elevate params={ids=1.0,4.0&q=*:*&shards.qt=/elevate&NOW=1343607534846&wt=javabin&version=2&isShard=true&qt=/elevate&distrib=false&fl=id,+score,+[elevated]&rows=500&shard.url=localhost:54592/solr|[::1]:33332/solr} status=0 QTime=0 
[junit4:junit4]   2> 1003 T2815 C177 REQ [collection1] webapp=/solr path=/elevate params={ids=2.0,5.0&q=*:*&shards.qt=/elevate&NOW=1343607534846&wt=javabin&version=2&isShard=true&qt=/elevate&distrib=false&fl=id,+score,+[elevated]&rows=500&shard.url=localhost:57899/solr} status=0 QTime=0 
[junit4:junit4]   2> 1004 T2814 C177 REQ [collection1] webapp=/solr path=/elevate params={q=*:*&shards.qt=/elevate&qt=/elevate&fl=id,+score,+[elevated]&wt=javabin&version=2&rows=500&sort=id+desc&shards=localhost:54592/solr|[::1]:33332/solr,localhost:57899/solr,localhost:41746/solr} status=0 QTime=24 
[junit4:junit4]   2> 1005 T2791 oas.BaseDistributedSearchTestCase.compareResponses SEVERE Mismatched responses:
[junit4:junit4]   2> 	{responseHeader={status=0,QTime=24,params={q=*:*,shards.qt=/elevate,qt=/elevate,fl=id, score, [elevated],wt=javabin,version=2,rows=500,sort=id desc,shards=localhost:54592/solr|[::1]:33332/solr,localhost:57899/solr,localhost:41746/solr}},response={numFound=7,start=0,maxScore=1.0,docs=[SolrDocument{id=7.0, [elevated]=false, score=1.0}, SolrDocument{id=6.0, [elevated]=false, score=1.0}, SolrDocument{id=5.0, [elevated]=false, score=1.0}, SolrDocument{id=4.0, [elevated]=false, score=1.0}, SolrDocument{id=3.0, [elevated]=false, score=1.0}, SolrDocument{id=2.0, [elevated]=false, score=1.0}, SolrDocument{id=1.0, [elevated]=false, score=1.0}]}}
[junit4:junit4]   2> 	{responseHeader={status=0,QTime=1,params={q=*:*,shards.qt=/elevate,qt=/elevate,distrib=false,fl=id, score, [elevated],wt=javabin,version=2,rows=500,sort=id desc}},response={numFound=7,start=0,maxScore=1.0,docs=[SolrDocument{id=7.0, score=1.0, [elevated]=false}, SolrDocument{id=6.0, score=1.0, [elevated]=false}, SolrDocument{id=5.0, score=1.0, [elevated]=false}, SolrDocument{id=4.0, score=1.0, [elevated]=false}, SolrDocument{id=3.0, score=1.0, [elevated]=false}, SolrDocument{id=2.0, score=1.0, [elevated]=false}, SolrDocument{id=1.0, score=1.0, [elevated]=false}]}}
[junit4:junit4]   2> 1006 T2791 oasc.CoreContainer.shutdown Shutting down CoreContainer instance=1426199815
[junit4:junit4]   2> 1006 T2791 oasc.SolrCore.close [collection1]  CLOSING SolrCore org.apache.solr.core.SolrCore@18acee2d
[junit4:junit4]   2> 1007 T2791 oasc.SolrCore.closeSearcher [collection1] Closing main searcher on request.
[junit4:junit4]   2> 1007 T2791 oasu.DirectUpdateHandler2.close closing DirectUpdateHandler2{commits=1,autocommits=0,soft autocommits=0,optimizes=0,rollbacks=0,expungeDeletes=0,docsPending=0,adds=0,deletesById=0,deletesByQuery=0,errors=0,cumulative_adds=7,cumulative_deletesById=0,cumulative_deletesByQuery=1,cumulative_errors=0}
[junit4:junit4]   2> 1012 T2791 oejsh.ContextHandler.doStop stopped o.e.j.s.ServletContextHandler{/solr,null}
[junit4:junit4]   2> 1064 T2791 oasc.CoreContainer.shutdown Shutting down CoreContainer instance=1734799568
[junit4:junit4]   2> 1065 T2791 oasc.SolrCore.close [collection1]  CLOSING SolrCore org.apache.solr.core.SolrCore@3b34b2c
[junit4:junit4]   2> 1065 T2791 oasc.SolrCore.closeSearcher [collection1] Closing main searcher on request.
[junit4:junit4]   2> 1066 T2791 oasu.DirectUpdateHandler2.close closing DirectUpdateHandler2{commits=1,autocommits=0,soft autocommits=0,optimizes=0,rollbacks=0,expungeDeletes=0,docsPending=0,adds=0,deletesById=0,deletesByQuery=0,errors=0,cumulative_adds=2,cumulative_deletesById=0,cumulative_deletesByQuery=1,cumulative_errors=0}
[junit4:junit4]   2> 1069 T2791 oejsh.ContextHandler.doStop stopped o.e.j.s.ServletContextHandler{/solr,null}
[junit4:junit4]   2> 1121 T2791 oasc.CoreContainer.shutdown Shutting down CoreContainer instance=550018804
[junit4:junit4]   2> 1121 T2791 oasc.SolrCore.close [collection1]  CLOSING SolrCore org.apache.solr.core.SolrCore@19770dfe
[junit4:junit4]   2> 1122 T2791 oasc.SolrCore.closeSearcher [collection1] Closing main searcher on request.
[junit4:junit4]   2> 1122 T2791 oasu.DirectUpdateHandler2.close closing DirectUpdateHandler2{commits=1,autocommits=0,soft autocommits=0,optimizes=0,rollbacks=0,expungeDeletes=0,docsPending=0,adds=0,deletesById=0,deletesByQuery=0,errors=0,cumulative_adds=2,cumulative_deletesById=0,cumulative_deletesByQuery=1,cumulative_errors=0}
[junit4:junit4]   2> 1124 T2791 oejsh.ContextHandler.doStop stopped o.e.j.s.ServletContextHandler{/solr,null}
[junit4:junit4]   2> 1175 T2791 oasc.CoreContainer.shutdown Shutting down CoreContainer instance=1952608078
[junit4:junit4]   2> 1176 T2791 oasc.SolrCore.close [collection1]  CLOSING SolrCore org.apache.solr.core.SolrCore@71240832
[junit4:junit4]   2> 1176 T2791 oasc.SolrCore.closeSearcher [collection1] Closing main searcher on request.
[junit4:junit4]   2> 1177 T2791 oasu.DirectUpdateHandler2.close closing DirectUpdateHandler2{commits=1,autocommits=0,soft autocommits=0,optimizes=0,rollbacks=0,expungeDeletes=0,docsPending=0,adds=0,deletesById=0,deletesByQuery=0,errors=0,cumulative_adds=3,cumulative_deletesById=0,cumulative_deletesByQuery=1,cumulative_errors=0}
[junit4:junit4]   2> 1178 T2791 oejsh.ContextHandler.doStop stopped o.e.j.s.ServletContextHandler{/solr,null}
[junit4:junit4]   2> 1231 T2791 oas.SolrTestCaseJ4.tearDown ###Ending testDistribSearch
[junit4:junit4]   2> NOTE: reproduce with: ant test  -Dtestcase=DistributedQueryElevationComponentTest -Dtests.method=testDistribSearch -Dtests.seed=C8A0A39FF82453F8 -Dtests.multiplier=3 -Dtests.slow=true -Dtests.locale=ga -Dtests.timezone=Etc/GMT+5 -Dtests.file.encoding=UTF-8
[junit4:junit4]   2>
[junit4:junit4]    > (@AfterClass output)
[junit4:junit4]   2> 1254 T2791 oas.SolrTestCaseJ4.deleteCore ###deleteCore
[junit4:junit4]   2> NOTE: test params are: codec=Lucene40: {plow_t=Pulsing40(freqCutoff=15 minBlockSize=99 maxBlockSize=232), field_t=PostingsFormat(name=NestedPulsing), int_i=Pulsing40(freqCutoff=15 minBlockSize=99 maxBlockSize=232), id=PostingsFormat(name=NestedPulsing), text=Pulsing40(freqCutoff=15 minBlockSize=99 maxBlockSize=232)}, sim=RandomSimilarityProvider(queryNorm=true,coord=false): {}, locale=ga, timezone=Etc/GMT+5
[junit4:junit4]   2> NOTE: Linux 3.2.0-27-generic amd64/Oracle Corporation 1.8.0-ea (64-bit)/cpus=8,threads=1,free=89940616,total=366542848
[junit4:junit4]   2> NOTE: All tests run in this JVM: [UpdateRequestProcessorFactoryTest, SolrCmdDistributorTest, MoreLikeThisHandlerTest, DirectSolrConnectionTest, BadComponentTest, AlternateDirectoryTest, UniqFieldsUpdateProcessorFactoryTest, BasicDistributedZkTest, SuggesterFSTTest, TestNumberUtils, SortByFunctionTest, TestDistributedSearch, TestRangeQuery, SOLR749Test, CacheHeaderTest, SolrCoreCheckLockOnStartupTest, SignatureUpdateProcessorFactoryTest, PeerSyncTest, ResourceLoaderTest, TestLMJelinekMercerSimilarityFactory, DefaultValueUpdateProcessorTest, RAMDirectoryFactoryTest, TestStressVersions, SpatialFilterTest, DocumentAnalysisRequestHandlerTest, TestWordDelimiterFilterFactory, BinaryUpdateRequestHandlerTest, AutoCommitTest, TestExtendedDismaxParser, TestSolrJ, DistributedSpellCheckComponentTest, MBeansHandlerTest, TestSurroundQueryParser, PingRequestHandlerTest, MinimalSchemaTest, DOMUtilTest, TestDistributedGrouping, TermVectorComponentTest, TestLuceneMatchVersion, IndexSchemaRuntimeFieldTest, CurrencyFieldTest, TestLFUCache, TestCoreContainer, TestIBSimilarityFactory, SearchHandlerTest, TestStressRecovery, TestValueSourceCache, TestJmxIntegration, PreAnalyzedFieldTest, TestFastLRUCache, TestJmxMonitoredMap, TestRecovery, StandardRequestHandlerTest, FullSolrCloudTest, SpellCheckComponentTest, FullSolrCloudDistribCmdsTest, ZkControllerTest, TestRandomFaceting, SolrCoreTest, TestMultiCoreConfBootstrap, TestSort, DirectSolrSpellCheckerTest, FileBasedSpellCheckerTest, QueryElevationComponentTest, BasicFunctionalityTest, SampleTest, HighlighterTest, TestIndexSearcher, CoreAdminHandlerTest, TestFunctionQuery, SolrRequestParserTest, TestRemoteStreaming, TestCSVLoader, DistributedQueryElevationComponentTest]
[junit4:junit4]   2> 
[junit4:junit4] Completed on J0 in 1.28s, 1 test, 1 failure <<< FAILURES!

[...truncated 237 lines...]
BUILD FAILED
/mnt/ssd/jenkins/workspace/Lucene-Solr-trunk-Linux/checkout/build.xml:29: The following error occurred while executing this line:
/mnt/ssd/jenkins/workspace/Lucene-Solr-trunk-Linux/checkout/solr/build.xml:144: The following error occurred while executing this line:
/mnt/ssd/jenkins/workspace/Lucene-Solr-trunk-Linux/checkout/lucene/module-build.xml:62: The following error occurred while executing this line:
/mnt/ssd/jenkins/workspace/Lucene-Solr-trunk-Linux/checkout/lucene/common-build.xml:1095: The following error occurred while executing this line:
/mnt/ssd/jenkins/workspace/Lucene-Solr-trunk-Linux/checkout/lucene/common-build.xml:790: There were test failures: 222 suites, 897 tests, 1 failure, 6 ignored (1 assumption)

Total time: 18 minutes 55 seconds
Build step 'Execute shell' marked build as failure
Archiving artifacts
Recording test results
Email was triggered for: Failure
Sending email for trigger: Failure



Mime
View raw message