lucene-dev mailing list archives

Site index · List index
Message view « Date » · « Thread »
Top « Date » · « Thread »
From Policeman Jenkins Server <jenk...@sd-datasolutions.de>
Subject [JENKINS] Lucene-Solr-trunk-Linux (64bit/jdk1.8.0-ea-b49) - Build # 11 - Still Failing!
Date Mon, 30 Jul 2012 01:01:18 GMT
Build: http://jenkins.sd-datasolutions.de/job/Lucene-Solr-trunk-Linux/11/
Java: 64bit/jdk1.8.0-ea-b49, -client -XX:+UseG1GC

1 tests failed.
FAILED:  org.apache.solr.handler.component.DistributedQueryElevationComponentTest.testDistribSearch

Error Message:
.responseHeader.params.size()==9,9skipped=4,5

Stack Trace:
junit.framework.AssertionFailedError: .responseHeader.params.size()==9,9skipped=4,5
	at __randomizedtesting.SeedInfo.seed([1046BCD2048960C4:91A032CA73D600F8]:0)
	at junit.framework.Assert.fail(Assert.java:50)
	at org.apache.solr.BaseDistributedSearchTestCase.compareResponses(BaseDistributedSearchTestCase.java:670)
	at org.apache.solr.BaseDistributedSearchTestCase.query(BaseDistributedSearchTestCase.java:392)
	at org.apache.solr.handler.component.DistributedQueryElevationComponentTest.doTest(DistributedQueryElevationComponentTest.java:81)
	at org.apache.solr.BaseDistributedSearchTestCase.testDistribSearch(BaseDistributedSearchTestCase.java:679)
	at sun.reflect.NativeMethodAccessorImpl.invoke0(Native Method)
	at sun.reflect.NativeMethodAccessorImpl.invoke(NativeMethodAccessorImpl.java:57)
	at sun.reflect.DelegatingMethodAccessorImpl.invoke(DelegatingMethodAccessorImpl.java:43)
	at java.lang.reflect.Method.invoke(Method.java:474)
	at com.carrotsearch.randomizedtesting.RandomizedRunner.invoke(RandomizedRunner.java:1995)
	at com.carrotsearch.randomizedtesting.RandomizedRunner.access$1100(RandomizedRunner.java:132)
	at com.carrotsearch.randomizedtesting.RandomizedRunner$6.evaluate(RandomizedRunner.java:818)
	at com.carrotsearch.randomizedtesting.RandomizedRunner$7.evaluate(RandomizedRunner.java:877)
	at com.carrotsearch.randomizedtesting.RandomizedRunner$8.evaluate(RandomizedRunner.java:891)
	at com.carrotsearch.randomizedtesting.rules.SystemPropertiesRestoreRule$1.evaluate(SystemPropertiesRestoreRule.java:53)
	at org.apache.lucene.util.TestRuleSetupTeardownChained$1.evaluate(TestRuleSetupTeardownChained.java:50)
	at org.apache.lucene.util.TestRuleFieldCacheSanity$1.evaluate(TestRuleFieldCacheSanity.java:32)
	at org.apache.lucene.util.AbstractBeforeAfterRule$1.evaluate(AbstractBeforeAfterRule.java:45)
	at com.carrotsearch.randomizedtesting.rules.SystemPropertiesInvariantRule$1.evaluate(SystemPropertiesInvariantRule.java:55)
	at org.apache.lucene.util.TestRuleReportUncaughtExceptions$1.evaluate(TestRuleReportUncaughtExceptions.java:68)
	at org.apache.lucene.util.TestRuleThreadAndTestName$1.evaluate(TestRuleThreadAndTestName.java:48)
	at org.apache.lucene.util.TestRuleIgnoreAfterMaxFailures$1.evaluate(TestRuleIgnoreAfterMaxFailures.java:70)
	at org.apache.lucene.util.TestRuleMarkFailure$1.evaluate(TestRuleMarkFailure.java:48)
	at com.carrotsearch.randomizedtesting.RandomizedRunner.runSingleTest(RandomizedRunner.java:825)
	at com.carrotsearch.randomizedtesting.RandomizedRunner.access$700(RandomizedRunner.java:132)
	at com.carrotsearch.randomizedtesting.RandomizedRunner$3$1.run(RandomizedRunner.java:671)
	at com.carrotsearch.randomizedtesting.RandomizedRunner$3.evaluate(RandomizedRunner.java:697)
	at com.carrotsearch.randomizedtesting.RandomizedRunner$4.evaluate(RandomizedRunner.java:736)
	at com.carrotsearch.randomizedtesting.RandomizedRunner$5.evaluate(RandomizedRunner.java:747)
	at com.carrotsearch.randomizedtesting.rules.SystemPropertiesRestoreRule$1.evaluate(SystemPropertiesRestoreRule.java:53)
	at org.apache.lucene.util.AbstractBeforeAfterRule$1.evaluate(AbstractBeforeAfterRule.java:45)
	at org.apache.lucene.util.TestRuleReportUncaughtExceptions$1.evaluate(TestRuleReportUncaughtExceptions.java:68)
	at org.apache.lucene.util.TestRuleStoreClassName$1.evaluate(TestRuleStoreClassName.java:38)
	at com.carrotsearch.randomizedtesting.rules.SystemPropertiesInvariantRule$1.evaluate(SystemPropertiesInvariantRule.java:55)
	at org.apache.lucene.util.TestRuleNoInstanceHooksOverrides$1.evaluate(TestRuleNoInstanceHooksOverrides.java:53)
	at org.apache.lucene.util.TestRuleNoStaticHooksShadowing$1.evaluate(TestRuleNoStaticHooksShadowing.java:52)
	at org.apache.lucene.util.TestRuleAssertionsRequired$1.evaluate(TestRuleAssertionsRequired.java:36)
	at org.apache.lucene.util.TestRuleMarkFailure$1.evaluate(TestRuleMarkFailure.java:48)
	at org.apache.lucene.util.TestRuleIgnoreAfterMaxFailures$1.evaluate(TestRuleIgnoreAfterMaxFailures.java:70)
	at org.apache.lucene.util.TestRuleIgnoreTestSuites$1.evaluate(TestRuleIgnoreTestSuites.java:55)
	at com.carrotsearch.randomizedtesting.RandomizedRunner.runSuite(RandomizedRunner.java:605)
	at com.carrotsearch.randomizedtesting.RandomizedRunner.access$400(RandomizedRunner.java:132)
	at com.carrotsearch.randomizedtesting.RandomizedRunner$2.run(RandomizedRunner.java:551)




Build Log:
[...truncated 7471 lines...]
[junit4:junit4] Suite: org.apache.solr.handler.component.DistributedQueryElevationComponentTest
[junit4:junit4] FAILURE 1.32s J0 | DistributedQueryElevationComponentTest.testDistribSearch
[junit4:junit4]    > Throwable #1: junit.framework.AssertionFailedError: .responseHeader.params.size()==9,9skipped=4,5
[junit4:junit4]    > 	at __randomizedtesting.SeedInfo.seed([1046BCD2048960C4:91A032CA73D600F8]:0)
[junit4:junit4]    > 	at junit.framework.Assert.fail(Assert.java:50)
[junit4:junit4]    > 	at org.apache.solr.BaseDistributedSearchTestCase.compareResponses(BaseDistributedSearchTestCase.java:670)
[junit4:junit4]    > 	at org.apache.solr.BaseDistributedSearchTestCase.query(BaseDistributedSearchTestCase.java:392)
[junit4:junit4]    > 	at org.apache.solr.handler.component.DistributedQueryElevationComponentTest.doTest(DistributedQueryElevationComponentTest.java:81)
[junit4:junit4]    > 	at org.apache.solr.BaseDistributedSearchTestCase.testDistribSearch(BaseDistributedSearchTestCase.java:679)
[junit4:junit4]    > 	at sun.reflect.NativeMethodAccessorImpl.invoke0(Native Method)
[junit4:junit4]    > 	at sun.reflect.NativeMethodAccessorImpl.invoke(NativeMethodAccessorImpl.java:57)
[junit4:junit4]    > 	at sun.reflect.DelegatingMethodAccessorImpl.invoke(DelegatingMethodAccessorImpl.java:43)
[junit4:junit4]    > 	at java.lang.reflect.Method.invoke(Method.java:474)
[junit4:junit4]    > 	at com.carrotsearch.randomizedtesting.RandomizedRunner.invoke(RandomizedRunner.java:1995)
[junit4:junit4]    > 	at com.carrotsearch.randomizedtesting.RandomizedRunner.access$1100(RandomizedRunner.java:132)
[junit4:junit4]    > 	at com.carrotsearch.randomizedtesting.RandomizedRunner$6.evaluate(RandomizedRunner.java:818)
[junit4:junit4]    > 	at com.carrotsearch.randomizedtesting.RandomizedRunner$7.evaluate(RandomizedRunner.java:877)
[junit4:junit4]    > 	at com.carrotsearch.randomizedtesting.RandomizedRunner$8.evaluate(RandomizedRunner.java:891)
[junit4:junit4]    > 	at com.carrotsearch.randomizedtesting.rules.SystemPropertiesRestoreRule$1.evaluate(SystemPropertiesRestoreRule.java:53)
[junit4:junit4]    > 	at org.apache.lucene.util.TestRuleSetupTeardownChained$1.evaluate(TestRuleSetupTeardownChained.java:50)
[junit4:junit4]    > 	at org.apache.lucene.util.TestRuleFieldCacheSanity$1.evaluate(TestRuleFieldCacheSanity.java:32)
[junit4:junit4]    > 	at org.apache.lucene.util.AbstractBeforeAfterRule$1.evaluate(AbstractBeforeAfterRule.java:45)
[junit4:junit4]    > 	at com.carrotsearch.randomizedtesting.rules.SystemPropertiesInvariantRule$1.evaluate(SystemPropertiesInvariantRule.java:55)
[junit4:junit4]    > 	at org.apache.lucene.util.TestRuleReportUncaughtExceptions$1.evaluate(TestRuleReportUncaughtExceptions.java:68)
[junit4:junit4]    > 	at org.apache.lucene.util.TestRuleThreadAndTestName$1.evaluate(TestRuleThreadAndTestName.java:48)
[junit4:junit4]    > 	at org.apache.lucene.util.TestRuleIgnoreAfterMaxFailures$1.evaluate(TestRuleIgnoreAfterMaxFailures.java:70)
[junit4:junit4]    > 	at org.apache.lucene.util.TestRuleMarkFailure$1.evaluate(TestRuleMarkFailure.java:48)
[junit4:junit4]    > 	at com.carrotsearch.randomizedtesting.RandomizedRunner.runSingleTest(RandomizedRunner.java:825)
[junit4:junit4]    > 	at com.carrotsearch.randomizedtesting.RandomizedRunner.access$700(RandomizedRunner.java:132)
[junit4:junit4]    > 	at com.carrotsearch.randomizedtesting.RandomizedRunner$3$1.run(RandomizedRunner.java:671)
[junit4:junit4]    > 	at com.carrotsearch.randomizedtesting.RandomizedRunner$3.evaluate(RandomizedRunner.java:697)
[junit4:junit4]    > 	at com.carrotsearch.randomizedtesting.RandomizedRunner$4.evaluate(RandomizedRunner.java:736)
[junit4:junit4]    > 	at com.carrotsearch.randomizedtesting.RandomizedRunner$5.evaluate(RandomizedRunner.java:747)
[junit4:junit4]    > 	at com.carrotsearch.randomizedtesting.rules.SystemPropertiesRestoreRule$1.evaluate(SystemPropertiesRestoreRule.java:53)
[junit4:junit4]    > 	at org.apache.lucene.util.AbstractBeforeAfterRule$1.evaluate(AbstractBeforeAfterRule.java:45)
[junit4:junit4]    > 	at org.apache.lucene.util.TestRuleReportUncaughtExceptions$1.evaluate(TestRuleReportUncaughtExceptions.java:68)
[junit4:junit4]    > 	at org.apache.lucene.util.TestRuleStoreClassName$1.evaluate(TestRuleStoreClassName.java:38)
[junit4:junit4]    > 	at com.carrotsearch.randomizedtesting.rules.SystemPropertiesInvariantRule$1.evaluate(SystemPropertiesInvariantRule.java:55)
[junit4:junit4]    > 	at org.apache.lucene.util.TestRuleNoInstanceHooksOverrides$1.evaluate(TestRuleNoInstanceHooksOverrides.java:53)
[junit4:junit4]    > 	at org.apache.lucene.util.TestRuleNoStaticHooksShadowing$1.evaluate(TestRuleNoStaticHooksShadowing.java:52)
[junit4:junit4]    > 	at org.apache.lucene.util.TestRuleAssertionsRequired$1.evaluate(TestRuleAssertionsRequired.java:36)
[junit4:junit4]    > 	at org.apache.lucene.util.TestRuleMarkFailure$1.evaluate(TestRuleMarkFailure.java:48)
[junit4:junit4]    > 	at org.apache.lucene.util.TestRuleIgnoreAfterMaxFailures$1.evaluate(TestRuleIgnoreAfterMaxFailures.java:70)
[junit4:junit4]    > 	at org.apache.lucene.util.TestRuleIgnoreTestSuites$1.evaluate(TestRuleIgnoreTestSuites.java:55)
[junit4:junit4]    > 	at com.carrotsearch.randomizedtesting.RandomizedRunner.runSuite(RandomizedRunner.java:605)
[junit4:junit4]    > 	at com.carrotsearch.randomizedtesting.RandomizedRunner.access$400(RandomizedRunner.java:132)
[junit4:junit4]    > 	at com.carrotsearch.randomizedtesting.RandomizedRunner$2.run(RandomizedRunner.java:551)
[junit4:junit4]    > 
[junit4:junit4]   2> 1 T2363 oas.SolrTestCaseJ4.setUp ###Starting testDistribSearch
[junit4:junit4]   2> 2 T2363 oejs.Server.doStart jetty-8.1.2.v20120308
[junit4:junit4]   2> 5 T2363 oejs.AbstractConnector.doStart Started SocketConnector@0.0.0.0:59725
[junit4:junit4]   2> 6 T2363 oasc.SolrResourceLoader.locateSolrHome JNDI not configured for solr (NoInitialContextEx)
[junit4:junit4]   2> 6 T2363 oasc.SolrResourceLoader.locateSolrHome using system property solr.solr.home: /mnt/ssd/jenkins/workspace/Lucene-Solr-trunk-Linux/checkout/solr/build/solr-core/test-files/solr
[junit4:junit4]   2> 6 T2363 oasc.SolrResourceLoader.<init> new SolrResourceLoader for deduced Solr Home: '/mnt/ssd/jenkins/workspace/Lucene-Solr-trunk-Linux/checkout/solr/build/solr-core/test-files/solr/'
[junit4:junit4]   2> 15 T2363 oass.SolrDispatchFilter.init SolrDispatchFilter.init()
[junit4:junit4]   2> 16 T2363 oasc.SolrResourceLoader.locateSolrHome JNDI not configured for solr (NoInitialContextEx)
[junit4:junit4]   2> 16 T2363 oasc.SolrResourceLoader.locateSolrHome using system property solr.solr.home: /mnt/ssd/jenkins/workspace/Lucene-Solr-trunk-Linux/checkout/solr/build/solr-core/test-files/solr
[junit4:junit4]   2> 16 T2363 oasc.CoreContainer$Initializer.initialize looking for solr.xml: /mnt/ssd/jenkins/workspace/Lucene-Solr-trunk-Linux/checkout/solr/build/solr-core/test-files/solr/solr.xml
[junit4:junit4]   2> 17 T2363 oasc.CoreContainer.<init> New CoreContainer 1658273943
[junit4:junit4]   2> 17 T2363 oasc.CoreContainer.load Loading CoreContainer using Solr Home: '/mnt/ssd/jenkins/workspace/Lucene-Solr-trunk-Linux/checkout/solr/build/solr-core/test-files/solr/'
[junit4:junit4]   2> 17 T2363 oasc.SolrResourceLoader.<init> new SolrResourceLoader for directory: '/mnt/ssd/jenkins/workspace/Lucene-Solr-trunk-Linux/checkout/solr/build/solr-core/test-files/solr/'
[junit4:junit4]   2> 31 T2363 oasc.CoreContainer.load Registering Log Listener
[junit4:junit4]   2> 41 T2363 oasc.CoreContainer.create Creating SolrCore 'collection1' using instanceDir: /mnt/ssd/jenkins/workspace/Lucene-Solr-trunk-Linux/checkout/solr/build/solr-core/test-files/solr/collection1
[junit4:junit4]   2> 42 T2363 oasc.SolrResourceLoader.<init> new SolrResourceLoader for directory: '/mnt/ssd/jenkins/workspace/Lucene-Solr-trunk-Linux/checkout/solr/build/solr-core/test-files/solr/collection1/'
[junit4:junit4]   2> 42 T2363 oasc.SolrResourceLoader.replaceClassLoader Adding 'file:/mnt/ssd/jenkins/workspace/Lucene-Solr-trunk-Linux/checkout/solr/build/solr-core/test-files/solr/collection1/lib/README' to classloader
[junit4:junit4]   2> 42 T2363 oasc.SolrResourceLoader.replaceClassLoader Adding 'file:/mnt/ssd/jenkins/workspace/Lucene-Solr-trunk-Linux/checkout/solr/build/solr-core/test-files/solr/collection1/lib/classes/' to classloader
[junit4:junit4]   2> 60 T2363 oasc.SolrConfig.<init> Using Lucene MatchVersion: LUCENE_50
[junit4:junit4]   2> 88 T2363 oasc.SolrConfig.<init> Loaded SolrConfig: solrconfig-elevate.xml
[junit4:junit4]   2> 88 T2363 oass.IndexSchema.readSchema Reading Solr Schema
[junit4:junit4]   2> 90 T2363 oass.IndexSchema.readSchema Schema name=example
[junit4:junit4]   2> 226 T2363 oass.IndexSchema.readSchema default search field in schema is text
[junit4:junit4]   2> 228 T2363 oass.IndexSchema.readSchema unique key field: id
[junit4:junit4]   2> 229 T2363 oasc.SolrCore.<init> [collection1] Opening new SolrCore at /mnt/ssd/jenkins/workspace/Lucene-Solr-trunk-Linux/checkout/solr/build/solr-core/test-files/solr/collection1/, dataDir=./org.apache.solr.handler.component.DistributedQueryElevationComponentTest-1343610021314/control/data/
[junit4:junit4]   2> 230 T2363 oasc.JmxMonitoredMap.<init> JMX monitoring is enabled. Adding Solr mbeans to JMX Server: com.sun.jmx.mbeanserver.JmxMBeanServer@be6a413
[junit4:junit4]   2> 230 T2363 oasc.SolrCore.getNewIndexDir WARNING New index directory detected: old=null new=./org.apache.solr.handler.component.DistributedQueryElevationComponentTest-1343610021314/control/data/index/
[junit4:junit4]   2> 231 T2363 oasc.SolrCore.initIndex WARNING [collection1] Solr index directory './org.apache.solr.handler.component.DistributedQueryElevationComponentTest-1343610021314/control/data/index' doesn't exist. Creating new index...
[junit4:junit4]   2> 231 T2363 oasc.SolrDeletionPolicy.onCommit SolrDeletionPolicy.onCommit: commits:num=1
[junit4:junit4]   2> 		commit{dir=MockDirWrapper(org.apache.lucene.store.RAMDirectory@46c8ec1 lockFactory=org.apache.lucene.store.SingleInstanceLockFactory@28751711),segFN=segments_1,generation=1,filenames=[segments_1]
[junit4:junit4]   2> 232 T2363 oasc.SolrDeletionPolicy.updateCommits newest commit = 1
[junit4:junit4]   2> 233 T2363 oasc.RequestHandlers.initHandlersFromConfig created /update: solr.UpdateRequestHandler
[junit4:junit4]   2> 233 T2363 oasc.RequestHandlers.initHandlersFromConfig created /elevate: org.apache.solr.handler.component.SearchHandler
[junit4:junit4]   2> 233 T2363 oasc.RequestHandlers.initHandlersFromConfig created /dataElevate: org.apache.solr.handler.component.SearchHandler
[junit4:junit4]   2> 234 T2363 oashl.XMLLoader.init xsltCacheLifetimeSeconds=60
[junit4:junit4]   2> 234 T2363 oasc.RequestHandlers.initHandlersFromConfig WARNING no default request handler is registered (either '/select' or 'standard')
[junit4:junit4]   2> 235 T2363 oasc.SolrCore.initDeprecatedSupport WARNING solrconfig.xml uses deprecated <admin/gettableFiles>, Please update your config to use the ShowFileRequestHandler.
[junit4:junit4]   2> 236 T2363 oasc.SolrCore.initDeprecatedSupport WARNING adding ShowFileRequestHandler with hidden files: [HYPHENATION.DTD, SCHEMA-REPLICATION1.XML, ELEVATE.XML, SYNONYMS.TXT, SCHEMA12.XML, SCHEMA-SIM.XML, SCHEMA-BINARYFIELD.XML, SCHEMA11.XML, SCHEMA-REPLICATION2.XML, MISSING.FUNCTIONS.UPDATEPROCESSOR.JS, BAD-SCHEMA-DUP-DYNAMICFIELD.XML, SOLRCONFIG-MASTER2.XML, SOLRCONFIG_PERF.XML, SOLRCONFIG-BASIC.XML, OLD_SYNONYMS.TXT, SOLRCONFIG-XINCLUDE.XML, BAD-SCHEMA-CODEC-GLOBAL-VS-FT-MISMATCH.XML, SOLRCONFIG-ELEVATE.XML, SOLRCONFIG-PHRASESUGGEST.XML, CURRENCY.XML, BAD-SOLRCONFIG-BOGUS-SCRIPTENGINE-NAME.XML, SCHEMA-TFIDF.XML, SOLRCONFIG-REQHANDLER.INCL, SOLRCONFIG-TRANSFORMERS.XML, HUNSPELL-TEST.AFF, STOPWITHBOM.TXT, SOLRCONFIG-QUERYSENDER.XML, SCHEMA-TRIE.XML, SCHEMA-SPELLCHECKER.XML, BAD-SCHEMA-OMIT-TF-BUT-NOT-POS.XML, BAD-SCHEMA-DUP-FIELD.XML, SOLRCONFIG-PROPINJECT-INDEXDEFAULT.XML, STOP-2.TXT, SOLRCONFIG-SCRIPT-UPDATEPROCESSOR.XML, SOLRCONFIG-SOLCOREPROPERTIES.XML, SOLRCONFIG-MASTER.XML, BAD-SCHEMA-SIM-GLOBAL-VS-FT-MISMATCH.XML, SOLRCONFIG-UPDATE-PROCESSOR-CHAINS.XML, SOLRCONFIG-SLAVE1.XML, PHRASESUGGEST.TXT, SCHEMA-REVERSED.XML, SCHEMA-DFR.XML, SCHEMA-COPYFIELD-TEST.XML, OPEN-EXCHANGE-RATES.JSON, SOLRCONFIG-MERGEPOLICY.XML, SOLRCONFIG-MASTER1.XML, SCHEMA-REQUIRED-FIELDS.XML, BAD_SOLRCONFIG.XML, STOPWORDSWRONGENCODING.TXT, SCHEMA-PHRASESUGGEST.XML, SOLRCONFIG-NOCACHE.XML, COMPOUNDDICTIONARY.TXT, SCHEMASURROUND.XML, STEMDICT.TXT, SCHEMA15.XML, SCHEMA-IB.XML, ADDFIELDS.UPDATEPROCESSOR.JS, SCHEMA-LMDIRICHLET.XML, SOLRCONFIG-DELPOLICY2.XML, SOLRCONFIG-FUNCTIONQUERY.XML, SCHEMA-FOLDING.XML, SOLRCONFIG-LAZYWRITER.XML, SOLRCONFIG-TERMINDEX.XML, SCHEMA-MINIMAL.XML, PROTWORDS.TXT, MAPPING-ISOLATIN1ACCENT.TXT, BAD-SCHEMA-NOT-INDEXED-BUT-POS.XML, SOLRCONFIG-MASTER1-KEEPONEBACKUP.XML, STOPWORDS.TXT, SCHEMA-STOP-KEEP.XML, SOLRCONFIG-MASTER3.XML, KEEP-2.TXT, STOPTYPES-1.TXT, XSLT, SCHEMA.XML, SOLRCONFIG-SPELLCHECKCOMPONENT.XML, BAD-SCHEMA-NOT-INDEXED-BUT-TF.XML, SCHEMA-LMJELINEKMERCER.XML, SOLRCONFIG-DELPOLICY1.XML, STOP-1.TXT, SOLRCONFIG-ALTDIRECTORY.XML, BAD-SCHEMA-DUP-FIELDTYPE.XML, TRIVIAL.UPDATEPROCESSOR1.JS, SOLRCONFIG-SOLR-749.XML, STOPTYPES-2.TXT, SOLRCONFIG-CACHING.XML, SOLRCONFIG-PROPINJECT.XML, SCHEMA-CHARFILTERS.XML, SCHEMA-NUMERIC.XML, SOLRCONFIG-SLAVE.XML, BAD-SOLRCONFIG-MISSING-SCRIPTFILE.XML, BAD-SCHEMA-UNIQUEKEY-USES-DEFAULT.XML, SCHEMA-BM25.XML, BAD-SCHEMA-NONTEXT-ANALYZER.XML, BAD-SOLRCONFIG-INVALID-SCRIPTFILE.XML, SOLRCONFIG-ENABLEPLUGIN.XML, SCHEMA-NOT-REQUIRED-UNIQUE-KEY.XML, SOLRCONFIG-TLOG.XML, SOLRCONFIG-SIMPLELOCK.XML, BAD-SCHEMA-UNIQUEKEY-IS-COPYFIELD-DEST.XML, HUNSPELL-TEST.DIC, DA_COMPOUNDDICTIONARY.TXT, BAD-SCHEMA-NOT-INDEXED-BUT-NORMS.XML, KEEP-1.TXT, SCHEMA_CODEC.XML, SOLRCONFIG-SPELLCHECKER.XML, DA_UTF8.XML, TRIVIAL.UPDATEPROCESSOR0.JS, CONDITIONAL.UPDATEPROCESSOR.JS, SCHEMA-COLLATE.XML, SOLRCONFIG_CODEC.XML, THROW.ERROR.ON.ADD.UPDATEPROCESSOR.JS, STOP-SNOWBALL.TXT, MISSLEADING.EXTENSION.UPDATEPROCESSOR.JS.TXT, BAD-MP-SOLRCONFIG.XML, SOLRCONFIG-REPEATER.XML, SOLRCONFIG-HIGHLIGHT.XML, WDFTYPES.TXT, SOLRCONFIG-QUERYSENDER-NOQUERY.XML, BAD-SCHEMA-EXTERNAL-FILEFIELD.XML, FRENCHARTICLES.TXT, SCHEMA-LUCENEMATCHVERSION.XML, SOLRCONFIG-NATIVELOCK.XML]
[junit4:junit4]   2> 237 T2363 oass.SolrIndexSearcher.<init> Opening Searcher@869e9df main
[junit4:junit4]   2> 237 T2363 oass.SolrIndexSearcher.getIndexDir WARNING WARNING: Directory impl does not support setting indexDir: org.apache.lucene.store.MockDirectoryWrapper
[junit4:junit4]   2> 238 T2363 oasu.CommitTracker.<init> Hard AutoCommit: disabled
[junit4:junit4]   2> 238 T2363 oasu.CommitTracker.<init> Soft AutoCommit: disabled
[junit4:junit4]   2> 238 T2363 oashc.QueryElevationComponent.inform Loading QueryElevation from: /mnt/ssd/jenkins/workspace/Lucene-Solr-trunk-Linux/checkout/solr/build/solr-core/test-files/solr/collection1/conf/elevate.xml
[junit4:junit4]   2> 245 T2363 oashc.QueryElevationComponent.inform Loading QueryElevation from: /mnt/ssd/jenkins/workspace/Lucene-Solr-trunk-Linux/checkout/solr/build/solr-core/test-files/solr/collection1/conf/elevate.xml
[junit4:junit4]   2> 250 T2363 oashc.HttpShardHandlerFactory.getParameter Setting socketTimeout to: 0
[junit4:junit4]   2> 251 T2363 oashc.HttpShardHandlerFactory.getParameter Setting urlScheme to: http://
[junit4:junit4]   2> 251 T2363 oashc.HttpShardHandlerFactory.getParameter Setting connTimeout to: 0
[junit4:junit4]   2> 251 T2363 oashc.HttpShardHandlerFactory.getParameter Setting maxConnectionsPerHost to: 20
[junit4:junit4]   2> 251 T2363 oashc.HttpShardHandlerFactory.getParameter Setting corePoolSize to: 0
[junit4:junit4]   2> 252 T2363 oashc.HttpShardHandlerFactory.getParameter Setting maximumPoolSize to: 2147483647
[junit4:junit4]   2> 252 T2363 oashc.HttpShardHandlerFactory.getParameter Setting maxThreadIdleTime to: 5
[junit4:junit4]   2> 252 T2363 oashc.HttpShardHandlerFactory.getParameter Setting sizeOfQueue to: -1
[junit4:junit4]   2> 252 T2363 oashc.HttpShardHandlerFactory.getParameter Setting fairnessPolicy to: false
[junit4:junit4]   2> 253 T2363 oascsi.HttpClientUtil.createClient Creating new http client, config:maxConnectionsPerHost=20&maxConnections=10000&socketTimeout=0&connTimeout=0&retry=false
[junit4:junit4]   2> 255 T2363 oasc.CoreContainer.register registering core: collection1
[junit4:junit4]   2> 255 T2363 oass.SolrDispatchFilter.init user.dir=/mnt/ssd/jenkins/workspace/Lucene-Solr-trunk-Linux/checkout/solr/build/solr-core/test/J0
[junit4:junit4]   2> 255 T2363 oass.SolrDispatchFilter.init SolrDispatchFilter.init() done
[junit4:junit4]   2> 256 T2363 oascsi.HttpClientUtil.createClient Creating new http client, config:maxConnections=128&maxConnectionsPerHost=32&followRedirects=false
[junit4:junit4]   2> 258 T2363 oejs.Server.doStart jetty-8.1.2.v20120308
[junit4:junit4]   2> 269 T2373 oasc.SolrCore.registerSearcher [collection1] Registered new searcher Searcher@869e9df main{StandardDirectoryReader(segments_1:1)}
[junit4:junit4]   2> 271 T2363 oejs.AbstractConnector.doStart Started SocketConnector@0.0.0.0:53866
[junit4:junit4]   2> 272 T2363 oasc.SolrResourceLoader.locateSolrHome JNDI not configured for solr (NoInitialContextEx)
[junit4:junit4]   2> 272 T2363 oasc.SolrResourceLoader.locateSolrHome using system property solr.solr.home: /mnt/ssd/jenkins/workspace/Lucene-Solr-trunk-Linux/checkout/solr/build/solr-core/test-files/solr
[junit4:junit4]   2> 272 T2363 oasc.SolrResourceLoader.<init> new SolrResourceLoader for deduced Solr Home: '/mnt/ssd/jenkins/workspace/Lucene-Solr-trunk-Linux/checkout/solr/build/solr-core/test-files/solr/'
[junit4:junit4]   2> 280 T2363 oass.SolrDispatchFilter.init SolrDispatchFilter.init()
[junit4:junit4]   2> 280 T2363 oasc.SolrResourceLoader.locateSolrHome JNDI not configured for solr (NoInitialContextEx)
[junit4:junit4]   2> 281 T2363 oasc.SolrResourceLoader.locateSolrHome using system property solr.solr.home: /mnt/ssd/jenkins/workspace/Lucene-Solr-trunk-Linux/checkout/solr/build/solr-core/test-files/solr
[junit4:junit4]   2> 281 T2363 oasc.CoreContainer$Initializer.initialize looking for solr.xml: /mnt/ssd/jenkins/workspace/Lucene-Solr-trunk-Linux/checkout/solr/build/solr-core/test-files/solr/solr.xml
[junit4:junit4]   2> 281 T2363 oasc.CoreContainer.<init> New CoreContainer 1623836576
[junit4:junit4]   2> 281 T2363 oasc.CoreContainer.load Loading CoreContainer using Solr Home: '/mnt/ssd/jenkins/workspace/Lucene-Solr-trunk-Linux/checkout/solr/build/solr-core/test-files/solr/'
[junit4:junit4]   2> 282 T2363 oasc.SolrResourceLoader.<init> new SolrResourceLoader for directory: '/mnt/ssd/jenkins/workspace/Lucene-Solr-trunk-Linux/checkout/solr/build/solr-core/test-files/solr/'
[junit4:junit4]   2> 291 T2363 oasc.CoreContainer.load Registering Log Listener
[junit4:junit4]   2> 301 T2363 oasc.CoreContainer.create Creating SolrCore 'collection1' using instanceDir: /mnt/ssd/jenkins/workspace/Lucene-Solr-trunk-Linux/checkout/solr/build/solr-core/test-files/solr/collection1
[junit4:junit4]   2> 301 T2363 oasc.SolrResourceLoader.<init> new SolrResourceLoader for directory: '/mnt/ssd/jenkins/workspace/Lucene-Solr-trunk-Linux/checkout/solr/build/solr-core/test-files/solr/collection1/'
[junit4:junit4]   2> 302 T2363 oasc.SolrResourceLoader.replaceClassLoader Adding 'file:/mnt/ssd/jenkins/workspace/Lucene-Solr-trunk-Linux/checkout/solr/build/solr-core/test-files/solr/collection1/lib/README' to classloader
[junit4:junit4]   2> 302 T2363 oasc.SolrResourceLoader.replaceClassLoader Adding 'file:/mnt/ssd/jenkins/workspace/Lucene-Solr-trunk-Linux/checkout/solr/build/solr-core/test-files/solr/collection1/lib/classes/' to classloader
[junit4:junit4]   2> 321 T2363 oasc.SolrConfig.<init> Using Lucene MatchVersion: LUCENE_50
[junit4:junit4]   2> 351 T2363 oasc.SolrConfig.<init> Loaded SolrConfig: solrconfig-elevate.xml
[junit4:junit4]   2> 351 T2363 oass.IndexSchema.readSchema Reading Solr Schema
[junit4:junit4]   2> 353 T2363 oass.IndexSchema.readSchema Schema name=example
[junit4:junit4]   2> 465 T2363 oass.IndexSchema.readSchema default search field in schema is text
[junit4:junit4]   2> 467 T2363 oass.IndexSchema.readSchema unique key field: id
[junit4:junit4]   2> 469 T2363 oasc.SolrCore.<init> [collection1] Opening new SolrCore at /mnt/ssd/jenkins/workspace/Lucene-Solr-trunk-Linux/checkout/solr/build/solr-core/test-files/solr/collection1/, dataDir=./org.apache.solr.handler.component.DistributedQueryElevationComponentTest-1343610021314/shard0/data/
[junit4:junit4]   2> 469 T2363 oasc.JmxMonitoredMap.<init> JMX monitoring is enabled. Adding Solr mbeans to JMX Server: com.sun.jmx.mbeanserver.JmxMBeanServer@be6a413
[junit4:junit4]   2> 469 T2363 oasc.SolrCore.getNewIndexDir WARNING New index directory detected: old=null new=./org.apache.solr.handler.component.DistributedQueryElevationComponentTest-1343610021314/shard0/data/index/
[junit4:junit4]   2> 470 T2363 oasc.SolrCore.initIndex WARNING [collection1] Solr index directory './org.apache.solr.handler.component.DistributedQueryElevationComponentTest-1343610021314/shard0/data/index' doesn't exist. Creating new index...
[junit4:junit4]   2> 471 T2363 oasc.SolrDeletionPolicy.onCommit SolrDeletionPolicy.onCommit: commits:num=1
[junit4:junit4]   2> 		commit{dir=MockDirWrapper(org.apache.lucene.store.RAMDirectory@7f95ec7e lockFactory=org.apache.lucene.store.SingleInstanceLockFactory@35d47595),segFN=segments_1,generation=1,filenames=[segments_1]
[junit4:junit4]   2> 471 T2363 oasc.SolrDeletionPolicy.updateCommits newest commit = 1
[junit4:junit4]   2> 472 T2363 oasc.RequestHandlers.initHandlersFromConfig created /update: solr.UpdateRequestHandler
[junit4:junit4]   2> 473 T2363 oasc.RequestHandlers.initHandlersFromConfig created /elevate: org.apache.solr.handler.component.SearchHandler
[junit4:junit4]   2> 473 T2363 oasc.RequestHandlers.initHandlersFromConfig created /dataElevate: org.apache.solr.handler.component.SearchHandler
[junit4:junit4]   2> 474 T2363 oashl.XMLLoader.init xsltCacheLifetimeSeconds=60
[junit4:junit4]   2> 474 T2363 oasc.RequestHandlers.initHandlersFromConfig WARNING no default request handler is registered (either '/select' or 'standard')
[junit4:junit4]   2> 475 T2363 oasc.SolrCore.initDeprecatedSupport WARNING solrconfig.xml uses deprecated <admin/gettableFiles>, Please update your config to use the ShowFileRequestHandler.
[junit4:junit4]   2> 475 T2363 oasc.SolrCore.initDeprecatedSupport WARNING adding ShowFileRequestHandler with hidden files: [HYPHENATION.DTD, SCHEMA-REPLICATION1.XML, ELEVATE.XML, SYNONYMS.TXT, SCHEMA12.XML, SCHEMA-SIM.XML, SCHEMA-BINARYFIELD.XML, SCHEMA11.XML, SCHEMA-REPLICATION2.XML, MISSING.FUNCTIONS.UPDATEPROCESSOR.JS, BAD-SCHEMA-DUP-DYNAMICFIELD.XML, SOLRCONFIG-MASTER2.XML, SOLRCONFIG_PERF.XML, SOLRCONFIG-BASIC.XML, OLD_SYNONYMS.TXT, SOLRCONFIG-XINCLUDE.XML, BAD-SCHEMA-CODEC-GLOBAL-VS-FT-MISMATCH.XML, SOLRCONFIG-ELEVATE.XML, SOLRCONFIG-PHRASESUGGEST.XML, CURRENCY.XML, BAD-SOLRCONFIG-BOGUS-SCRIPTENGINE-NAME.XML, SCHEMA-TFIDF.XML, SOLRCONFIG-REQHANDLER.INCL, SOLRCONFIG-TRANSFORMERS.XML, HUNSPELL-TEST.AFF, STOPWITHBOM.TXT, SOLRCONFIG-QUERYSENDER.XML, SCHEMA-TRIE.XML, SCHEMA-SPELLCHECKER.XML, BAD-SCHEMA-OMIT-TF-BUT-NOT-POS.XML, BAD-SCHEMA-DUP-FIELD.XML, SOLRCONFIG-PROPINJECT-INDEXDEFAULT.XML, STOP-2.TXT, SOLRCONFIG-SCRIPT-UPDATEPROCESSOR.XML, SOLRCONFIG-SOLCOREPROPERTIES.XML, SOLRCONFIG-MASTER.XML, BAD-SCHEMA-SIM-GLOBAL-VS-FT-MISMATCH.XML, SOLRCONFIG-UPDATE-PROCESSOR-CHAINS.XML, SOLRCONFIG-SLAVE1.XML, PHRASESUGGEST.TXT, SCHEMA-REVERSED.XML, SCHEMA-DFR.XML, SCHEMA-COPYFIELD-TEST.XML, OPEN-EXCHANGE-RATES.JSON, SOLRCONFIG-MERGEPOLICY.XML, SOLRCONFIG-MASTER1.XML, SCHEMA-REQUIRED-FIELDS.XML, BAD_SOLRCONFIG.XML, STOPWORDSWRONGENCODING.TXT, SCHEMA-PHRASESUGGEST.XML, SOLRCONFIG-NOCACHE.XML, COMPOUNDDICTIONARY.TXT, SCHEMASURROUND.XML, STEMDICT.TXT, SCHEMA15.XML, SCHEMA-IB.XML, ADDFIELDS.UPDATEPROCESSOR.JS, SCHEMA-LMDIRICHLET.XML, SOLRCONFIG-DELPOLICY2.XML, SOLRCONFIG-FUNCTIONQUERY.XML, SCHEMA-FOLDING.XML, SOLRCONFIG-LAZYWRITER.XML, SOLRCONFIG-TERMINDEX.XML, SCHEMA-MINIMAL.XML, PROTWORDS.TXT, MAPPING-ISOLATIN1ACCENT.TXT, BAD-SCHEMA-NOT-INDEXED-BUT-POS.XML, SOLRCONFIG-MASTER1-KEEPONEBACKUP.XML, STOPWORDS.TXT, SCHEMA-STOP-KEEP.XML, SOLRCONFIG-MASTER3.XML, KEEP-2.TXT, STOPTYPES-1.TXT, XSLT, SCHEMA.XML, SOLRCONFIG-SPELLCHECKCOMPONENT.XML, BAD-SCHEMA-NOT-INDEXED-BUT-TF.XML, SCHEMA-LMJELINEKMERCER.XML, SOLRCONFIG-DELPOLICY1.XML, STOP-1.TXT, SOLRCONFIG-ALTDIRECTORY.XML, BAD-SCHEMA-DUP-FIELDTYPE.XML, TRIVIAL.UPDATEPROCESSOR1.JS, SOLRCONFIG-SOLR-749.XML, STOPTYPES-2.TXT, SOLRCONFIG-CACHING.XML, SOLRCONFIG-PROPINJECT.XML, SCHEMA-CHARFILTERS.XML, SCHEMA-NUMERIC.XML, SOLRCONFIG-SLAVE.XML, BAD-SOLRCONFIG-MISSING-SCRIPTFILE.XML, BAD-SCHEMA-UNIQUEKEY-USES-DEFAULT.XML, SCHEMA-BM25.XML, BAD-SCHEMA-NONTEXT-ANALYZER.XML, BAD-SOLRCONFIG-INVALID-SCRIPTFILE.XML, SOLRCONFIG-ENABLEPLUGIN.XML, SCHEMA-NOT-REQUIRED-UNIQUE-KEY.XML, SOLRCONFIG-TLOG.XML, SOLRCONFIG-SIMPLELOCK.XML, BAD-SCHEMA-UNIQUEKEY-IS-COPYFIELD-DEST.XML, HUNSPELL-TEST.DIC, DA_COMPOUNDDICTIONARY.TXT, BAD-SCHEMA-NOT-INDEXED-BUT-NORMS.XML, KEEP-1.TXT, SCHEMA_CODEC.XML, SOLRCONFIG-SPELLCHECKER.XML, DA_UTF8.XML, TRIVIAL.UPDATEPROCESSOR0.JS, CONDITIONAL.UPDATEPROCESSOR.JS, SCHEMA-COLLATE.XML, SOLRCONFIG_CODEC.XML, THROW.ERROR.ON.ADD.UPDATEPROCESSOR.JS, STOP-SNOWBALL.TXT, MISSLEADING.EXTENSION.UPDATEPROCESSOR.JS.TXT, BAD-MP-SOLRCONFIG.XML, SOLRCONFIG-REPEATER.XML, SOLRCONFIG-HIGHLIGHT.XML, WDFTYPES.TXT, SOLRCONFIG-QUERYSENDER-NOQUERY.XML, BAD-SCHEMA-EXTERNAL-FILEFIELD.XML, FRENCHARTICLES.TXT, SCHEMA-LUCENEMATCHVERSION.XML, SOLRCONFIG-NATIVELOCK.XML]
[junit4:junit4]   2> 477 T2363 oass.SolrIndexSearcher.<init> Opening Searcher@55f15502 main
[junit4:junit4]   2> 477 T2363 oass.SolrIndexSearcher.getIndexDir WARNING WARNING: Directory impl does not support setting indexDir: org.apache.lucene.store.MockDirectoryWrapper
[junit4:junit4]   2> 478 T2363 oasu.CommitTracker.<init> Hard AutoCommit: disabled
[junit4:junit4]   2> 478 T2363 oasu.CommitTracker.<init> Soft AutoCommit: disabled
[junit4:junit4]   2> 478 T2363 oashc.QueryElevationComponent.inform Loading QueryElevation from: /mnt/ssd/jenkins/workspace/Lucene-Solr-trunk-Linux/checkout/solr/build/solr-core/test-files/solr/collection1/conf/elevate.xml
[junit4:junit4]   2> 483 T2363 oashc.QueryElevationComponent.inform Loading QueryElevation from: /mnt/ssd/jenkins/workspace/Lucene-Solr-trunk-Linux/checkout/solr/build/solr-core/test-files/solr/collection1/conf/elevate.xml
[junit4:junit4]   2> 489 T2363 oashc.HttpShardHandlerFactory.getParameter Setting socketTimeout to: 0
[junit4:junit4]   2> 489 T2363 oashc.HttpShardHandlerFactory.getParameter Setting urlScheme to: http://
[junit4:junit4]   2> 490 T2363 oashc.HttpShardHandlerFactory.getParameter Setting connTimeout to: 0
[junit4:junit4]   2> 490 T2363 oashc.HttpShardHandlerFactory.getParameter Setting maxConnectionsPerHost to: 20
[junit4:junit4]   2> 490 T2363 oashc.HttpShardHandlerFactory.getParameter Setting corePoolSize to: 0
[junit4:junit4]   2> 490 T2363 oashc.HttpShardHandlerFactory.getParameter Setting maximumPoolSize to: 2147483647
[junit4:junit4]   2> 490 T2363 oashc.HttpShardHandlerFactory.getParameter Setting maxThreadIdleTime to: 5
[junit4:junit4]   2> 491 T2363 oashc.HttpShardHandlerFactory.getParameter Setting sizeOfQueue to: -1
[junit4:junit4]   2> 491 T2363 oashc.HttpShardHandlerFactory.getParameter Setting fairnessPolicy to: false
[junit4:junit4]   2> 491 T2363 oascsi.HttpClientUtil.createClient Creating new http client, config:maxConnectionsPerHost=20&maxConnections=10000&socketTimeout=0&connTimeout=0&retry=false
[junit4:junit4]   2> 493 T2383 oasc.SolrCore.registerSearcher [collection1] Registered new searcher Searcher@55f15502 main{StandardDirectoryReader(segments_1:1)}
[junit4:junit4]   2> 493 T2363 oasc.CoreContainer.register registering core: collection1
[junit4:junit4]   2> 493 T2363 oass.SolrDispatchFilter.init user.dir=/mnt/ssd/jenkins/workspace/Lucene-Solr-trunk-Linux/checkout/solr/build/solr-core/test/J0
[junit4:junit4]   2> 494 T2363 oass.SolrDispatchFilter.init SolrDispatchFilter.init() done
[junit4:junit4]   2> 494 T2363 oascsi.HttpClientUtil.createClient Creating new http client, config:maxConnections=128&maxConnectionsPerHost=32&followRedirects=false
[junit4:junit4]   2> 496 T2363 oejs.Server.doStart jetty-8.1.2.v20120308
[junit4:junit4]   2> 497 T2363 oejs.AbstractConnector.doStart Started SocketConnector@0.0.0.0:37544
[junit4:junit4]   2> 498 T2363 oasc.SolrResourceLoader.locateSolrHome JNDI not configured for solr (NoInitialContextEx)
[junit4:junit4]   2> 498 T2363 oasc.SolrResourceLoader.locateSolrHome using system property solr.solr.home: /mnt/ssd/jenkins/workspace/Lucene-Solr-trunk-Linux/checkout/solr/build/solr-core/test-files/solr
[junit4:junit4]   2> 498 T2363 oasc.SolrResourceLoader.<init> new SolrResourceLoader for deduced Solr Home: '/mnt/ssd/jenkins/workspace/Lucene-Solr-trunk-Linux/checkout/solr/build/solr-core/test-files/solr/'
[junit4:junit4]   2> 505 T2363 oass.SolrDispatchFilter.init SolrDispatchFilter.init()
[junit4:junit4]   2> 506 T2363 oasc.SolrResourceLoader.locateSolrHome JNDI not configured for solr (NoInitialContextEx)
[junit4:junit4]   2> 506 T2363 oasc.SolrResourceLoader.locateSolrHome using system property solr.solr.home: /mnt/ssd/jenkins/workspace/Lucene-Solr-trunk-Linux/checkout/solr/build/solr-core/test-files/solr
[junit4:junit4]   2> 506 T2363 oasc.CoreContainer$Initializer.initialize looking for solr.xml: /mnt/ssd/jenkins/workspace/Lucene-Solr-trunk-Linux/checkout/solr/build/solr-core/test-files/solr/solr.xml
[junit4:junit4]   2> 506 T2363 oasc.CoreContainer.<init> New CoreContainer 778840177
[junit4:junit4]   2> 507 T2363 oasc.CoreContainer.load Loading CoreContainer using Solr Home: '/mnt/ssd/jenkins/workspace/Lucene-Solr-trunk-Linux/checkout/solr/build/solr-core/test-files/solr/'
[junit4:junit4]   2> 507 T2363 oasc.SolrResourceLoader.<init> new SolrResourceLoader for directory: '/mnt/ssd/jenkins/workspace/Lucene-Solr-trunk-Linux/checkout/solr/build/solr-core/test-files/solr/'
[junit4:junit4]   2> 516 T2363 oasc.CoreContainer.load Registering Log Listener
[junit4:junit4]   2> 529 T2363 oasc.CoreContainer.create Creating SolrCore 'collection1' using instanceDir: /mnt/ssd/jenkins/workspace/Lucene-Solr-trunk-Linux/checkout/solr/build/solr-core/test-files/solr/collection1
[junit4:junit4]   2> 530 T2363 oasc.SolrResourceLoader.<init> new SolrResourceLoader for directory: '/mnt/ssd/jenkins/workspace/Lucene-Solr-trunk-Linux/checkout/solr/build/solr-core/test-files/solr/collection1/'
[junit4:junit4]   2> 531 T2363 oasc.SolrResourceLoader.replaceClassLoader Adding 'file:/mnt/ssd/jenkins/workspace/Lucene-Solr-trunk-Linux/checkout/solr/build/solr-core/test-files/solr/collection1/lib/README' to classloader
[junit4:junit4]   2> 531 T2363 oasc.SolrResourceLoader.replaceClassLoader Adding 'file:/mnt/ssd/jenkins/workspace/Lucene-Solr-trunk-Linux/checkout/solr/build/solr-core/test-files/solr/collection1/lib/classes/' to classloader
[junit4:junit4]   2> 551 T2363 oasc.SolrConfig.<init> Using Lucene MatchVersion: LUCENE_50
[junit4:junit4]   2> 578 T2363 oasc.SolrConfig.<init> Loaded SolrConfig: solrconfig-elevate.xml
[junit4:junit4]   2> 578 T2363 oass.IndexSchema.readSchema Reading Solr Schema
[junit4:junit4]   2> 580 T2363 oass.IndexSchema.readSchema Schema name=example
[junit4:junit4]   2> 719 T2363 oass.IndexSchema.readSchema default search field in schema is text
[junit4:junit4]   2> 721 T2363 oass.IndexSchema.readSchema unique key field: id
[junit4:junit4]   2> 722 T2363 oasc.SolrCore.<init> [collection1] Opening new SolrCore at /mnt/ssd/jenkins/workspace/Lucene-Solr-trunk-Linux/checkout/solr/build/solr-core/test-files/solr/collection1/, dataDir=./org.apache.solr.handler.component.DistributedQueryElevationComponentTest-1343610021314/shard1/data/
[junit4:junit4]   2> 723 T2363 oasc.JmxMonitoredMap.<init> JMX monitoring is enabled. Adding Solr mbeans to JMX Server: com.sun.jmx.mbeanserver.JmxMBeanServer@be6a413
[junit4:junit4]   2> 723 T2363 oasc.SolrCore.getNewIndexDir WARNING New index directory detected: old=null new=./org.apache.solr.handler.component.DistributedQueryElevationComponentTest-1343610021314/shard1/data/index/
[junit4:junit4]   2> 723 T2363 oasc.SolrCore.initIndex WARNING [collection1] Solr index directory './org.apache.solr.handler.component.DistributedQueryElevationComponentTest-1343610021314/shard1/data/index' doesn't exist. Creating new index...
[junit4:junit4]   2> 724 T2363 oasc.SolrDeletionPolicy.onCommit SolrDeletionPolicy.onCommit: commits:num=1
[junit4:junit4]   2> 		commit{dir=MockDirWrapper(org.apache.lucene.store.RAMDirectory@61abf9f9 lockFactory=org.apache.lucene.store.SingleInstanceLockFactory@7c87b527),segFN=segments_1,generation=1,filenames=[segments_1]
[junit4:junit4]   2> 725 T2363 oasc.SolrDeletionPolicy.updateCommits newest commit = 1
[junit4:junit4]   2> 726 T2363 oasc.RequestHandlers.initHandlersFromConfig created /update: solr.UpdateRequestHandler
[junit4:junit4]   2> 726 T2363 oasc.RequestHandlers.initHandlersFromConfig created /elevate: org.apache.solr.handler.component.SearchHandler
[junit4:junit4]   2> 726 T2363 oasc.RequestHandlers.initHandlersFromConfig created /dataElevate: org.apache.solr.handler.component.SearchHandler
[junit4:junit4]   2> 726 T2363 oashl.XMLLoader.init xsltCacheLifetimeSeconds=60
[junit4:junit4]   2> 727 T2363 oasc.RequestHandlers.initHandlersFromConfig WARNING no default request handler is registered (either '/select' or 'standard')
[junit4:junit4]   2> 728 T2363 oasc.SolrCore.initDeprecatedSupport WARNING solrconfig.xml uses deprecated <admin/gettableFiles>, Please update your config to use the ShowFileRequestHandler.
[junit4:junit4]   2> 728 T2363 oasc.SolrCore.initDeprecatedSupport WARNING adding ShowFileRequestHandler with hidden files: [HYPHENATION.DTD, SCHEMA-REPLICATION1.XML, ELEVATE.XML, SYNONYMS.TXT, SCHEMA12.XML, SCHEMA-SIM.XML, SCHEMA-BINARYFIELD.XML, SCHEMA11.XML, SCHEMA-REPLICATION2.XML, MISSING.FUNCTIONS.UPDATEPROCESSOR.JS, BAD-SCHEMA-DUP-DYNAMICFIELD.XML, SOLRCONFIG-MASTER2.XML, SOLRCONFIG_PERF.XML, SOLRCONFIG-BASIC.XML, OLD_SYNONYMS.TXT, SOLRCONFIG-XINCLUDE.XML, BAD-SCHEMA-CODEC-GLOBAL-VS-FT-MISMATCH.XML, SOLRCONFIG-ELEVATE.XML, SOLRCONFIG-PHRASESUGGEST.XML, CURRENCY.XML, BAD-SOLRCONFIG-BOGUS-SCRIPTENGINE-NAME.XML, SCHEMA-TFIDF.XML, SOLRCONFIG-REQHANDLER.INCL, SOLRCONFIG-TRANSFORMERS.XML, HUNSPELL-TEST.AFF, STOPWITHBOM.TXT, SOLRCONFIG-QUERYSENDER.XML, SCHEMA-TRIE.XML, SCHEMA-SPELLCHECKER.XML, BAD-SCHEMA-OMIT-TF-BUT-NOT-POS.XML, BAD-SCHEMA-DUP-FIELD.XML, SOLRCONFIG-PROPINJECT-INDEXDEFAULT.XML, STOP-2.TXT, SOLRCONFIG-SCRIPT-UPDATEPROCESSOR.XML, SOLRCONFIG-SOLCOREPROPERTIES.XML, SOLRCONFIG-MASTER.XML, BAD-SCHEMA-SIM-GLOBAL-VS-FT-MISMATCH.XML, SOLRCONFIG-UPDATE-PROCESSOR-CHAINS.XML, SOLRCONFIG-SLAVE1.XML, PHRASESUGGEST.TXT, SCHEMA-REVERSED.XML, SCHEMA-DFR.XML, SCHEMA-COPYFIELD-TEST.XML, OPEN-EXCHANGE-RATES.JSON, SOLRCONFIG-MERGEPOLICY.XML, SOLRCONFIG-MASTER1.XML, SCHEMA-REQUIRED-FIELDS.XML, BAD_SOLRCONFIG.XML, STOPWORDSWRONGENCODING.TXT, SCHEMA-PHRASESUGGEST.XML, SOLRCONFIG-NOCACHE.XML, COMPOUNDDICTIONARY.TXT, SCHEMASURROUND.XML, STEMDICT.TXT, SCHEMA15.XML, SCHEMA-IB.XML, ADDFIELDS.UPDATEPROCESSOR.JS, SCHEMA-LMDIRICHLET.XML, SOLRCONFIG-DELPOLICY2.XML, SOLRCONFIG-FUNCTIONQUERY.XML, SCHEMA-FOLDING.XML, SOLRCONFIG-LAZYWRITER.XML, SOLRCONFIG-TERMINDEX.XML, SCHEMA-MINIMAL.XML, PROTWORDS.TXT, MAPPING-ISOLATIN1ACCENT.TXT, BAD-SCHEMA-NOT-INDEXED-BUT-POS.XML, SOLRCONFIG-MASTER1-KEEPONEBACKUP.XML, STOPWORDS.TXT, SCHEMA-STOP-KEEP.XML, SOLRCONFIG-MASTER3.XML, KEEP-2.TXT, STOPTYPES-1.TXT, XSLT, SCHEMA.XML, SOLRCONFIG-SPELLCHECKCOMPONENT.XML, BAD-SCHEMA-NOT-INDEXED-BUT-TF.XML, SCHEMA-LMJELINEKMERCER.XML, SOLRCONFIG-DELPOLICY1.XML, STOP-1.TXT, SOLRCONFIG-ALTDIRECTORY.XML, BAD-SCHEMA-DUP-FIELDTYPE.XML, TRIVIAL.UPDATEPROCESSOR1.JS, SOLRCONFIG-SOLR-749.XML, STOPTYPES-2.TXT, SOLRCONFIG-CACHING.XML, SOLRCONFIG-PROPINJECT.XML, SCHEMA-CHARFILTERS.XML, SCHEMA-NUMERIC.XML, SOLRCONFIG-SLAVE.XML, BAD-SOLRCONFIG-MISSING-SCRIPTFILE.XML, BAD-SCHEMA-UNIQUEKEY-USES-DEFAULT.XML, SCHEMA-BM25.XML, BAD-SCHEMA-NONTEXT-ANALYZER.XML, BAD-SOLRCONFIG-INVALID-SCRIPTFILE.XML, SOLRCONFIG-ENABLEPLUGIN.XML, SCHEMA-NOT-REQUIRED-UNIQUE-KEY.XML, SOLRCONFIG-TLOG.XML, SOLRCONFIG-SIMPLELOCK.XML, BAD-SCHEMA-UNIQUEKEY-IS-COPYFIELD-DEST.XML, HUNSPELL-TEST.DIC, DA_COMPOUNDDICTIONARY.TXT, BAD-SCHEMA-NOT-INDEXED-BUT-NORMS.XML, KEEP-1.TXT, SCHEMA_CODEC.XML, SOLRCONFIG-SPELLCHECKER.XML, DA_UTF8.XML, TRIVIAL.UPDATEPROCESSOR0.JS, CONDITIONAL.UPDATEPROCESSOR.JS, SCHEMA-COLLATE.XML, SOLRCONFIG_CODEC.XML, THROW.ERROR.ON.ADD.UPDATEPROCESSOR.JS, STOP-SNOWBALL.TXT, MISSLEADING.EXTENSION.UPDATEPROCESSOR.JS.TXT, BAD-MP-SOLRCONFIG.XML, SOLRCONFIG-REPEATER.XML, SOLRCONFIG-HIGHLIGHT.XML, WDFTYPES.TXT, SOLRCONFIG-QUERYSENDER-NOQUERY.XML, BAD-SCHEMA-EXTERNAL-FILEFIELD.XML, FRENCHARTICLES.TXT, SCHEMA-LUCENEMATCHVERSION.XML, SOLRCONFIG-NATIVELOCK.XML]
[junit4:junit4]   2> 730 T2363 oass.SolrIndexSearcher.<init> Opening Searcher@9514da4 main
[junit4:junit4]   2> 730 T2363 oass.SolrIndexSearcher.getIndexDir WARNING WARNING: Directory impl does not support setting indexDir: org.apache.lucene.store.MockDirectoryWrapper
[junit4:junit4]   2> 731 T2363 oasu.CommitTracker.<init> Hard AutoCommit: disabled
[junit4:junit4]   2> 731 T2363 oasu.CommitTracker.<init> Soft AutoCommit: disabled
[junit4:junit4]   2> 731 T2363 oashc.QueryElevationComponent.inform Loading QueryElevation from: /mnt/ssd/jenkins/workspace/Lucene-Solr-trunk-Linux/checkout/solr/build/solr-core/test-files/solr/collection1/conf/elevate.xml
[junit4:junit4]   2> 736 T2363 oashc.QueryElevationComponent.inform Loading QueryElevation from: /mnt/ssd/jenkins/workspace/Lucene-Solr-trunk-Linux/checkout/solr/build/solr-core/test-files/solr/collection1/conf/elevate.xml
[junit4:junit4]   2> 742 T2363 oashc.HttpShardHandlerFactory.getParameter Setting socketTimeout to: 0
[junit4:junit4]   2> 742 T2363 oashc.HttpShardHandlerFactory.getParameter Setting urlScheme to: http://
[junit4:junit4]   2> 743 T2363 oashc.HttpShardHandlerFactory.getParameter Setting connTimeout to: 0
[junit4:junit4]   2> 743 T2363 oashc.HttpShardHandlerFactory.getParameter Setting maxConnectionsPerHost to: 20
[junit4:junit4]   2> 743 T2363 oashc.HttpShardHandlerFactory.getParameter Setting corePoolSize to: 0
[junit4:junit4]   2> 743 T2363 oashc.HttpShardHandlerFactory.getParameter Setting maximumPoolSize to: 2147483647
[junit4:junit4]   2> 743 T2363 oashc.HttpShardHandlerFactory.getParameter Setting maxThreadIdleTime to: 5
[junit4:junit4]   2> 744 T2363 oashc.HttpShardHandlerFactory.getParameter Setting sizeOfQueue to: -1
[junit4:junit4]   2> 744 T2363 oashc.HttpShardHandlerFactory.getParameter Setting fairnessPolicy to: false
[junit4:junit4]   2> 744 T2363 oascsi.HttpClientUtil.createClient Creating new http client, config:maxConnectionsPerHost=20&maxConnections=10000&socketTimeout=0&connTimeout=0&retry=false
[junit4:junit4]   2> 746 T2393 oasc.SolrCore.registerSearcher [collection1] Registered new searcher Searcher@9514da4 main{StandardDirectoryReader(segments_1:1)}
[junit4:junit4]   2> 746 T2363 oasc.CoreContainer.register registering core: collection1
[junit4:junit4]   2> 746 T2363 oass.SolrDispatchFilter.init user.dir=/mnt/ssd/jenkins/workspace/Lucene-Solr-trunk-Linux/checkout/solr/build/solr-core/test/J0
[junit4:junit4]   2> 747 T2363 oass.SolrDispatchFilter.init SolrDispatchFilter.init() done
[junit4:junit4]   2> 747 T2363 oascsi.HttpClientUtil.createClient Creating new http client, config:maxConnections=128&maxConnectionsPerHost=32&followRedirects=false
[junit4:junit4]   2> 748 T2363 oejs.Server.doStart jetty-8.1.2.v20120308
[junit4:junit4]   2> 750 T2363 oejs.AbstractConnector.doStart Started SocketConnector@0.0.0.0:33124
[junit4:junit4]   2> 750 T2363 oasc.SolrResourceLoader.locateSolrHome JNDI not configured for solr (NoInitialContextEx)
[junit4:junit4]   2> 750 T2363 oasc.SolrResourceLoader.locateSolrHome using system property solr.solr.home: /mnt/ssd/jenkins/workspace/Lucene-Solr-trunk-Linux/checkout/solr/build/solr-core/test-files/solr
[junit4:junit4]   2> 751 T2363 oasc.SolrResourceLoader.<init> new SolrResourceLoader for deduced Solr Home: '/mnt/ssd/jenkins/workspace/Lucene-Solr-trunk-Linux/checkout/solr/build/solr-core/test-files/solr/'
[junit4:junit4]   2> 758 T2363 oass.SolrDispatchFilter.init SolrDispatchFilter.init()
[junit4:junit4]   2> 758 T2363 oasc.SolrResourceLoader.locateSolrHome JNDI not configured for solr (NoInitialContextEx)
[junit4:junit4]   2> 758 T2363 oasc.SolrResourceLoader.locateSolrHome using system property solr.solr.home: /mnt/ssd/jenkins/workspace/Lucene-Solr-trunk-Linux/checkout/solr/build/solr-core/test-files/solr
[junit4:junit4]   2> 758 T2363 oasc.CoreContainer$Initializer.initialize looking for solr.xml: /mnt/ssd/jenkins/workspace/Lucene-Solr-trunk-Linux/checkout/solr/build/solr-core/test-files/solr/solr.xml
[junit4:junit4]   2> 759 T2363 oasc.CoreContainer.<init> New CoreContainer 812379784
[junit4:junit4]   2> 759 T2363 oasc.CoreContainer.load Loading CoreContainer using Solr Home: '/mnt/ssd/jenkins/workspace/Lucene-Solr-trunk-Linux/checkout/solr/build/solr-core/test-files/solr/'
[junit4:junit4]   2> 759 T2363 oasc.SolrResourceLoader.<init> new SolrResourceLoader for directory: '/mnt/ssd/jenkins/workspace/Lucene-Solr-trunk-Linux/checkout/solr/build/solr-core/test-files/solr/'
[junit4:junit4]   2> 768 T2363 oasc.CoreContainer.load Registering Log Listener
[junit4:junit4]   2> 777 T2363 oasc.CoreContainer.create Creating SolrCore 'collection1' using instanceDir: /mnt/ssd/jenkins/workspace/Lucene-Solr-trunk-Linux/checkout/solr/build/solr-core/test-files/solr/collection1
[junit4:junit4]   2> 778 T2363 oasc.SolrResourceLoader.<init> new SolrResourceLoader for directory: '/mnt/ssd/jenkins/workspace/Lucene-Solr-trunk-Linux/checkout/solr/build/solr-core/test-files/solr/collection1/'
[junit4:junit4]   2> 778 T2363 oasc.SolrResourceLoader.replaceClassLoader Adding 'file:/mnt/ssd/jenkins/workspace/Lucene-Solr-trunk-Linux/checkout/solr/build/solr-core/test-files/solr/collection1/lib/README' to classloader
[junit4:junit4]   2> 778 T2363 oasc.SolrResourceLoader.replaceClassLoader Adding 'file:/mnt/ssd/jenkins/workspace/Lucene-Solr-trunk-Linux/checkout/solr/build/solr-core/test-files/solr/collection1/lib/classes/' to classloader
[junit4:junit4]   2> 800 T2363 oasc.SolrConfig.<init> Using Lucene MatchVersion: LUCENE_50
[junit4:junit4]   2> 828 T2363 oasc.SolrConfig.<init> Loaded SolrConfig: solrconfig-elevate.xml
[junit4:junit4]   2> 829 T2363 oass.IndexSchema.readSchema Reading Solr Schema
[junit4:junit4]   2> 831 T2363 oass.IndexSchema.readSchema Schema name=example
[junit4:junit4]   2> 937 T2363 oass.IndexSchema.readSchema default search field in schema is text
[junit4:junit4]   2> 939 T2363 oass.IndexSchema.readSchema unique key field: id
[junit4:junit4]   2> 941 T2363 oasc.SolrCore.<init> [collection1] Opening new SolrCore at /mnt/ssd/jenkins/workspace/Lucene-Solr-trunk-Linux/checkout/solr/build/solr-core/test-files/solr/collection1/, dataDir=./org.apache.solr.handler.component.DistributedQueryElevationComponentTest-1343610021314/shard2/data/
[junit4:junit4]   2> 942 T2363 oasc.JmxMonitoredMap.<init> JMX monitoring is enabled. Adding Solr mbeans to JMX Server: com.sun.jmx.mbeanserver.JmxMBeanServer@be6a413
[junit4:junit4]   2> 942 T2363 oasc.SolrCore.getNewIndexDir WARNING New index directory detected: old=null new=./org.apache.solr.handler.component.DistributedQueryElevationComponentTest-1343610021314/shard2/data/index/
[junit4:junit4]   2> 943 T2363 oasc.SolrCore.initIndex WARNING [collection1] Solr index directory './org.apache.solr.handler.component.DistributedQueryElevationComponentTest-1343610021314/shard2/data/index' doesn't exist. Creating new index...
[junit4:junit4]   2> 944 T2363 oasc.SolrDeletionPolicy.onCommit SolrDeletionPolicy.onCommit: commits:num=1
[junit4:junit4]   2> 		commit{dir=MockDirWrapper(NRTCachingDirectory(org.apache.lucene.store.RAMDirectory@6c25d136 lockFactory=org.apache.lucene.store.SingleInstanceLockFactory@5ccaf569; maxCacheMB=0.8896484375 maxMergeSizeMB=0.3359375)),segFN=segments_1,generation=1,filenames=[segments_1]
[junit4:junit4]   2> 945 T2363 oasc.SolrDeletionPolicy.updateCommits newest commit = 1
[junit4:junit4]   2> 946 T2363 oasc.RequestHandlers.initHandlersFromConfig created /update: solr.UpdateRequestHandler
[junit4:junit4]   2> 947 T2363 oasc.RequestHandlers.initHandlersFromConfig created /elevate: org.apache.solr.handler.component.SearchHandler
[junit4:junit4]   2> 947 T2363 oasc.RequestHandlers.initHandlersFromConfig created /dataElevate: org.apache.solr.handler.component.SearchHandler
[junit4:junit4]   2> 948 T2363 oashl.XMLLoader.init xsltCacheLifetimeSeconds=60
[junit4:junit4]   2> 948 T2363 oasc.RequestHandlers.initHandlersFromConfig WARNING no default request handler is registered (either '/select' or 'standard')
[junit4:junit4]   2> 949 T2363 oasc.SolrCore.initDeprecatedSupport WARNING solrconfig.xml uses deprecated <admin/gettableFiles>, Please update your config to use the ShowFileRequestHandler.
[junit4:junit4]   2> 950 T2363 oasc.SolrCore.initDeprecatedSupport WARNING adding ShowFileRequestHandler with hidden files: [HYPHENATION.DTD, SCHEMA-REPLICATION1.XML, ELEVATE.XML, SYNONYMS.TXT, SCHEMA12.XML, SCHEMA-SIM.XML, SCHEMA-BINARYFIELD.XML, SCHEMA11.XML, SCHEMA-REPLICATION2.XML, MISSING.FUNCTIONS.UPDATEPROCESSOR.JS, BAD-SCHEMA-DUP-DYNAMICFIELD.XML, SOLRCONFIG-MASTER2.XML, SOLRCONFIG_PERF.XML, SOLRCONFIG-BASIC.XML, OLD_SYNONYMS.TXT, SOLRCONFIG-XINCLUDE.XML, BAD-SCHEMA-CODEC-GLOBAL-VS-FT-MISMATCH.XML, SOLRCONFIG-ELEVATE.XML, SOLRCONFIG-PHRASESUGGEST.XML, CURRENCY.XML, BAD-SOLRCONFIG-BOGUS-SCRIPTENGINE-NAME.XML, SCHEMA-TFIDF.XML, SOLRCONFIG-REQHANDLER.INCL, SOLRCONFIG-TRANSFORMERS.XML, HUNSPELL-TEST.AFF, STOPWITHBOM.TXT, SOLRCONFIG-QUERYSENDER.XML, SCHEMA-TRIE.XML, SCHEMA-SPELLCHECKER.XML, BAD-SCHEMA-OMIT-TF-BUT-NOT-POS.XML, BAD-SCHEMA-DUP-FIELD.XML, SOLRCONFIG-PROPINJECT-INDEXDEFAULT.XML, STOP-2.TXT, SOLRCONFIG-SCRIPT-UPDATEPROCESSOR.XML, SOLRCONFIG-SOLCOREPROPERTIES.XML, SOLRCONFIG-MASTER.XML, BAD-SCHEMA-SIM-GLOBAL-VS-FT-MISMATCH.XML, SOLRCONFIG-UPDATE-PROCESSOR-CHAINS.XML, SOLRCONFIG-SLAVE1.XML, PHRASESUGGEST.TXT, SCHEMA-REVERSED.XML, SCHEMA-DFR.XML, SCHEMA-COPYFIELD-TEST.XML, OPEN-EXCHANGE-RATES.JSON, SOLRCONFIG-MERGEPOLICY.XML, SOLRCONFIG-MASTER1.XML, SCHEMA-REQUIRED-FIELDS.XML, BAD_SOLRCONFIG.XML, STOPWORDSWRONGENCODING.TXT, SCHEMA-PHRASESUGGEST.XML, SOLRCONFIG-NOCACHE.XML, COMPOUNDDICTIONARY.TXT, SCHEMASURROUND.XML, STEMDICT.TXT, SCHEMA15.XML, SCHEMA-IB.XML, ADDFIELDS.UPDATEPROCESSOR.JS, SCHEMA-LMDIRICHLET.XML, SOLRCONFIG-DELPOLICY2.XML, SOLRCONFIG-FUNCTIONQUERY.XML, SCHEMA-FOLDING.XML, SOLRCONFIG-LAZYWRITER.XML, SOLRCONFIG-TERMINDEX.XML, SCHEMA-MINIMAL.XML, PROTWORDS.TXT, MAPPING-ISOLATIN1ACCENT.TXT, BAD-SCHEMA-NOT-INDEXED-BUT-POS.XML, SOLRCONFIG-MASTER1-KEEPONEBACKUP.XML, STOPWORDS.TXT, SCHEMA-STOP-KEEP.XML, SOLRCONFIG-MASTER3.XML, KEEP-2.TXT, STOPTYPES-1.TXT, XSLT, SCHEMA.XML, SOLRCONFIG-SPELLCHECKCOMPONENT.XML, BAD-SCHEMA-NOT-INDEXED-BUT-TF.XML, SCHEMA-LMJELINEKMERCER.XML, SOLRCONFIG-DELPOLICY1.XML, STOP-1.TXT, SOLRCONFIG-ALTDIRECTORY.XML, BAD-SCHEMA-DUP-FIELDTYPE.XML, TRIVIAL.UPDATEPROCESSOR1.JS, SOLRCONFIG-SOLR-749.XML, STOPTYPES-2.TXT, SOLRCONFIG-CACHING.XML, SOLRCONFIG-PROPINJECT.XML, SCHEMA-CHARFILTERS.XML, SCHEMA-NUMERIC.XML, SOLRCONFIG-SLAVE.XML, BAD-SOLRCONFIG-MISSING-SCRIPTFILE.XML, BAD-SCHEMA-UNIQUEKEY-USES-DEFAULT.XML, SCHEMA-BM25.XML, BAD-SCHEMA-NONTEXT-ANALYZER.XML, BAD-SOLRCONFIG-INVALID-SCRIPTFILE.XML, SOLRCONFIG-ENABLEPLUGIN.XML, SCHEMA-NOT-REQUIRED-UNIQUE-KEY.XML, SOLRCONFIG-TLOG.XML, SOLRCONFIG-SIMPLELOCK.XML, BAD-SCHEMA-UNIQUEKEY-IS-COPYFIELD-DEST.XML, HUNSPELL-TEST.DIC, DA_COMPOUNDDICTIONARY.TXT, BAD-SCHEMA-NOT-INDEXED-BUT-NORMS.XML, KEEP-1.TXT, SCHEMA_CODEC.XML, SOLRCONFIG-SPELLCHECKER.XML, DA_UTF8.XML, TRIVIAL.UPDATEPROCESSOR0.JS, CONDITIONAL.UPDATEPROCESSOR.JS, SCHEMA-COLLATE.XML, SOLRCONFIG_CODEC.XML, THROW.ERROR.ON.ADD.UPDATEPROCESSOR.JS, STOP-SNOWBALL.TXT, MISSLEADING.EXTENSION.UPDATEPROCESSOR.JS.TXT, BAD-MP-SOLRCONFIG.XML, SOLRCONFIG-REPEATER.XML, SOLRCONFIG-HIGHLIGHT.XML, WDFTYPES.TXT, SOLRCONFIG-QUERYSENDER-NOQUERY.XML, BAD-SCHEMA-EXTERNAL-FILEFIELD.XML, FRENCHARTICLES.TXT, SCHEMA-LUCENEMATCHVERSION.XML, SOLRCONFIG-NATIVELOCK.XML]
[junit4:junit4]   2> 952 T2363 oass.SolrIndexSearcher.<init> Opening Searcher@b498706 main
[junit4:junit4]   2> 952 T2363 oass.SolrIndexSearcher.getIndexDir WARNING WARNING: Directory impl does not support setting indexDir: org.apache.lucene.store.MockDirectoryWrapper
[junit4:junit4]   2> 953 T2363 oasu.CommitTracker.<init> Hard AutoCommit: disabled
[junit4:junit4]   2> 953 T2363 oasu.CommitTracker.<init> Soft AutoCommit: disabled
[junit4:junit4]   2> 953 T2363 oashc.QueryElevationComponent.inform Loading QueryElevation from: /mnt/ssd/jenkins/workspace/Lucene-Solr-trunk-Linux/checkout/solr/build/solr-core/test-files/solr/collection1/conf/elevate.xml
[junit4:junit4]   2> 960 T2363 oashc.QueryElevationComponent.inform Loading QueryElevation from: /mnt/ssd/jenkins/workspace/Lucene-Solr-trunk-Linux/checkout/solr/build/solr-core/test-files/solr/collection1/conf/elevate.xml
[junit4:junit4]   2> 967 T2363 oashc.HttpShardHandlerFactory.getParameter Setting socketTimeout to: 0
[junit4:junit4]   2> 967 T2363 oashc.HttpShardHandlerFactory.getParameter Setting urlScheme to: http://
[junit4:junit4]   2> 967 T2363 oashc.HttpShardHandlerFactory.getParameter Setting connTimeout to: 0
[junit4:junit4]   2> 968 T2363 oashc.HttpShardHandlerFactory.getParameter Setting maxConnectionsPerHost to: 20
[junit4:junit4]   2> 968 T2363 oashc.HttpShardHandlerFactory.getParameter Setting corePoolSize to: 0
[junit4:junit4]   2> 968 T2363 oashc.HttpShardHandlerFactory.getParameter Setting maximumPoolSize to: 2147483647
[junit4:junit4]   2> 968 T2363 oashc.HttpShardHandlerFactory.getParameter Setting maxThreadIdleTime to: 5
[junit4:junit4]   2> 969 T2363 oashc.HttpShardHandlerFactory.getParameter Setting sizeOfQueue to: -1
[junit4:junit4]   2> 969 T2363 oashc.HttpShardHandlerFactory.getParameter Setting fairnessPolicy to: false
[junit4:junit4]   2> 969 T2363 oascsi.HttpClientUtil.createClient Creating new http client, config:maxConnectionsPerHost=20&maxConnections=10000&socketTimeout=0&connTimeout=0&retry=false
[junit4:junit4]   2> 971 T2403 oasc.SolrCore.registerSearcher [collection1] Registered new searcher Searcher@b498706 main{StandardDirectoryReader(segments_1:1)}
[junit4:junit4]   2> 971 T2363 oasc.CoreContainer.register registering core: collection1
[junit4:junit4]   2> 972 T2363 oass.SolrDispatchFilter.init user.dir=/mnt/ssd/jenkins/workspace/Lucene-Solr-trunk-Linux/checkout/solr/build/solr-core/test/J0
[junit4:junit4]   2> 972 T2363 oass.SolrDispatchFilter.init SolrDispatchFilter.init() done
[junit4:junit4]   2> 972 T2363 oascsi.HttpClientUtil.createClient Creating new http client, config:maxConnections=128&maxConnectionsPerHost=32&followRedirects=false
[junit4:junit4]   2> ASYNC  NEW_CORE C146 name=collection1 org.apache.solr.core.SolrCore@7c277cb5
[junit4:junit4]   2> 978 T2366 C146 oasu.DirectUpdateHandler2.deleteAll [collection1] REMOVING ALL DOCUMENTS FROM INDEX
[junit4:junit4]   2> 979 T2366 C146 oasc.SolrDeletionPolicy.onInit SolrDeletionPolicy.onInit: commits:num=1
[junit4:junit4]   2> 		commit{dir=MockDirWrapper(org.apache.lucene.store.RAMDirectory@46c8ec1 lockFactory=org.apache.lucene.store.SingleInstanceLockFactory@28751711),segFN=segments_1,generation=1,filenames=[segments_1]
[junit4:junit4]   2> 980 T2366 C146 oasc.SolrDeletionPolicy.updateCommits newest commit = 1
[junit4:junit4]   2> 980 T2366 C146 UPDATE [collection1] webapp=/solr path=/update params={wt=javabin&version=2} {deleteByQuery=*:*} 0 3
[junit4:junit4]   2> ASYNC  NEW_CORE C147 name=collection1 org.apache.solr.core.SolrCore@38ce8944
[junit4:junit4]   2> 992 T2376 C147 oasu.DirectUpdateHandler2.deleteAll [collection1] REMOVING ALL DOCUMENTS FROM INDEX
[junit4:junit4]   2> 994 T2376 C147 oasc.SolrDeletionPolicy.onInit SolrDeletionPolicy.onInit: commits:num=1
[junit4:junit4]   2> 		commit{dir=MockDirWrapper(org.apache.lucene.store.RAMDirectory@7f95ec7e lockFactory=org.apache.lucene.store.SingleInstanceLockFactory@35d47595),segFN=segments_1,generation=1,filenames=[segments_1]
[junit4:junit4]   2> 994 T2376 C147 oasc.SolrDeletionPolicy.updateCommits newest commit = 1
[junit4:junit4]   2> 995 T2376 C147 UPDATE [collection1] webapp=/solr path=/update params={wt=javabin&version=2} {deleteByQuery=*:*} 0 4
[junit4:junit4]   2> ASYNC  NEW_CORE C148 name=collection1 org.apache.solr.core.SolrCore@18644fb1
[junit4:junit4]   2> 998 T2386 C148 oasu.DirectUpdateHandler2.deleteAll [collection1] REMOVING ALL DOCUMENTS FROM INDEX
[junit4:junit4]   2> 999 T2386 C148 oasc.SolrDeletionPolicy.onInit SolrDeletionPolicy.onInit: commits:num=1
[junit4:junit4]   2> 		commit{dir=MockDirWrapper(org.apache.lucene.store.RAMDirectory@61abf9f9 lockFactory=org.apache.lucene.store.SingleInstanceLockFactory@7c87b527),segFN=segments_1,generation=1,filenames=[segments_1]
[junit4:junit4]   2> 1000 T2386 C148 oasc.SolrDeletionPolicy.updateCommits newest commit = 1
[junit4:junit4]   2> 1000 T2386 C148 UPDATE [collection1] webapp=/solr path=/update params={wt=javabin&version=2} {deleteByQuery=*:*} 0 2
[junit4:junit4]   2> ASYNC  NEW_CORE C149 name=collection1 org.apache.solr.core.SolrCore@526af5a7
[junit4:junit4]   2> 1003 T2396 C149 oasu.DirectUpdateHandler2.deleteAll [collection1] REMOVING ALL DOCUMENTS FROM INDEX
[junit4:junit4]   2> 1006 T2396 C149 oasc.SolrDeletionPolicy.onInit SolrDeletionPolicy.onInit: commits:num=1
[junit4:junit4]   2> 		commit{dir=MockDirWrapper(NRTCachingDirectory(org.apache.lucene.store.RAMDirectory@6c25d136 lockFactory=org.apache.lucene.store.SingleInstanceLockFactory@5ccaf569; maxCacheMB=0.8896484375 maxMergeSizeMB=0.3359375)),segFN=segments_1,generation=1,filenames=[segments_1]
[junit4:junit4]   2> 1006 T2396 C149 oasc.SolrDeletionPolicy.updateCommits newest commit = 1
[junit4:junit4]   2> 1007 T2396 C149 UPDATE [collection1] webapp=/solr path=/update params={wt=javabin&version=2} {deleteByQuery=*:*} 0 4
[junit4:junit4]   2> 1010 T2366 C146 UPDATE [collection1] webapp=/solr path=/update params={wt=javabin&version=2} {add=[1]} 0 1
[junit4:junit4]   2> 1012 T2376 C147 UPDATE [collection1] webapp=/solr path=/update params={wt=javabin&version=2} {add=[1]} 0 1
[junit4:junit4]   2> 1014 T2366 C146 UPDATE [collection1] webapp=/solr path=/update params={wt=javabin&version=2} {add=[2]} 0 0
[junit4:junit4]   2> 1016 T2386 C148 UPDATE [collection1] webapp=/solr path=/update params={wt=javabin&version=2} {add=[2]} 0 0
[junit4:junit4]   2> 1018 T2366 C146 UPDATE [collection1] webapp=/solr path=/update params={wt=javabin&version=2} {add=[3]} 0 0
[junit4:junit4]   2> 1020 T2396 C149 UPDATE [collection1] webapp=/solr path=/update params={wt=javabin&version=2} {add=[3]} 0 1
[junit4:junit4]   2> 1021 T2366 C146 UPDATE [collection1] webapp=/solr path=/update params={wt=javabin&version=2} {add=[4]} 0 0
[junit4:junit4]   2> 1023 T2376 C147 UPDATE [collection1] webapp=/solr path=/update params={wt=javabin&version=2} {add=[4]} 0 0
[junit4:junit4]   2> 1025 T2366 C146 UPDATE [collection1] webapp=/solr path=/update params={wt=javabin&version=2} {add=[5]} 0 0
[junit4:junit4]   2> 1026 T2386 C148 UPDATE [collection1] webapp=/solr path=/update params={wt=javabin&version=2} {add=[5]} 0 0
[junit4:junit4]   2> 1028 T2366 C146 UPDATE [collection1] webapp=/solr path=/update params={wt=javabin&version=2} {add=[6]} 0 0
[junit4:junit4]   2> 1030 T2396 C149 UPDATE [collection1] webapp=/solr path=/update params={wt=javabin&version=2} {add=[6]} 0 0
[junit4:junit4]   2> 1032 T2366 C146 UPDATE [collection1] webapp=/solr path=/update params={wt=javabin&version=2} {add=[7]} 0 1
[junit4:junit4]   2> 1035 T2396 C149 UPDATE [collection1] webapp=/solr path=/update params={wt=javabin&version=2} {add=[7]} 0 2
[junit4:junit4]   2> 1037 T2366 C146 oasu.DirectUpdateHandler2.commit start commit{flags=0,_version_=0,optimize=false,openSearcher=true,waitSearcher=true,expungeDeletes=false,softCommit=false}
[junit4:junit4]   2> 1038 T2366 C146 oasc.SolrDeletionPolicy.onCommit SolrDeletionPolicy.onCommit: commits:num=2
[junit4:junit4]   2> 		commit{dir=MockDirWrapper(org.apache.lucene.store.RAMDirectory@46c8ec1 lockFactory=org.apache.lucene.store.SingleInstanceLockFactory@28751711),segFN=segments_1,generation=1,filenames=[segments_1]
[junit4:junit4]   2> 		commit{dir=MockDirWrapper(org.apache.lucene.store.RAMDirectory@46c8ec1 lockFactory=org.apache.lucene.store.SingleInstanceLockFactory@28751711),segFN=segments_2,generation=2,filenames=[_0.fnm, _0_Lucene40_0.tim, _0.si, _0_nrm.cfs, _0_Lucene40_0.frq, _0.fdt, _0_Lucene40_0.tip, _0_Pulsing40_0.frq, _0_Pulsing40_0.tip, _0.fdx, _0_nrm.cfe, _0_Pulsing40_0.tim, _0_Lucene40_0.prx, _0_Pulsing40_0.prx, segments_2]
[junit4:junit4]   2> 1039 T2366 C146 oasc.SolrDeletionPolicy.updateCommits newest commit = 2
[junit4:junit4]   2> 1039 T2366 C146 oass.SolrIndexSearcher.<init> Opening Searcher@2bdab87a main
[junit4:junit4]   2> 1040 T2366 C146 oass.SolrIndexSearcher.getIndexDir WARNING WARNING: Directory impl does not support setting indexDir: org.apache.lucene.store.MockDirectoryWrapper
[junit4:junit4]   2> 1040 T2366 C146 oasu.DirectUpdateHandler2.commit end_commit_flush
[junit4:junit4]   2> 1040 T2373 oasc.SolrCore.registerSearcher [collection1] Registered new searcher Searcher@2bdab87a main{StandardDirectoryReader(segments_2:4 _0(5.0):C7)}
[junit4:junit4]   2> 1041 T2366 C146 UPDATE [collection1] webapp=/solr path=/update params={wt=javabin&version=2&commit=true&waitSearcher=true&softCommit=false} {commit=} 0 4
[junit4:junit4]   2> 1043 T2376 C147 oasu.DirectUpdateHandler2.commit start commit{flags=0,_version_=0,optimize=false,openSearcher=true,waitSearcher=true,expungeDeletes=false,softCommit=false}
[junit4:junit4]   2> 1044 T2376 C147 oasc.SolrDeletionPolicy.onCommit SolrDeletionPolicy.onCommit: commits:num=2
[junit4:junit4]   2> 		commit{dir=MockDirWrapper(org.apache.lucene.store.RAMDirectory@7f95ec7e lockFactory=org.apache.lucene.store.SingleInstanceLockFactory@35d47595),segFN=segments_1,generation=1,filenames=[segments_1]
[junit4:junit4]   2> 		commit{dir=MockDirWrapper(org.apache.lucene.store.RAMDirectory@7f95ec7e lockFactory=org.apache.lucene.store.SingleInstanceLockFactory@35d47595),segFN=segments_2,generation=2,filenames=[_0.fnm, _0_Lucene40_0.tim, _0.si, _0_nrm.cfs, _0_Lucene40_0.frq, _0.fdt, _0_Lucene40_0.tip, _0_Pulsing40_0.frq, _0_Pulsing40_0.tip, _0.fdx, _0_nrm.cfe, _0_Pulsing40_0.tim, _0_Lucene40_0.prx, _0_Pulsing40_0.prx, segments_2]
[junit4:junit4]   2> 1044 T2376 C147 oasc.SolrDeletionPolicy.updateCommits newest commit = 2
[junit4:junit4]   2> 1045 T2376 C147 oass.SolrIndexSearcher.<init> Opening Searcher@44f6577 main
[junit4:junit4]   2> 1045 T2376 C147 oass.SolrIndexSearcher.getIndexDir WARNING WARNING: Directory impl does not support setting indexDir: org.apache.lucene.store.MockDirectoryWrapper
[junit4:junit4]   2> 1046 T2376 C147 oasu.DirectUpdateHandler2.commit end_commit_flush
[junit4:junit4]   2> 1046 T2383 oasc.SolrCore.registerSearcher [collection1] Registered new searcher Searcher@44f6577 main{StandardDirectoryReader(segments_2:4 _0(5.0):C2)}
[junit4:junit4]   2> 1047 T2376 C147 UPDATE [collection1] webapp=/solr path=/update params={wt=javabin&version=2&commit=true&waitSearcher=true&softCommit=false} {commit=} 0 4
[junit4:junit4]   2> 1048 T2386 C148 oasu.DirectUpdateHandler2.commit start commit{flags=0,_version_=0,optimize=false,openSearcher=true,waitSearcher=true,expungeDeletes=false,softCommit=false}
[junit4:junit4]   2> 1049 T2386 C148 oasc.SolrDeletionPolicy.onCommit SolrDeletionPolicy.onCommit: commits:num=2
[junit4:junit4]   2> 		commit{dir=MockDirWrapper(org.apache.lucene.store.RAMDirectory@61abf9f9 lockFactory=org.apache.lucene.store.SingleInstanceLockFactory@7c87b527),segFN=segments_1,generation=1,filenames=[segments_1]
[junit4:junit4]   2> 		commit{dir=MockDirWrapper(org.apache.lucene.store.RAMDirectory@61abf9f9 lockFactory=org.apache.lucene.store.SingleInstanceLockFactory@7c87b527),segFN=segments_2,generation=2,filenames=[_0.fnm, _0_Lucene40_0.tim, _0.si, _0_nrm.cfs, _0_Lucene40_0.frq, _0.fdt, _0_Pulsing40_0.frq, _0_Pulsing40_0.tip, _0_Lucene40_0.tip, _0.fdx, _0_nrm.cfe, _0_Pulsing40_0.tim, _0_Lucene40_0.prx, _0_Pulsing40_0.prx, segments_2]
[junit4:junit4]   2> 1050 T2386 C148 oasc.SolrDeletionPolicy.updateCommits newest commit = 2
[junit4:junit4]   2> 1050 T2386 C148 oass.SolrIndexSearcher.<init> Opening Searcher@6f4538a1 main
[junit4:junit4]   2> 1051 T2386 C148 oass.SolrIndexSearcher.getIndexDir WARNING WARNING: Directory impl does not support setting indexDir: org.apache.lucene.store.MockDirectoryWrapper
[junit4:junit4]   2> 1051 T2386 C148 oasu.DirectUpdateHandler2.commit end_commit_flush
[junit4:junit4]   2> 1051 T2393 oasc.SolrCore.registerSearcher [collection1] Registered new searcher Searcher@6f4538a1 main{StandardDirectoryReader(segments_2:4 _0(5.0):C2)}
[junit4:junit4]   2> 1052 T2386 C148 UPDATE [collection1] webapp=/solr path=/update params={wt=javabin&version=2&commit=true&waitSearcher=true&softCommit=false} {commit=} 0 4
[junit4:junit4]   2> 1053 T2396 C149 oasu.DirectUpdateHandler2.commit start commit{flags=0,_version_=0,optimize=false,openSearcher=true,waitSearcher=true,expungeDeletes=false,softCommit=false}
[junit4:junit4]   2> 1054 T2396 C149 oasc.SolrDeletionPolicy.onCommit SolrDeletionPolicy.onCommit: commits:num=2
[junit4:junit4]   2> 		commit{dir=MockDirWrapper(NRTCachingDirectory(org.apache.lucene.store.RAMDirectory@6c25d136 lockFactory=org.apache.lucene.store.SingleInstanceLockFactory@5ccaf569; maxCacheMB=0.8896484375 maxMergeSizeMB=0.3359375)),segFN=segments_1,generation=1,filenames=[segments_1]
[junit4:junit4]   2> 		commit{dir=MockDirWrapper(NRTCachingDirectory(org.apache.lucene.store.RAMDirectory@6c25d136 lockFactory=org.apache.lucene.store.SingleInstanceLockFactory@5ccaf569; maxCacheMB=0.8896484375 maxMergeSizeMB=0.3359375)),segFN=segments_2,generation=2,filenames=[_0.fnm, _0_Lucene40_0.tim, _0.si, _0_nrm.cfs, _0_Lucene40_0.frq, _0.fdt, _0_Pulsing40_0.frq, _0_Pulsing40_0.tip, _0_Lucene40_0.tip, _0.fdx, _0_nrm.cfe, _0_Pulsing40_0.tim, _0_Lucene40_0.prx, _0_Pulsing40_0.prx, segments_2]
[junit4:junit4]   2> 1055 T2396 C149 oasc.SolrDeletionPolicy.updateCommits newest commit = 2
[junit4:junit4]   2> 1055 T2396 C149 oass.SolrIndexSearcher.<init> Opening Searcher@42df75ba main
[junit4:junit4]   2> 1056 T2396 C149 oass.SolrIndexSearcher.getIndexDir WARNING WARNING: Directory impl does not support setting indexDir: org.apache.lucene.store.MockDirectoryWrapper
[junit4:junit4]   2> 1056 T2396 C149 oasu.DirectUpdateHandler2.commit end_commit_flush
[junit4:junit4]   2> 1056 T2403 oasc.SolrCore.registerSearcher [collection1] Registered new searcher Searcher@42df75ba main{StandardDirectoryReader(segments_2:4 _0(5.0):C3)}
[junit4:junit4]   2> 1057 T2396 C149 UPDATE [collection1] webapp=/solr path=/update params={wt=javabin&version=2&commit=true&waitSearcher=true&softCommit=false} {commit=} 0 4
[junit4:junit4]   2> 1060 T2366 C146 REQ [collection1] webapp=/solr path=/elevate params={shards.qt=/elevate&wt=javabin&qt=/elevate&fl=id,+score,+[elevated]&q=*:*&rows=500&sort=id+desc&distrib=false&version=2} hits=7 status=0 QTime=2 
[junit4:junit4]   2> 1070 T2397 C149 REQ [collection1] webapp=/solr path=/elevate params={shards.qt=/elevate&wt=javabin&qt=/elevate&shard.url=localhost:33124/solr&distrib=false&version=2&fsv=true&NOW=1343610022373&start=0&fl=id,score&isShard=true&q=*:*&sort=id+desc&rows=500} hits=3 status=0 QTime=1 
[junit4:junit4]   2> 1071 T2377 C147 REQ [collection1] webapp=/solr path=/elevate params={shards.qt=/elevate&wt=javabin&qt=/elevate&shard.url=localhost:53866/solr|[::1]:33332/solr&distrib=false&version=2&fsv=true&NOW=1343610022373&start=0&fl=id,score&isShard=true&q=*:*&sort=id+desc&rows=500} hits=2 status=0 QTime=0 
[junit4:junit4]   2> 1071 T2387 C148 REQ [collection1] webapp=/solr path=/elevate params={shards.qt=/elevate&wt=javabin&qt=/elevate&shard.url=localhost:37544/solr|[::1]:33332/solr&distrib=false&version=2&fsv=true&NOW=1343610022373&start=0&fl=id,score&isShard=true&q=*:*&sort=id+desc&rows=500} hits=2 status=0 QTime=1 
[junit4:junit4]   2> 1075 T2387 C148 REQ [collection1] webapp=/solr path=/elevate params={shards.qt=/elevate&wt=javabin&qt=/elevate&distrib=false&shard.url=localhost:37544/solr|[::1]:33332/solr&version=2&NOW=1343610022373&fl=id,+score,+[elevated]&ids=2.0,5.0&q=*:*&isShard=true&rows=500} status=0 QTime=1 
[junit4:junit4]   2> 1075 T2377 C147 REQ [collection1] webapp=/solr path=/elevate params={shards.qt=/elevate&wt=javabin&qt=/elevate&distrib=false&shard.url=localhost:53866/solr|[::1]:33332/solr&version=2&NOW=1343610022373&fl=id,+score,+[elevated]&ids=1.0,4.0&q=*:*&isShard=true&rows=500} status=0 QTime=1 
[junit4:junit4]   2> 1075 T2397 C149 REQ [collection1] webapp=/solr path=/elevate params={shards.qt=/elevate&wt=javabin&qt=/elevate&distrib=false&shard.url=localhost:33124/solr&version=2&NOW=1343610022373&fl=id,+score,+[elevated]&ids=6.0,7.0,3.0&q=*:*&isShard=true&rows=500} status=0 QTime=0 
[junit4:junit4]   2> 1076 T2376 C147 REQ [collection1] webapp=/solr path=/elevate params={shards.qt=/elevate&wt=javabin&qt=/elevate&fl=id,+score,+[elevated]&q=*:*&rows=500&sort=id+desc&version=2&shards=localhost:53866/solr|[::1]:33332/solr,localhost:37544/solr|[::1]:33332/solr,localhost:33124/solr} status=0 QTime=15 
[junit4:junit4]   2> 1077 T2363 oas.BaseDistributedSearchTestCase.compareResponses SEVERE Mismatched responses:
[junit4:junit4]   2> 	{responseHeader={status=0,QTime=15,params={shards.qt=/elevate,wt=javabin,qt=/elevate,fl=id, score, [elevated],q=*:*,rows=500,sort=id desc,version=2,shards=localhost:53866/solr|[::1]:33332/solr,localhost:37544/solr|[::1]:33332/solr,localhost:33124/solr}},response={numFound=7,start=0,maxScore=1.0,docs=[SolrDocument{id=7.0, [elevated]=false, score=1.0}, SolrDocument{id=6.0, [elevated]=false, score=1.0}, SolrDocument{id=5.0, [elevated]=false, score=1.0}, SolrDocument{id=4.0, [elevated]=false, score=1.0}, SolrDocument{id=3.0, [elevated]=false, score=1.0}, SolrDocument{id=2.0, [elevated]=false, score=1.0}, SolrDocument{id=1.0, [elevated]=false, score=1.0}]}}
[junit4:junit4]   2> 	{responseHeader={status=0,QTime=2,params={shards.qt=/elevate,wt=javabin,qt=/elevate,fl=id, score, [elevated],q=*:*,rows=500,sort=id desc,distrib=false,version=2}},response={numFound=7,start=0,maxScore=1.0,docs=[SolrDocument{id=7.0, score=1.0, [elevated]=false}, SolrDocument{id=6.0, score=1.0, [elevated]=false}, SolrDocument{id=5.0, score=1.0, [elevated]=false}, SolrDocument{id=4.0, score=1.0, [elevated]=false}, SolrDocument{id=3.0, score=1.0, [elevated]=false}, SolrDocument{id=2.0, score=1.0, [elevated]=false}, SolrDocument{id=1.0, score=1.0, [elevated]=false}]}}
[junit4:junit4]   2> 1078 T2363 oasc.CoreContainer.shutdown Shutting down CoreContainer instance=1658273943
[junit4:junit4]   2> 1079 T2363 oasc.SolrCore.close [collection1]  CLOSING SolrCore org.apache.solr.core.SolrCore@7c277cb5
[junit4:junit4]   2> 1080 T2363 oasc.SolrCore.closeSearcher [collection1] Closing main searcher on request.
[junit4:junit4]   2> 1080 T2363 oasu.DirectUpdateHandler2.close closing DirectUpdateHandler2{commits=1,autocommits=0,soft autocommits=0,optimizes=0,rollbacks=0,expungeDeletes=0,docsPending=0,adds=0,deletesById=0,deletesByQuery=0,errors=0,cumulative_adds=7,cumulative_deletesById=0,cumulative_deletesByQuery=1,cumulative_errors=0}
[junit4:junit4]   2> 1083 T2363 oejsh.ContextHandler.doStop stopped o.e.j.s.ServletContextHandler{/solr,null}
[junit4:junit4]   2> 1135 T2363 oasc.CoreContainer.shutdown Shutting down CoreContainer instance=1623836576
[junit4:junit4]   2> 1136 T2363 oasc.SolrCore.close [collection1]  CLOSING SolrCore org.apache.solr.core.SolrCore@38ce8944
[junit4:junit4]   2> 1136 T2363 oasc.SolrCore.closeSearcher [collection1] Closing main searcher on request.
[junit4:junit4]   2> 1137 T2363 oasu.DirectUpdateHandler2.close closing DirectUpdateHandler2{commits=1,autocommits=0,soft autocommits=0,optimizes=0,rollbacks=0,expungeDeletes=0,docsPending=0,adds=0,deletesById=0,deletesByQuery=0,errors=0,cumulative_adds=2,cumulative_deletesById=0,cumulative_deletesByQuery=1,cumulative_errors=0}
[junit4:junit4]   2> 1140 T2363 oejsh.ContextHandler.doStop stopped o.e.j.s.ServletContextHandler{/solr,null}
[junit4:junit4]   2> 1191 T2363 oasc.CoreContainer.shutdown Shutting down CoreContainer instance=778840177
[junit4:junit4]   2> 1192 T2363 oasc.SolrCore.close [collection1]  CLOSING SolrCore org.apache.solr.core.SolrCore@18644fb1
[junit4:junit4]   2> 1192 T2363 oasc.SolrCore.closeSearcher [collection1] Closing main searcher on request.
[junit4:junit4]   2> 1193 T2363 oasu.DirectUpdateHandler2.close closing DirectUpdateHandler2{commits=1,autocommits=0,soft autocommits=0,optimizes=0,rollbacks=0,expungeDeletes=0,docsPending=0,adds=0,deletesById=0,deletesByQuery=0,errors=0,cumulative_adds=2,cumulative_deletesById=0,cumulative_deletesByQuery=1,cumulative_errors=0}
[junit4:junit4]   2> 1195 T2363 oejsh.ContextHandler.doStop stopped o.e.j.s.ServletContextHandler{/solr,null}
[junit4:junit4]   2> 1247 T2363 oasc.CoreContainer.shutdown Shutting down CoreContainer instance=812379784
[junit4:junit4]   2> 1248 T2363 oasc.SolrCore.close [collection1]  CLOSING SolrCore org.apache.solr.core.SolrCore@526af5a7
[junit4:junit4]   2> 1249 T2363 oasc.SolrCore.closeSearcher [collection1] Closing main searcher on request.
[junit4:junit4]   2> 1250 T2363 oasu.DirectUpdateHandler2.close closing DirectUpdateHandler2{commits=1,autocommits=0,soft autocommits=0,optimizes=0,rollbacks=0,expungeDeletes=0,docsPending=0,adds=0,deletesById=0,deletesByQuery=0,errors=0,cumulative_adds=3,cumulative_deletesById=0,cumulative_deletesByQuery=1,cumulative_errors=0}
[junit4:junit4]   2> 1253 T2363 oejsh.ContextHandler.doStop stopped o.e.j.s.ServletContextHandler{/solr,null}
[junit4:junit4]   2> 1305 T2363 oas.SolrTestCaseJ4.tearDown ###Ending testDistribSearch
[junit4:junit4]   2> NOTE: reproduce with: ant test  -Dtestcase=DistributedQueryElevationComponentTest -Dtests.method=testDistribSearch -Dtests.seed=1046BCD2048960C4 -Dtests.multiplier=3 -Dtests.slow=true -Dtests.locale=es_CR -Dtests.timezone=America/Barbados -Dtests.file.encoding=UTF-8
[junit4:junit4]   2>
[junit4:junit4]    > (@AfterClass output)
[junit4:junit4]   2> 1318 T2363 oas.SolrTestCaseJ4.deleteCore ###deleteCore
[junit4:junit4]   2> NOTE: test params are: codec=Lucene40: {int_i=Lucene40(minBlockSize=30 maxBlockSize=155), text=Lucene40(minBlockSize=30 maxBlockSize=155), field_t=Lucene40(minBlockSize=30 maxBlockSize=155), id=Pulsing40(freqCutoff=1 minBlockSize=30 maxBlockSize=155), plow_t=Pulsing40(freqCutoff=1 minBlockSize=30 maxBlockSize=155)}, sim=DefaultSimilarity, locale=es_CR, timezone=America/Barbados
[junit4:junit4]   2> NOTE: Linux 3.2.0-27-generic amd64/Oracle Corporation 1.8.0-ea (64-bit)/cpus=8,threads=1,free=132877272,total=525336576
[junit4:junit4]   2> NOTE: All tests run in this JVM: [TestValueSourceCache, LeaderElectionIntegrationTest, TestIndexSearcher, DistributedSpellCheckComponentTest, SolrRequestParserTest, TestRandomFaceting, BadComponentTest, DistanceFunctionTest, TestRecovery, SolrCoreCheckLockOnStartupTest, DefaultValueUpdateProcessorTest, CloudStateTest, DirectSolrConnectionTest, TestLMJelinekMercerSimilarityFactory, PluginInfoTest, TestSurroundQueryParser, TestStressRecovery, TestWordDelimiterFilterFactory, PeerSyncTest, FileBasedSpellCheckerTest, BinaryUpdateRequestHandlerTest, TestBadConfig, DirectSolrSpellCheckerTest, ResourceLoaderTest, TestSolrJ, TestDistributedGrouping, MoreLikeThisHandlerTest, TestQuerySenderNoQuery, TestNumberUtils, DateMathParserTest, JSONWriterTest, StatelessScriptUpdateProcessorFactoryTest, CacheHeaderTest, SuggesterFSTTest, SpellPossibilityIteratorTest, CSVRequestHandlerTest, NoCacheHeaderTest, NumericFieldsTest, CoreAdminHandlerTest, SpatialFilterTest, TestLFUCache, DOMUtilTest, LoggingHandlerTest, CopyFieldTest, SolrCoreTest, TestConfig, TestFastLRUCache, TestRangeQuery, IndexSchemaRuntimeFieldTest, TestJmxIntegration, AutoCommitTest, SOLR749Test, ZkCLITest, BasicDistributedZkTest, SpellCheckComponentTest, FullSolrCloudDistribCmdsTest, CloudStateUpdateTest, TestDistributedSearch, SoftAutoCommitTest, ZkSolrClientTest, StatsComponentTest, SimpleFacetsTest, TestGroupingSearch, TestCSVResponseWriter, DistributedQueryElevationComponentTest]
[junit4:junit4]   2> 
[junit4:junit4] Completed on J0 in 1.32s, 1 test, 1 failure <<< FAILURES!

[...truncated 237 lines...]
BUILD FAILED
/mnt/ssd/jenkins/workspace/Lucene-Solr-trunk-Linux/checkout/build.xml:29: The following error occurred while executing this line:
/mnt/ssd/jenkins/workspace/Lucene-Solr-trunk-Linux/checkout/solr/build.xml:144: The following error occurred while executing this line:
/mnt/ssd/jenkins/workspace/Lucene-Solr-trunk-Linux/checkout/lucene/module-build.xml:62: The following error occurred while executing this line:
/mnt/ssd/jenkins/workspace/Lucene-Solr-trunk-Linux/checkout/lucene/common-build.xml:1095: The following error occurred while executing this line:
/mnt/ssd/jenkins/workspace/Lucene-Solr-trunk-Linux/checkout/lucene/common-build.xml:790: There were test failures: 222 suites, 897 tests, 1 failure, 6 ignored (1 assumption)

Total time: 19 minutes 49 seconds
Build step 'Execute shell' marked build as failure
Archiving artifacts
Recording test results
Email was triggered for: Failure
Sending email for trigger: Failure



Mime
View raw message