lucene-dev mailing list archives

Site index · List index
Message view « Date » · « Thread »
Top « Date » · « Thread »
From Policeman Jenkins Server <jenk...@sd-datasolutions.de>
Subject [JENKINS] Lucene-Solr-4.x-Linux-Java6-64 - Build # 483 - Failure!
Date Sat, 14 Jul 2012 18:54:12 GMT
Build: http://jenkins.sd-datasolutions.de/job/Lucene-Solr-4.x-Linux-Java6-64/483/

1 tests failed.
REGRESSION:  org.apache.lucene.search.grouping.DistinctValuesCollectorTest.testRandom

Error Message:
testRandom(org.apache.lucene.search.grouping.DistinctValuesCollectorTest): Insane FieldCache
usage(s) found expected:<0> but was:<3>

Stack Trace:
java.lang.AssertionError: testRandom(org.apache.lucene.search.grouping.DistinctValuesCollectorTest):
Insane FieldCache usage(s) found expected:<0> but was:<3>
	at __randomizedtesting.SeedInfo.seed([780C20FAED215711:A4005F55C41E162]:0)
	at org.junit.Assert.fail(Assert.java:93)
	at org.junit.Assert.failNotEquals(Assert.java:647)
	at org.junit.Assert.assertEquals(Assert.java:128)
	at org.junit.Assert.assertEquals(Assert.java:472)
	at org.apache.lucene.util.LuceneTestCase.assertSaneFieldCaches(LuceneTestCase.java:516)
	at org.apache.lucene.util.TestRuleFieldCacheSanity$1.evaluate(TestRuleFieldCacheSanity.java:48)
	at org.apache.lucene.util.AbstractBeforeAfterRule$1.evaluate(AbstractBeforeAfterRule.java:45)
	at com.carrotsearch.randomizedtesting.rules.SystemPropertiesInvariantRule$1.evaluate(SystemPropertiesInvariantRule.java:55)
	at org.apache.lucene.util.TestRuleReportUncaughtExceptions$1.evaluate(TestRuleReportUncaughtExceptions.java:68)
	at org.apache.lucene.util.TestRuleThreadAndTestName$1.evaluate(TestRuleThreadAndTestName.java:48)
	at org.apache.lucene.util.TestRuleIgnoreAfterMaxFailures$1.evaluate(TestRuleIgnoreAfterMaxFailures.java:70)
	at org.apache.lucene.util.TestRuleMarkFailure$1.evaluate(TestRuleMarkFailure.java:48)
	at com.carrotsearch.randomizedtesting.RandomizedRunner.runSingleTest(RandomizedRunner.java:825)
	at com.carrotsearch.randomizedtesting.RandomizedRunner.access$700(RandomizedRunner.java:132)
	at com.carrotsearch.randomizedtesting.RandomizedRunner$3$1.run(RandomizedRunner.java:671)
	at com.carrotsearch.randomizedtesting.RandomizedRunner$3.evaluate(RandomizedRunner.java:697)
	at com.carrotsearch.randomizedtesting.RandomizedRunner$4.evaluate(RandomizedRunner.java:736)
	at com.carrotsearch.randomizedtesting.RandomizedRunner$5.evaluate(RandomizedRunner.java:747)
	at org.apache.lucene.util.AbstractBeforeAfterRule$1.evaluate(AbstractBeforeAfterRule.java:45)
	at org.apache.lucene.util.TestRuleReportUncaughtExceptions$1.evaluate(TestRuleReportUncaughtExceptions.java:68)
	at org.apache.lucene.util.TestRuleStoreClassName$1.evaluate(TestRuleStoreClassName.java:38)
	at org.apache.lucene.util.TestRuleIcuHack$1.evaluate(TestRuleIcuHack.java:51)
	at com.carrotsearch.randomizedtesting.rules.SystemPropertiesInvariantRule$1.evaluate(SystemPropertiesInvariantRule.java:55)
	at org.apache.lucene.util.TestRuleNoInstanceHooksOverrides$1.evaluate(TestRuleNoInstanceHooksOverrides.java:53)
	at org.apache.lucene.util.TestRuleNoStaticHooksShadowing$1.evaluate(TestRuleNoStaticHooksShadowing.java:52)
	at org.apache.lucene.util.TestRuleAssertionsRequired$1.evaluate(TestRuleAssertionsRequired.java:36)
	at org.apache.lucene.util.TestRuleMarkFailure$1.evaluate(TestRuleMarkFailure.java:48)
	at org.apache.lucene.util.TestRuleIgnoreAfterMaxFailures$1.evaluate(TestRuleIgnoreAfterMaxFailures.java:70)
	at org.apache.lucene.util.TestRuleIgnoreTestSuites$1.evaluate(TestRuleIgnoreTestSuites.java:55)
	at com.carrotsearch.randomizedtesting.RandomizedRunner.runSuite(RandomizedRunner.java:605)
	at com.carrotsearch.randomizedtesting.RandomizedRunner.access$400(RandomizedRunner.java:132)
	at com.carrotsearch.randomizedtesting.RandomizedRunner$2.run(RandomizedRunner.java:551)




Build Log:
[...truncated 13727 lines...]
[junit4:junit4] Suite: org.apache.lucene.search.grouping.DistinctValuesCollectorTest
[junit4:junit4] FAILURE 5.06s J0 | DistinctValuesCollectorTest.testRandom
[junit4:junit4]    > Throwable #1: java.lang.AssertionError: testRandom(org.apache.lucene.search.grouping.DistinctValuesCollectorTest):
Insane FieldCache usage(s) found expected:<0> but was:<3>
[junit4:junit4]    > 	at __randomizedtesting.SeedInfo.seed([780C20FAED215711:A4005F55C41E162]:0)
[junit4:junit4]    > 	at org.junit.Assert.fail(Assert.java:93)
[junit4:junit4]    > 	at org.junit.Assert.failNotEquals(Assert.java:647)
[junit4:junit4]    > 	at org.junit.Assert.assertEquals(Assert.java:128)
[junit4:junit4]    > 	at org.junit.Assert.assertEquals(Assert.java:472)
[junit4:junit4]    > 	at org.apache.lucene.util.LuceneTestCase.assertSaneFieldCaches(LuceneTestCase.java:516)
[junit4:junit4]    > 	at org.apache.lucene.util.TestRuleFieldCacheSanity$1.evaluate(TestRuleFieldCacheSanity.java:48)
[junit4:junit4]    > 	at org.apache.lucene.util.AbstractBeforeAfterRule$1.evaluate(AbstractBeforeAfterRule.java:45)
[junit4:junit4]    > 	at com.carrotsearch.randomizedtesting.rules.SystemPropertiesInvariantRule$1.evaluate(SystemPropertiesInvariantRule.java:55)
[junit4:junit4]    > 	at org.apache.lucene.util.TestRuleReportUncaughtExceptions$1.evaluate(TestRuleReportUncaughtExceptions.java:68)
[junit4:junit4]    > 	at org.apache.lucene.util.TestRuleThreadAndTestName$1.evaluate(TestRuleThreadAndTestName.java:48)
[junit4:junit4]    > 	at org.apache.lucene.util.TestRuleIgnoreAfterMaxFailures$1.evaluate(TestRuleIgnoreAfterMaxFailures.java:70)
[junit4:junit4]    > 	at org.apache.lucene.util.TestRuleMarkFailure$1.evaluate(TestRuleMarkFailure.java:48)
[junit4:junit4]    > 	at com.carrotsearch.randomizedtesting.RandomizedRunner.runSingleTest(RandomizedRunner.java:825)
[junit4:junit4]    > 	at com.carrotsearch.randomizedtesting.RandomizedRunner.access$700(RandomizedRunner.java:132)
[junit4:junit4]    > 	at com.carrotsearch.randomizedtesting.RandomizedRunner$3$1.run(RandomizedRunner.java:671)
[junit4:junit4]    > 	at com.carrotsearch.randomizedtesting.RandomizedRunner$3.evaluate(RandomizedRunner.java:697)
[junit4:junit4]    > 	at com.carrotsearch.randomizedtesting.RandomizedRunner$4.evaluate(RandomizedRunner.java:736)
[junit4:junit4]    > 	at com.carrotsearch.randomizedtesting.RandomizedRunner$5.evaluate(RandomizedRunner.java:747)
[junit4:junit4]    > 	at org.apache.lucene.util.AbstractBeforeAfterRule$1.evaluate(AbstractBeforeAfterRule.java:45)
[junit4:junit4]    > 	at org.apache.lucene.util.TestRuleReportUncaughtExceptions$1.evaluate(TestRuleReportUncaughtExceptions.java:68)
[junit4:junit4]    > 	at org.apache.lucene.util.TestRuleStoreClassName$1.evaluate(TestRuleStoreClassName.java:38)
[junit4:junit4]    > 	at org.apache.lucene.util.TestRuleIcuHack$1.evaluate(TestRuleIcuHack.java:51)
[junit4:junit4]    > 	at com.carrotsearch.randomizedtesting.rules.SystemPropertiesInvariantRule$1.evaluate(SystemPropertiesInvariantRule.java:55)
[junit4:junit4]    > 	at org.apache.lucene.util.TestRuleNoInstanceHooksOverrides$1.evaluate(TestRuleNoInstanceHooksOverrides.java:53)
[junit4:junit4]    > 	at org.apache.lucene.util.TestRuleNoStaticHooksShadowing$1.evaluate(TestRuleNoStaticHooksShadowing.java:52)
[junit4:junit4]    > 	at org.apache.lucene.util.TestRuleAssertionsRequired$1.evaluate(TestRuleAssertionsRequired.java:36)
[junit4:junit4]    > 	at org.apache.lucene.util.TestRuleMarkFailure$1.evaluate(TestRuleMarkFailure.java:48)
[junit4:junit4]    > 	at org.apache.lucene.util.TestRuleIgnoreAfterMaxFailures$1.evaluate(TestRuleIgnoreAfterMaxFailures.java:70)
[junit4:junit4]    > 	at org.apache.lucene.util.TestRuleIgnoreTestSuites$1.evaluate(TestRuleIgnoreTestSuites.java:55)
[junit4:junit4]    > 	at com.carrotsearch.randomizedtesting.RandomizedRunner.runSuite(RandomizedRunner.java:605)
[junit4:junit4]    > 	at com.carrotsearch.randomizedtesting.RandomizedRunner.access$400(RandomizedRunner.java:132)
[junit4:junit4]    > 	at com.carrotsearch.randomizedtesting.RandomizedRunner$2.run(RandomizedRunner.java:551)
[junit4:junit4]    > 
[junit4:junit4]   2> *** BEGIN testRandom(org.apache.lucene.search.grouping.DistinctValuesCollectorTest):
Insane FieldCache usage(s) ***
[junit4:junit4]   2> SUBREADER: Found caches for descendants of StandardDirectoryReader(segments_7:17:nrt
_0(4.0):C921 _1(4.0):c45 _2(4.0):C690 _3(4.0):c19 _4(4.0):C540 _5(4.0):C559 _6(4.0):c84 _7(4.0):c93)+publisher
[junit4:junit4]   2> 	'StandardDirectoryReader(segments_7:17:nrt _0(4.0):C921 _1(4.0):c45
_2(4.0):C690 _3(4.0):c19 _4(4.0):C540 _5(4.0):C559 _6(4.0):c84 _7(4.0):c93)'=>'publisher',class
org.apache.lucene.search.FieldCache$DocTermsIndex,0.5=>org.apache.lucene.search.FieldCacheImpl$DocTermsIndexImpl#999585351
(size =~ 14.1 KB)
[junit4:junit4]   2> 	'SegmentCoreReader(owner=_6(4.0):c84)'=>'publisher',class org.apache.lucene.search.FieldCache$DocTermsIndex,0.5=>org.apache.lucene.search.FieldCacheImpl$DocTermsIndexImpl#112793090
(size =~ 2.6 KB)
[junit4:junit4]   2> 	'SegmentCoreReader(owner=_5(4.0):C559)'=>'publisher',class org.apache.lucene.search.FieldCache$DocTermsIndex,0.5=>org.apache.lucene.search.FieldCacheImpl$DocTermsIndexImpl#1667681887
(size =~ 9.5 KB)
[junit4:junit4]   2> 	'SegmentCoreReader(owner=_4(4.0):C540)'=>'publisher',class org.apache.lucene.search.FieldCache$DocTermsIndex,0.5=>org.apache.lucene.search.FieldCacheImpl$DocTermsIndexImpl#977226273
(size =~ 9.3 KB)
[junit4:junit4]   2> 	'SegmentCoreReader(owner=_0(4.0):C921)'=>'publisher',class org.apache.lucene.search.FieldCache$DocTermsIndex,0.5=>org.apache.lucene.search.FieldCacheImpl$DocTermsIndexImpl#1815561404
(size =~ 11.4 KB)
[junit4:junit4]   2> 	'SegmentCoreReader(owner=_1(4.0):c45)'=>'publisher',class org.apache.lucene.search.FieldCache$DocTermsIndex,0.5=>org.apache.lucene.search.FieldCacheImpl$DocTermsIndexImpl#310826391
(size =~ 1.6 KB)
[junit4:junit4]   2> 	'SegmentCoreReader(owner=_7(4.0):c93)'=>'publisher',class org.apache.lucene.search.FieldCache$DocTermsIndex,0.5=>org.apache.lucene.search.FieldCacheImpl$DocTermsIndexImpl#27273278
(size =~ 3 KB)
[junit4:junit4]   2> 	'SegmentCoreReader(owner=_3(4.0):c19)'=>'publisher',class org.apache.lucene.search.FieldCache$DocTermsIndex,0.5=>org.apache.lucene.search.FieldCacheImpl$DocTermsIndexImpl#429620322
(size =~ 912 bytes)
[junit4:junit4]   2> 	'SegmentCoreReader(owner=_2(4.0):C690)'=>'publisher',class org.apache.lucene.search.FieldCache$DocTermsIndex,0.5=>org.apache.lucene.search.FieldCacheImpl$DocTermsIndexImpl#826510782
(size =~ 10.6 KB)
[junit4:junit4]   2> 
[junit4:junit4]   2> SUBREADER: Found caches for descendants of StandardDirectoryReader(segments_7:17:nrt
_0(4.0):C921 _1(4.0):c45 _2(4.0):C690 _3(4.0):c19 _4(4.0):C540 _5(4.0):C559 _6(4.0):c84 _7(4.0):c93)+id
[junit4:junit4]   2> 	'StandardDirectoryReader(segments_7:17:nrt _0(4.0):C921 _1(4.0):c45
_2(4.0):C690 _3(4.0):c19 _4(4.0):C540 _5(4.0):C559 _6(4.0):c84 _7(4.0):c93)'=>'id',class
org.apache.lucene.search.FieldCache$DocTermsIndex,0.5=>org.apache.lucene.search.FieldCacheImpl$DocTermsIndexImpl#1001196937
(size =~ 40.6 KB)
[junit4:junit4]   2> 	'SegmentCoreReader(owner=_4(4.0):C540)'=>'id',class org.apache.lucene.search.FieldCache$DocTermsIndex,0.5=>org.apache.lucene.search.FieldCacheImpl$DocTermsIndexImpl#2014356761
(size =~ 7.2 KB)
[junit4:junit4]   2> 	'SegmentCoreReader(owner=_0(4.0):C921)'=>'id',class org.apache.lucene.search.FieldCache$DocTermsIndex,0.5=>org.apache.lucene.search.FieldCacheImpl$DocTermsIndexImpl#671890500
(size =~ 12.2 KB)
[junit4:junit4]   2> 	'SegmentCoreReader(owner=_2(4.0):C690)'=>'id',class org.apache.lucene.search.FieldCache$DocTermsIndex,0.5=>org.apache.lucene.search.FieldCacheImpl$DocTermsIndexImpl#1283782245
(size =~ 9.2 KB)
[junit4:junit4]   2> 	'SegmentCoreReader(owner=_3(4.0):c19)'=>'id',class org.apache.lucene.search.FieldCache$DocTermsIndex,0.5=>org.apache.lucene.search.FieldCacheImpl$DocTermsIndexImpl#1986875184
(size =~ 440 bytes)
[junit4:junit4]   2> 	'SegmentCoreReader(owner=_5(4.0):C559)'=>'id',class org.apache.lucene.search.FieldCache$DocTermsIndex,0.5=>org.apache.lucene.search.FieldCacheImpl$DocTermsIndexImpl#1971216484
(size =~ 7.5 KB)
[junit4:junit4]   2> 	'SegmentCoreReader(owner=_1(4.0):c45)'=>'id',class org.apache.lucene.search.FieldCache$DocTermsIndex,0.5=>org.apache.lucene.search.FieldCacheImpl$DocTermsIndexImpl#527133143
(size =~ 768 bytes)
[junit4:junit4]   2> 	'SegmentCoreReader(owner=_6(4.0):c84)'=>'id',class org.apache.lucene.search.FieldCache$DocTermsIndex,0.5=>org.apache.lucene.search.FieldCacheImpl$DocTermsIndexImpl#1374830890
(size =~ 1.2 KB)
[junit4:junit4]   2> 	'SegmentCoreReader(owner=_7(4.0):c93)'=>'id',class org.apache.lucene.search.FieldCache$DocTermsIndex,0.5=>org.apache.lucene.search.FieldCacheImpl$DocTermsIndexImpl#1659215424
(size =~ 1.3 KB)
[junit4:junit4]   2> 
[junit4:junit4]   2> SUBREADER: Found caches for descendants of StandardDirectoryReader(segments_7:17:nrt
_0(4.0):C921 _1(4.0):c45 _2(4.0):C690 _3(4.0):c19 _4(4.0):C540 _5(4.0):C559 _6(4.0):c84 _7(4.0):c93)+author
[junit4:junit4]   2> 	'StandardDirectoryReader(segments_7:17:nrt _0(4.0):C921 _1(4.0):c45
_2(4.0):C690 _3(4.0):c19 _4(4.0):C540 _5(4.0):C559 _6(4.0):c84 _7(4.0):c93)'=>'author',class
org.apache.lucene.search.FieldCache$DocTermsIndex,0.5=>org.apache.lucene.search.FieldCacheImpl$DocTermsIndexImpl#1801148291
(size =~ 24.2 KB)
[junit4:junit4]   2> 	'SegmentCoreReader(owner=_5(4.0):C559)'=>'author',class org.apache.lucene.search.FieldCache$DocTermsIndex,0.5=>org.apache.lucene.search.FieldCacheImpl$DocTermsIndexImpl#1518450748
(size =~ 13 KB)
[junit4:junit4]   2> 	'SegmentCoreReader(owner=_0(4.0):C921)'=>'author',class org.apache.lucene.search.FieldCache$DocTermsIndex,0.5=>org.apache.lucene.search.FieldCacheImpl$DocTermsIndexImpl#1644466253
(size =~ 17.1 KB)
[junit4:junit4]   2> 	'SegmentCoreReader(owner=_7(4.0):c93)'=>'author',class org.apache.lucene.search.FieldCache$DocTermsIndex,0.5=>org.apache.lucene.search.FieldCacheImpl$DocTermsIndexImpl#230248946
(size =~ 2.9 KB)
[junit4:junit4]   2> 	'SegmentCoreReader(owner=_2(4.0):C690)'=>'author',class org.apache.lucene.search.FieldCache$DocTermsIndex,0.5=>org.apache.lucene.search.FieldCacheImpl$DocTermsIndexImpl#1944239527
(size =~ 14.6 KB)
[junit4:junit4]   2> 	'SegmentCoreReader(owner=_3(4.0):c19)'=>'author',class org.apache.lucene.search.FieldCache$DocTermsIndex,0.5=>org.apache.lucene.search.FieldCacheImpl$DocTermsIndexImpl#724040195
(size =~ 888 bytes)
[junit4:junit4]   2> 	'SegmentCoreReader(owner=_6(4.0):c84)'=>'author',class org.apache.lucene.search.FieldCache$DocTermsIndex,0.5=>org.apache.lucene.search.FieldCacheImpl$DocTermsIndexImpl#451295216
(size =~ 2.9 KB)
[junit4:junit4]   2> 	'SegmentCoreReader(owner=_4(4.0):C540)'=>'author',class org.apache.lucene.search.FieldCache$DocTermsIndex,0.5=>org.apache.lucene.search.FieldCacheImpl$DocTermsIndexImpl#1760892774
(size =~ 11.8 KB)
[junit4:junit4]   2> 	'SegmentCoreReader(owner=_1(4.0):c45)'=>'author',class org.apache.lucene.search.FieldCache$DocTermsIndex,0.5=>org.apache.lucene.search.FieldCacheImpl$DocTermsIndexImpl#939002086
(size =~ 1.8 KB)
[junit4:junit4]   2> 
[junit4:junit4]   2> *** END testRandom(org.apache.lucene.search.grouping.DistinctValuesCollectorTest):
Insane FieldCache usage(s) ***
[junit4:junit4]   2> NOTE: reproduce with: ant test  -Dtestcase=DistinctValuesCollectorTest
-Dtests.method=testRandom -Dtests.seed=780C20FAED215711 -Dtests.multiplier=3 -Dtests.slow=true
-Dtests.locale=es_US -Dtests.timezone=Asia/Jayapura -Dtests.file.encoding=US-ASCII
[junit4:junit4]   2>
[junit4:junit4]    > (@AfterClass output)
[junit4:junit4]   2> NOTE: test params are: codec=Lucene40: {id=Pulsing40(freqCutoff=6
minBlockSize=46 maxBlockSize=173), content=Pulsing40(freqCutoff=16 minBlockSize=46 maxBlockSize=173),
author=Pulsing40(freqCutoff=16 minBlockSize=46 maxBlockSize=173), publisher=PostingsFormat(name=Memory
doPackFST= true)}, sim=DefaultSimilarity, locale=es_US, timezone=Asia/Jayapura
[junit4:junit4]   2> NOTE: Linux 3.2.0-26-generic amd64/Sun Microsystems Inc. 1.6.0_33
(64-bit)/cpus=8,threads=1,free=147044552,total=154337280
[junit4:junit4]   2> NOTE: All tests run in this JVM: [DistinctValuesCollectorTest]
[junit4:junit4]   2> 
[junit4:junit4] Completed on J0 in 5.33s, 2 tests, 1 failure <<< FAILURES!

[...truncated 20 lines...]
BUILD FAILED
/mnt/ssd/jenkins/workspace/Lucene-Solr-4.x-Linux-Java6-64/checkout/build.xml:29: The following
error occurred while executing this line:
/mnt/ssd/jenkins/workspace/Lucene-Solr-4.x-Linux-Java6-64/checkout/lucene/build.xml:508: The
following error occurred while executing this line:
/mnt/ssd/jenkins/workspace/Lucene-Solr-4.x-Linux-Java6-64/checkout/lucene/common-build.xml:1495:
The following error occurred while executing this line:
/mnt/ssd/jenkins/workspace/Lucene-Solr-4.x-Linux-Java6-64/checkout/lucene/module-build.xml:62:
The following error occurred while executing this line:
/mnt/ssd/jenkins/workspace/Lucene-Solr-4.x-Linux-Java6-64/checkout/lucene/common-build.xml:1093:
The following error occurred while executing this line:
/mnt/ssd/jenkins/workspace/Lucene-Solr-4.x-Linux-Java6-64/checkout/lucene/common-build.xml:788:
There were test failures: 6 suites, 10 tests, 1 failure

Total time: 11 minutes 1 second
Build step 'Execute shell' marked build as failure
Archiving artifacts
Recording test results
Email was triggered for: Failure
Sending email for trigger: Failure




Mime
View raw message