lucene-dev mailing list archives

Site index · List index
Message view « Date » · « Thread »
Top « Date » · « Thread »
From Policeman Jenkins Server <jenk...@sd-datasolutions.de>
Subject [JENKINS] Lucene-Solr-trunk-Linux-Java7-64 - Build # 539 - Failure!
Date Tue, 10 Jul 2012 12:29:12 GMT
Build: http://jenkins.sd-datasolutions.de/job/Lucene-Solr-trunk-Linux-Java7-64/539/

1 tests failed.
REGRESSION:  org.apache.solr.client.solrj.embedded.MultiCoreExampleJettyTest.testDistributed

Error Message:
Server at http://localhost:55281/example/core0 returned non ok status:500, message:Server Error

Stack Trace:
org.apache.solr.common.SolrException: Server at http://localhost:55281/example/core0 returned non ok status:500, message:Server Error
	at __randomizedtesting.SeedInfo.seed([4B78A024F9DC07F9:244A17CC88645996]:0)
	at org.apache.solr.client.solrj.impl.HttpSolrServer.request(HttpSolrServer.java:376)
	at org.apache.solr.client.solrj.impl.HttpSolrServer.request(HttpSolrServer.java:182)
	at org.apache.solr.client.solrj.request.QueryRequest.process(QueryRequest.java:90)
	at org.apache.solr.client.solrj.embedded.MultiCoreExampleJettyTest.testDistributed(MultiCoreExampleJettyTest.java:147)
	at sun.reflect.NativeMethodAccessorImpl.invoke0(Native Method)
	at sun.reflect.NativeMethodAccessorImpl.invoke(NativeMethodAccessorImpl.java:57)
	at sun.reflect.DelegatingMethodAccessorImpl.invoke(DelegatingMethodAccessorImpl.java:43)
	at java.lang.reflect.Method.invoke(Method.java:601)
	at com.carrotsearch.randomizedtesting.RandomizedRunner.invoke(RandomizedRunner.java:1995)
	at com.carrotsearch.randomizedtesting.RandomizedRunner.access$1100(RandomizedRunner.java:132)
	at com.carrotsearch.randomizedtesting.RandomizedRunner$6.evaluate(RandomizedRunner.java:818)
	at com.carrotsearch.randomizedtesting.RandomizedRunner$7.evaluate(RandomizedRunner.java:877)
	at com.carrotsearch.randomizedtesting.RandomizedRunner$8.evaluate(RandomizedRunner.java:891)
	at com.carrotsearch.randomizedtesting.rules.SystemPropertiesRestoreRule$1.evaluate(SystemPropertiesRestoreRule.java:53)
	at org.apache.lucene.util.TestRuleSetupTeardownChained$1.evaluate(TestRuleSetupTeardownChained.java:50)
	at org.apache.lucene.util.TestRuleFieldCacheSanity$1.evaluate(TestRuleFieldCacheSanity.java:32)
	at org.apache.lucene.util.AbstractBeforeAfterRule$1.evaluate(AbstractBeforeAfterRule.java:45)
	at com.carrotsearch.randomizedtesting.rules.SystemPropertiesInvariantRule$1.evaluate(SystemPropertiesInvariantRule.java:55)
	at org.apache.lucene.util.TestRuleReportUncaughtExceptions$1.evaluate(TestRuleReportUncaughtExceptions.java:68)
	at org.apache.lucene.util.TestRuleThreadAndTestName$1.evaluate(TestRuleThreadAndTestName.java:48)
	at org.apache.lucene.util.TestRuleIgnoreAfterMaxFailures$1.evaluate(TestRuleIgnoreAfterMaxFailures.java:70)
	at org.apache.lucene.util.TestRuleMarkFailure$1.evaluate(TestRuleMarkFailure.java:48)
	at com.carrotsearch.randomizedtesting.RandomizedRunner.runSingleTest(RandomizedRunner.java:825)
	at com.carrotsearch.randomizedtesting.RandomizedRunner.access$700(RandomizedRunner.java:132)
	at com.carrotsearch.randomizedtesting.RandomizedRunner$3$1.run(RandomizedRunner.java:671)
	at com.carrotsearch.randomizedtesting.RandomizedRunner$3.evaluate(RandomizedRunner.java:697)
	at com.carrotsearch.randomizedtesting.RandomizedRunner$4.evaluate(RandomizedRunner.java:736)
	at com.carrotsearch.randomizedtesting.RandomizedRunner$5.evaluate(RandomizedRunner.java:747)
	at com.carrotsearch.randomizedtesting.rules.SystemPropertiesRestoreRule$1.evaluate(SystemPropertiesRestoreRule.java:53)
	at org.apache.lucene.util.AbstractBeforeAfterRule$1.evaluate(AbstractBeforeAfterRule.java:45)
	at org.apache.lucene.util.TestRuleReportUncaughtExceptions$1.evaluate(TestRuleReportUncaughtExceptions.java:68)
	at org.apache.lucene.util.TestRuleStoreClassName$1.evaluate(TestRuleStoreClassName.java:38)
	at org.apache.lucene.util.TestRuleIcuHack$1.evaluate(TestRuleIcuHack.java:51)
	at com.carrotsearch.randomizedtesting.rules.SystemPropertiesInvariantRule$1.evaluate(SystemPropertiesInvariantRule.java:55)
	at org.apache.lucene.util.TestRuleNoInstanceHooksOverrides$1.evaluate(TestRuleNoInstanceHooksOverrides.java:53)
	at org.apache.lucene.util.TestRuleNoStaticHooksShadowing$1.evaluate(TestRuleNoStaticHooksShadowing.java:52)
	at org.apache.lucene.util.TestRuleAssertionsRequired$1.evaluate(TestRuleAssertionsRequired.java:36)
	at org.apache.lucene.util.TestRuleMarkFailure$1.evaluate(TestRuleMarkFailure.java:48)
	at org.apache.lucene.util.TestRuleIgnoreAfterMaxFailures$1.evaluate(TestRuleIgnoreAfterMaxFailures.java:70)
	at org.apache.lucene.util.TestRuleIgnoreTestSuites$1.evaluate(TestRuleIgnoreTestSuites.java:55)
	at com.carrotsearch.randomizedtesting.RandomizedRunner.runSuite(RandomizedRunner.java:605)
	at com.carrotsearch.randomizedtesting.RandomizedRunner.access$400(RandomizedRunner.java:132)
	at com.carrotsearch.randomizedtesting.RandomizedRunner$2.run(RandomizedRunner.java:551)




Build Log:
[...truncated 11753 lines...]
[junit4:junit4] Suite: org.apache.solr.client.solrj.embedded.MultiCoreExampleJettyTest
[junit4:junit4] ERROR    201s J0 | MultiCoreExampleJettyTest.testDistributed
[junit4:junit4]    > Throwable #1: org.apache.solr.common.SolrException: Server at http://localhost:55281/example/core0 returned non ok status:500, message:Server Error
[junit4:junit4]    > 	at __randomizedtesting.SeedInfo.seed([4B78A024F9DC07F9:244A17CC88645996]:0)
[junit4:junit4]    > 	at org.apache.solr.client.solrj.impl.HttpSolrServer.request(HttpSolrServer.java:376)
[junit4:junit4]    > 	at org.apache.solr.client.solrj.impl.HttpSolrServer.request(HttpSolrServer.java:182)
[junit4:junit4]    > 	at org.apache.solr.client.solrj.request.QueryRequest.process(QueryRequest.java:90)
[junit4:junit4]    > 	at org.apache.solr.client.solrj.embedded.MultiCoreExampleJettyTest.testDistributed(MultiCoreExampleJettyTest.java:147)
[junit4:junit4]    > 	at sun.reflect.NativeMethodAccessorImpl.invoke0(Native Method)
[junit4:junit4]    > 	at sun.reflect.NativeMethodAccessorImpl.invoke(NativeMethodAccessorImpl.java:57)
[junit4:junit4]    > 	at sun.reflect.DelegatingMethodAccessorImpl.invoke(DelegatingMethodAccessorImpl.java:43)
[junit4:junit4]    > 	at java.lang.reflect.Method.invoke(Method.java:601)
[junit4:junit4]    > 	at com.carrotsearch.randomizedtesting.RandomizedRunner.invoke(RandomizedRunner.java:1995)
[junit4:junit4]    > 	at com.carrotsearch.randomizedtesting.RandomizedRunner.access$1100(RandomizedRunner.java:132)
[junit4:junit4]    > 	at com.carrotsearch.randomizedtesting.RandomizedRunner$6.evaluate(RandomizedRunner.java:818)
[junit4:junit4]    > 	at com.carrotsearch.randomizedtesting.RandomizedRunner$7.evaluate(RandomizedRunner.java:877)
[junit4:junit4]    > 	at com.carrotsearch.randomizedtesting.RandomizedRunner$8.evaluate(RandomizedRunner.java:891)
[junit4:junit4]    > 	at com.carrotsearch.randomizedtesting.rules.SystemPropertiesRestoreRule$1.evaluate(SystemPropertiesRestoreRule.java:53)
[junit4:junit4]    > 	at org.apache.lucene.util.TestRuleSetupTeardownChained$1.evaluate(TestRuleSetupTeardownChained.java:50)
[junit4:junit4]    > 	at org.apache.lucene.util.TestRuleFieldCacheSanity$1.evaluate(TestRuleFieldCacheSanity.java:32)
[junit4:junit4]    > 	at org.apache.lucene.util.AbstractBeforeAfterRule$1.evaluate(AbstractBeforeAfterRule.java:45)
[junit4:junit4]    > 	at com.carrotsearch.randomizedtesting.rules.SystemPropertiesInvariantRule$1.evaluate(SystemPropertiesInvariantRule.java:55)
[junit4:junit4]    > 	at org.apache.lucene.util.TestRuleReportUncaughtExceptions$1.evaluate(TestRuleReportUncaughtExceptions.java:68)
[junit4:junit4]    > 	at org.apache.lucene.util.TestRuleThreadAndTestName$1.evaluate(TestRuleThreadAndTestName.java:48)
[junit4:junit4]    > 	at org.apache.lucene.util.TestRuleIgnoreAfterMaxFailures$1.evaluate(TestRuleIgnoreAfterMaxFailures.java:70)
[junit4:junit4]    > 	at org.apache.lucene.util.TestRuleMarkFailure$1.evaluate(TestRuleMarkFailure.java:48)
[junit4:junit4]    > 	at com.carrotsearch.randomizedtesting.RandomizedRunner.runSingleTest(RandomizedRunner.java:825)
[junit4:junit4]    > 	at com.carrotsearch.randomizedtesting.RandomizedRunner.access$700(RandomizedRunner.java:132)
[junit4:junit4]    > 	at com.carrotsearch.randomizedtesting.RandomizedRunner$3$1.run(RandomizedRunner.java:671)
[junit4:junit4]    > 	at com.carrotsearch.randomizedtesting.RandomizedRunner$3.evaluate(RandomizedRunner.java:697)
[junit4:junit4]    > 	at com.carrotsearch.randomizedtesting.RandomizedRunner$4.evaluate(RandomizedRunner.java:736)
[junit4:junit4]    > 	at com.carrotsearch.randomizedtesting.RandomizedRunner$5.evaluate(RandomizedRunner.java:747)
[junit4:junit4]    > 	at com.carrotsearch.randomizedtesting.rules.SystemPropertiesRestoreRule$1.evaluate(SystemPropertiesRestoreRule.java:53)
[junit4:junit4]    > 	at org.apache.lucene.util.AbstractBeforeAfterRule$1.evaluate(AbstractBeforeAfterRule.java:45)
[junit4:junit4]    > 	at org.apache.lucene.util.TestRuleReportUncaughtExceptions$1.evaluate(TestRuleReportUncaughtExceptions.java:68)
[junit4:junit4]    > 	at org.apache.lucene.util.TestRuleStoreClassName$1.evaluate(TestRuleStoreClassName.java:38)
[junit4:junit4]    > 	at org.apache.lucene.util.TestRuleIcuHack$1.evaluate(TestRuleIcuHack.java:51)
[junit4:junit4]    > 	at com.carrotsearch.randomizedtesting.rules.SystemPropertiesInvariantRule$1.evaluate(SystemPropertiesInvariantRule.java:55)
[junit4:junit4]    > 	at org.apache.lucene.util.TestRuleNoInstanceHooksOverrides$1.evaluate(TestRuleNoInstanceHooksOverrides.java:53)
[junit4:junit4]    > 	at org.apache.lucene.util.TestRuleNoStaticHooksShadowing$1.evaluate(TestRuleNoStaticHooksShadowing.java:52)
[junit4:junit4]    > 	at org.apache.lucene.util.TestRuleAssertionsRequired$1.evaluate(TestRuleAssertionsRequired.java:36)
[junit4:junit4]    > 	at org.apache.lucene.util.TestRuleMarkFailure$1.evaluate(TestRuleMarkFailure.java:48)
[junit4:junit4]    > 	at org.apache.lucene.util.TestRuleIgnoreAfterMaxFailures$1.evaluate(TestRuleIgnoreAfterMaxFailures.java:70)
[junit4:junit4]    > 	at org.apache.lucene.util.TestRuleIgnoreTestSuites$1.evaluate(TestRuleIgnoreTestSuites.java:55)
[junit4:junit4]    > 	at com.carrotsearch.randomizedtesting.RandomizedRunner.runSuite(RandomizedRunner.java:605)
[junit4:junit4]    > 	at com.carrotsearch.randomizedtesting.RandomizedRunner.access$400(RandomizedRunner.java:132)
[junit4:junit4]    > 	at com.carrotsearch.randomizedtesting.RandomizedRunner$2.run(RandomizedRunner.java:551)
[junit4:junit4]    > 
[junit4:junit4]   2> 1322 T184 oasu.AbstractSolrTestCase.setUp ####SETUP_START testDistributed
[junit4:junit4]   2> 1322 T184 oasc.SolrResourceLoader.<init> new SolrResourceLoader for directory: '/mnt/ssd/jenkins/workspace/Lucene-Solr-trunk-Linux-Java7-64/checkout/solr/example/multicore/collection1/'
[junit4:junit4]   2> 1342 T184 oasc.SolrConfig.<init> Using Lucene MatchVersion: LUCENE_50
[junit4:junit4]   2> 1375 T184 oasc.SolrConfig.<init> Loaded SolrConfig: /mnt/ssd/jenkins/workspace/Lucene-Solr-trunk-Linux-Java7-64/checkout/solr/example/multicore/core0/conf/solrconfig.xml
[junit4:junit4]   2> 1376 T184 oass.IndexSchema.readSchema Reading Solr Schema
[junit4:junit4]   2> 1379 T184 oass.IndexSchema.readSchema Schema name=example core zero
[junit4:junit4]   2> 1390 T184 oass.IndexSchema.readSchema default search field in schema is name
[junit4:junit4]   2> 1391 T184 oass.IndexSchema.readSchema query parser default operator is OR
[junit4:junit4]   2> 1392 T184 oass.IndexSchema.readSchema unique key field: id
[junit4:junit4]   2> 1393 T184 oasc.SolrResourceLoader.locateSolrHome JNDI not configured for solr (NoInitialContextEx)
[junit4:junit4]   2> 1393 T184 oasc.SolrResourceLoader.locateSolrHome using system property solr.solr.home: /mnt/ssd/jenkins/workspace/Lucene-Solr-trunk-Linux-Java7-64/checkout/solr/example/multicore
[junit4:junit4]   2> 1393 T184 oasc.SolrResourceLoader.<init> new SolrResourceLoader for directory: '/mnt/ssd/jenkins/workspace/Lucene-Solr-trunk-Linux-Java7-64/checkout/solr/example/multicore/'
[junit4:junit4]   2> 1393 T184 oasc.CoreContainer.<init> New CoreContainer 1929078963
[junit4:junit4]   2> 1394 T184 oasc.SolrCore.<init> [collection1] Opening new SolrCore at /mnt/ssd/jenkins/workspace/Lucene-Solr-trunk-Linux-Java7-64/checkout/solr/example/multicore/collection1/, dataDir=/mnt/ssd/jenkins/workspace/Lucene-Solr-trunk-Linux-Java7-64/checkout/solr/build/solr-solrj/test/J0/./org.apache.solr.client.solrj.embedded.MultiCoreExampleJettyTest-1341923148035/
[junit4:junit4]   2> 1394 T184 oasc.SolrCore.<init> JMX monitoring not detected for core: collection1
[junit4:junit4]   2> 1396 T184 oasc.SolrCore.getNewIndexDir WARNING New index directory detected: old=null new=/mnt/ssd/jenkins/workspace/Lucene-Solr-trunk-Linux-Java7-64/checkout/solr/build/solr-solrj/test/J0/./org.apache.solr.client.solrj.embedded.MultiCoreExampleJettyTest-1341923148035/index/
[junit4:junit4]   2> 1396 T184 oasc.SolrCore.initIndex WARNING [collection1] Solr index directory '/mnt/ssd/jenkins/workspace/Lucene-Solr-trunk-Linux-Java7-64/checkout/solr/build/solr-solrj/test/J0/./org.apache.solr.client.solrj.embedded.MultiCoreExampleJettyTest-1341923148035/index' doesn't exist. Creating new index...
[junit4:junit4]   2> 1398 T184 oasc.SolrDeletionPolicy.onCommit SolrDeletionPolicy.onCommit: commits:num=1
[junit4:junit4]   2> 		commit{dir=org.apache.lucene.store.RAMDirectory@79eafca5 lockFactory=org.apache.lucene.store.NativeFSLockFactory@156ca5ec,segFN=segments_1,generation=1,filenames=[segments_1]
[junit4:junit4]   2> 1398 T184 oasc.SolrDeletionPolicy.updateCommits newest commit = 1
[junit4:junit4]   2> 1399 T184 oasc.RequestHandlers.initHandlersFromConfig created /get: solr.RealTimeGetHandler
[junit4:junit4]   2> 1399 T184 oasc.RequestHandlers.initHandlersFromConfig adding lazy requestHandler: solr.ReplicationHandler
[junit4:junit4]   2> 1399 T184 oasc.RequestHandlers.initHandlersFromConfig created /replication: solr.ReplicationHandler
[junit4:junit4]   2> 1399 T184 oasc.RequestHandlers.initHandlersFromConfig created standard: solr.StandardRequestHandler
[junit4:junit4]   2> 1399 T184 oasc.RequestHandlers.initHandlersFromConfig adding lazy requestHandler: solr.FieldAnalysisRequestHandler
[junit4:junit4]   2> 1400 T184 oasc.RequestHandlers.initHandlersFromConfig created /analysis/field: solr.FieldAnalysisRequestHandler
[junit4:junit4]   2> 1400 T184 oasc.RequestHandlers.initHandlersFromConfig created /update: solr.UpdateRequestHandler
[junit4:junit4]   2> 1400 T184 oasc.RequestHandlers.initHandlersFromConfig created /admin/: org.apache.solr.handler.admin.AdminHandlers
[junit4:junit4]   2> 1400 T184 oasc.RequestHandlers.initHandlersFromConfig created /admin/ping: solr.PingRequestHandler
[junit4:junit4]   2> 1401 T184 oashl.XMLLoader.init xsltCacheLifetimeSeconds=60
[junit4:junit4]   2> 1403 T184 oass.SolrIndexSearcher.<init> Opening Searcher@c28fc01 main
[junit4:junit4]   2> 1403 T184 oass.SolrIndexSearcher.getIndexDir WARNING WARNING: Directory impl does not support setting indexDir: org.apache.lucene.store.RAMDirectory
[junit4:junit4]   2> 1404 T184 oasu.CommitTracker.<init> Hard AutoCommit: disabled
[junit4:junit4]   2> 1404 T184 oasu.CommitTracker.<init> Soft AutoCommit: disabled
[junit4:junit4]   2> 1404 T184 oashc.HttpShardHandlerFactory.getParameter Setting socketTimeout to: 0
[junit4:junit4]   2> 1405 T184 oashc.HttpShardHandlerFactory.getParameter Setting urlScheme to: http://
[junit4:junit4]   2> 1405 T184 oashc.HttpShardHandlerFactory.getParameter Setting connTimeout to: 0
[junit4:junit4]   2> 1405 T184 oashc.HttpShardHandlerFactory.getParameter Setting maxConnectionsPerHost to: 20
[junit4:junit4]   2> 1405 T184 oashc.HttpShardHandlerFactory.getParameter Setting corePoolSize to: 0
[junit4:junit4]   2> 1405 T184 oashc.HttpShardHandlerFactory.getParameter Setting maximumPoolSize to: 2147483647
[junit4:junit4]   2> 1406 T184 oashc.HttpShardHandlerFactory.getParameter Setting maxThreadIdleTime to: 5
[junit4:junit4]   2> 1406 T184 oashc.HttpShardHandlerFactory.getParameter Setting sizeOfQueue to: -1
[junit4:junit4]   2> 1406 T184 oashc.HttpShardHandlerFactory.getParameter Setting fairnessPolicy to: false
[junit4:junit4]   2> 1406 T184 oascsi.HttpClientUtil.createClient Creating new http client, config:maxConnectionsPerHost=20&maxConnections=10000&socketTimeout=0&connTimeout=0&retry=false
[junit4:junit4]   2> 1410 T185 oasc.SolrCore.registerSearcher [collection1] Registered new searcher Searcher@c28fc01 main{StandardDirectoryReader(segments_1:1)}
[junit4:junit4]   2> 1410 T184 oasc.CoreContainer.register registering core: collection1
[junit4:junit4]   2> 1411 T184 oasu.AbstractSolrTestCase.setUp ####SETUP_END testDistributed
[junit4:junit4]   2> 1411 T184 oascs.MultiCoreExampleTestBase.setUp CORES=org.apache.solr.util.TestHarness$Initializer$1@72fb68b3 : [collection1]
[junit4:junit4]   2> 1412 T184 oejs.Server.doStart jetty-8.1.2.v20120308
[junit4:junit4]   2> 1416 T184 oejs.AbstractConnector.doStart Started SocketConnector@0.0.0.0:55281
[junit4:junit4]   2> 1416 T184 oasc.SolrResourceLoader.locateSolrHome JNDI not configured for solr (NoInitialContextEx)
[junit4:junit4]   2> 1417 T184 oasc.SolrResourceLoader.locateSolrHome using system property solr.solr.home: /mnt/ssd/jenkins/workspace/Lucene-Solr-trunk-Linux-Java7-64/checkout/solr/example/multicore
[junit4:junit4]   2> 1417 T184 oasc.SolrResourceLoader.<init> new SolrResourceLoader for deduced Solr Home: '/mnt/ssd/jenkins/workspace/Lucene-Solr-trunk-Linux-Java7-64/checkout/solr/example/multicore/'
[junit4:junit4]   2> 1422 T184 oass.SolrDispatchFilter.init SolrDispatchFilter.init()
[junit4:junit4]   2> 1423 T184 oasc.SolrResourceLoader.locateSolrHome JNDI not configured for solr (NoInitialContextEx)
[junit4:junit4]   2> 1423 T184 oasc.SolrResourceLoader.locateSolrHome using system property solr.solr.home: /mnt/ssd/jenkins/workspace/Lucene-Solr-trunk-Linux-Java7-64/checkout/solr/example/multicore
[junit4:junit4]   2> 1423 T184 oasc.CoreContainer$Initializer.initialize looking for solr.xml: /mnt/ssd/jenkins/workspace/Lucene-Solr-trunk-Linux-Java7-64/checkout/solr/example/multicore/solr.xml
[junit4:junit4]   2> 1424 T184 oasc.CoreContainer.<init> New CoreContainer 1358375881
[junit4:junit4]   2> 1424 T184 oasc.CoreContainer.load Loading CoreContainer using Solr Home: '/mnt/ssd/jenkins/workspace/Lucene-Solr-trunk-Linux-Java7-64/checkout/solr/example/multicore/'
[junit4:junit4]   2> 1424 T184 oasc.SolrResourceLoader.<init> new SolrResourceLoader for directory: '/mnt/ssd/jenkins/workspace/Lucene-Solr-trunk-Linux-Java7-64/checkout/solr/example/multicore/'
[junit4:junit4]   2> 1433 T184 oasc.CoreContainer.load Registering Log Listener
[junit4:junit4]   2> 1446 T184 oashc.HttpShardHandlerFactory.getParameter Setting socketTimeout to: 0
[junit4:junit4]   2> 1446 T184 oashc.HttpShardHandlerFactory.getParameter Setting urlScheme to: http://
[junit4:junit4]   2> 1447 T184 oashc.HttpShardHandlerFactory.getParameter Setting connTimeout to: 0
[junit4:junit4]   2> 1447 T184 oashc.HttpShardHandlerFactory.getParameter Setting maxConnectionsPerHost to: 20
[junit4:junit4]   2> 1447 T184 oashc.HttpShardHandlerFactory.getParameter Setting corePoolSize to: 0
[junit4:junit4]   2> 1447 T184 oashc.HttpShardHandlerFactory.getParameter Setting maximumPoolSize to: 2147483647
[junit4:junit4]   2> 1448 T184 oashc.HttpShardHandlerFactory.getParameter Setting maxThreadIdleTime to: 5
[junit4:junit4]   2> 1448 T184 oashc.HttpShardHandlerFactory.getParameter Setting sizeOfQueue to: -1
[junit4:junit4]   2> 1448 T184 oashc.HttpShardHandlerFactory.getParameter Setting fairnessPolicy to: false
[junit4:junit4]   2> 1448 T184 oascsi.HttpClientUtil.createClient Creating new http client, config:maxConnectionsPerHost=20&maxConnections=10000&socketTimeout=0&connTimeout=0&retry=false
[junit4:junit4]   2> 1469 T184 oasc.CoreContainer.create Creating SolrCore 'core0' using instanceDir: /mnt/ssd/jenkins/workspace/Lucene-Solr-trunk-Linux-Java7-64/checkout/solr/example/multicore/core0
[junit4:junit4]   2> 1469 T184 oasc.SolrResourceLoader.<init> new SolrResourceLoader for directory: '/mnt/ssd/jenkins/workspace/Lucene-Solr-trunk-Linux-Java7-64/checkout/solr/example/multicore/core0/'
[junit4:junit4]   2> 1492 T184 oasc.SolrConfig.<init> Using Lucene MatchVersion: LUCENE_50
[junit4:junit4]   2> 1526 T184 oasc.SolrConfig.<init> Loaded SolrConfig: solrconfig.xml
[junit4:junit4]   2> 1527 T184 oass.IndexSchema.readSchema Reading Solr Schema
[junit4:junit4]   2> 1530 T184 oass.IndexSchema.readSchema Schema name=example core zero
[junit4:junit4]   2> 1541 T184 oass.IndexSchema.readSchema default search field in schema is name
[junit4:junit4]   2> 1543 T184 oass.IndexSchema.readSchema query parser default operator is OR
[junit4:junit4]   2> 1544 T184 oass.IndexSchema.readSchema unique key field: id
[junit4:junit4]   2> 1545 T184 oasc.SolrCore.<init> [core0] Opening new SolrCore at /mnt/ssd/jenkins/workspace/Lucene-Solr-trunk-Linux-Java7-64/checkout/solr/example/multicore/core0/, dataDir=/mnt/ssd/jenkins/workspace/Lucene-Solr-trunk-Linux-Java7-64/checkout/solr/build/solr-solrj/test/J0/org.apache.solr.client.solrj.embedded.MultiCoreExampleJettyTest-1341923148035/
[junit4:junit4]   2> 1545 T184 oasc.SolrCore.<init> JMX monitoring not detected for core: core0
[junit4:junit4]   2> 1545 T184 oasc.SolrCore.getNewIndexDir WARNING New index directory detected: old=null new=/mnt/ssd/jenkins/workspace/Lucene-Solr-trunk-Linux-Java7-64/checkout/solr/build/solr-solrj/test/J0/org.apache.solr.client.solrj.embedded.MultiCoreExampleJettyTest-1341923148035/index/
[junit4:junit4]   2> 1546 T184 oasc.SolrCore.initIndex WARNING [core0] Solr index directory '/mnt/ssd/jenkins/workspace/Lucene-Solr-trunk-Linux-Java7-64/checkout/solr/build/solr-solrj/test/J0/org.apache.solr.client.solrj.embedded.MultiCoreExampleJettyTest-1341923148035/index' doesn't exist. Creating new index...
[junit4:junit4]   2> 1547 T184 oasc.SolrDeletionPolicy.onCommit SolrDeletionPolicy.onCommit: commits:num=1
[junit4:junit4]   2> 		commit{dir=org.apache.lucene.store.RAMDirectory@7073b73e lockFactory=org.apache.lucene.store.NativeFSLockFactory@31123984,segFN=segments_1,generation=1,filenames=[segments_1]
[junit4:junit4]   2> 1547 T184 oasc.SolrDeletionPolicy.updateCommits newest commit = 1
[junit4:junit4]   2> 1548 T184 oasc.RequestHandlers.initHandlersFromConfig created /get: solr.RealTimeGetHandler
[junit4:junit4]   2> 1548 T184 oasc.RequestHandlers.initHandlersFromConfig adding lazy requestHandler: solr.ReplicationHandler
[junit4:junit4]   2> 1548 T184 oasc.RequestHandlers.initHandlersFromConfig created /replication: solr.ReplicationHandler
[junit4:junit4]   2> 1548 T184 oasc.RequestHandlers.initHandlersFromConfig created standard: solr.StandardRequestHandler
[junit4:junit4]   2> 1549 T184 oasc.RequestHandlers.initHandlersFromConfig adding lazy requestHandler: solr.FieldAnalysisRequestHandler
[junit4:junit4]   2> 1549 T184 oasc.RequestHandlers.initHandlersFromConfig created /analysis/field: solr.FieldAnalysisRequestHandler
[junit4:junit4]   2> 1549 T184 oasc.RequestHandlers.initHandlersFromConfig created /update: solr.UpdateRequestHandler
[junit4:junit4]   2> 1549 T184 oasc.RequestHandlers.initHandlersFromConfig created /admin/: org.apache.solr.handler.admin.AdminHandlers
[junit4:junit4]   2> 1550 T184 oasc.RequestHandlers.initHandlersFromConfig created /admin/ping: solr.PingRequestHandler
[junit4:junit4]   2> 1550 T184 oashl.XMLLoader.init xsltCacheLifetimeSeconds=60
[junit4:junit4]   2> 1553 T184 oass.SolrIndexSearcher.<init> Opening Searcher@3ead0000 main
[junit4:junit4]   2> 1553 T184 oass.SolrIndexSearcher.getIndexDir WARNING WARNING: Directory impl does not support setting indexDir: org.apache.lucene.store.RAMDirectory
[junit4:junit4]   2> 1553 T184 oasu.CommitTracker.<init> Hard AutoCommit: disabled
[junit4:junit4]   2> 1554 T184 oasu.CommitTracker.<init> Soft AutoCommit: disabled
[junit4:junit4]   2> 1555 T195 oasc.SolrCore.registerSearcher [core0] Registered new searcher Searcher@3ead0000 main{StandardDirectoryReader(segments_1:1)}
[junit4:junit4]   2> 1555 T184 oasc.CoreContainer.register registering core: core0
[junit4:junit4]   2> 1556 T184 oasc.CoreContainer.create Creating SolrCore 'core1' using instanceDir: /mnt/ssd/jenkins/workspace/Lucene-Solr-trunk-Linux-Java7-64/checkout/solr/example/multicore/core1
[junit4:junit4]   2> 1556 T184 oasc.SolrResourceLoader.<init> new SolrResourceLoader for directory: '/mnt/ssd/jenkins/workspace/Lucene-Solr-trunk-Linux-Java7-64/checkout/solr/example/multicore/core1/'
[junit4:junit4]   2> 1582 T184 oasc.SolrConfig.<init> Using Lucene MatchVersion: LUCENE_50
[junit4:junit4]   2> 1628 T184 oasc.SolrConfig.<init> Loaded SolrConfig: solrconfig.xml
[junit4:junit4]   2> 1629 T184 oass.IndexSchema.readSchema Reading Solr Schema
[junit4:junit4]   2> 1633 T184 oass.IndexSchema.readSchema Schema name=example core one
[junit4:junit4]   2> 1648 T184 oass.IndexSchema.readSchema default search field in schema is name
[junit4:junit4]   2> 1649 T184 oass.IndexSchema.readSchema query parser default operator is OR
[junit4:junit4]   2> 1650 T184 oass.IndexSchema.readSchema unique key field: id
[junit4:junit4]   2> 1651 T184 oasc.SolrCore.<init> [core1] Opening new SolrCore at /mnt/ssd/jenkins/workspace/Lucene-Solr-trunk-Linux-Java7-64/checkout/solr/example/multicore/core1/, dataDir=/mnt/ssd/jenkins/workspace/Lucene-Solr-trunk-Linux-Java7-64/checkout/solr/build/solr-solrj/test/J0/org.apache.solr.client.solrj.embedded.MultiCoreExampleJettyTest-core1-1341923148125/
[junit4:junit4]   2> 1651 T184 oasc.SolrCore.<init> JMX monitoring not detected for core: core1
[junit4:junit4]   2> 1652 T184 oasc.SolrCore.getNewIndexDir WARNING New index directory detected: old=null new=/mnt/ssd/jenkins/workspace/Lucene-Solr-trunk-Linux-Java7-64/checkout/solr/build/solr-solrj/test/J0/org.apache.solr.client.solrj.embedded.MultiCoreExampleJettyTest-core1-1341923148125/index/
[junit4:junit4]   2> 1652 T184 oasc.SolrCore.initIndex WARNING [core1] Solr index directory '/mnt/ssd/jenkins/workspace/Lucene-Solr-trunk-Linux-Java7-64/checkout/solr/build/solr-solrj/test/J0/org.apache.solr.client.solrj.embedded.MultiCoreExampleJettyTest-core1-1341923148125/index' doesn't exist. Creating new index...
[junit4:junit4]   2> 1653 T184 oasc.SolrDeletionPolicy.onCommit SolrDeletionPolicy.onCommit: commits:num=1
[junit4:junit4]   2> 		commit{dir=org.apache.lucene.store.RAMDirectory@6c14a74 lockFactory=org.apache.lucene.store.NativeFSLockFactory@24b0d6c7,segFN=segments_1,generation=1,filenames=[segments_1]
[junit4:junit4]   2> 1654 T184 oasc.SolrDeletionPolicy.updateCommits newest commit = 1
[junit4:junit4]   2> 1654 T184 oasc.RequestHandlers.initHandlersFromConfig created /get: solr.RealTimeGetHandler
[junit4:junit4]   2> 1655 T184 oasc.RequestHandlers.initHandlersFromConfig adding lazy requestHandler: solr.ReplicationHandler
[junit4:junit4]   2> 1655 T184 oasc.RequestHandlers.initHandlersFromConfig created /replication: solr.ReplicationHandler
[junit4:junit4]   2> 1655 T184 oasc.RequestHandlers.initHandlersFromConfig created standard: solr.StandardRequestHandler
[junit4:junit4]   2> 1655 T184 oasc.RequestHandlers.initHandlersFromConfig adding lazy requestHandler: solr.FieldAnalysisRequestHandler
[junit4:junit4]   2> 1655 T184 oasc.RequestHandlers.initHandlersFromConfig created /analysis/field: solr.FieldAnalysisRequestHandler
[junit4:junit4]   2> 1656 T184 oasc.RequestHandlers.initHandlersFromConfig created /update: solr.UpdateRequestHandler
[junit4:junit4]   2> 1656 T184 oasc.RequestHandlers.initHandlersFromConfig created /admin/: org.apache.solr.handler.admin.AdminHandlers
[junit4:junit4]   2> 1656 T184 oasc.RequestHandlers.initHandlersFromConfig created /admin/ping: solr.PingRequestHandler
[junit4:junit4]   2> 1657 T184 oashl.XMLLoader.init xsltCacheLifetimeSeconds=60
[junit4:junit4]   2> 1659 T184 oass.SolrIndexSearcher.<init> Opening Searcher@651293a0 main
[junit4:junit4]   2> 1660 T184 oass.SolrIndexSearcher.getIndexDir WARNING WARNING: Directory impl does not support setting indexDir: org.apache.lucene.store.RAMDirectory
[junit4:junit4]   2> 1660 T184 oasu.CommitTracker.<init> Hard AutoCommit: disabled
[junit4:junit4]   2> 1661 T184 oasu.CommitTracker.<init> Soft AutoCommit: disabled
[junit4:junit4]   2> 1662 T196 oasc.SolrCore.registerSearcher [core1] Registered new searcher Searcher@651293a0 main{StandardDirectoryReader(segments_1:1)}
[junit4:junit4]   2> 1662 T184 oasc.CoreContainer.register registering core: core1
[junit4:junit4]   2> 1662 T184 oass.SolrDispatchFilter.init user.dir=/mnt/ssd/jenkins/workspace/Lucene-Solr-trunk-Linux-Java7-64/checkout/solr/build/solr-solrj/test/J0
[junit4:junit4]   2> 1662 T184 oass.SolrDispatchFilter.init SolrDispatchFilter.init() done
[junit4:junit4]   2> 1663 T184 oascsi.HttpClientUtil.createClient Creating new http client, config:maxConnections=128&maxConnectionsPerHost=32&followRedirects=false
[junit4:junit4]   2> ASYNC  NEW_CORE C18 name=core0 org.apache.solr.core.SolrCore@54da4f92
[junit4:junit4]   2> 1672 T188 C18 oasc.SolrDeletionPolicy.onInit SolrDeletionPolicy.onInit: commits:num=1
[junit4:junit4]   2> 		commit{dir=org.apache.lucene.store.RAMDirectory@7073b73e lockFactory=org.apache.lucene.store.NativeFSLockFactory@31123984,segFN=segments_1,generation=1,filenames=[segments_1]
[junit4:junit4]   2> 1673 T188 C18 oasc.SolrDeletionPolicy.updateCommits newest commit = 1
[junit4:junit4]   2> 1674 T188 C18 oass.SolrIndexSearcher.<init> Opening Searcher@45222039 realtime
[junit4:junit4]   2> 1674 T188 C18 oass.SolrIndexSearcher.getIndexDir WARNING WARNING: Directory impl does not support setting indexDir: org.apache.lucene.store.RAMDirectory
[junit4:junit4]   2> 1675 T188 C18 oasu.DirectUpdateHandler2.commit start commit{flags=0,version=0,optimize=false,openSearcher=true,waitSearcher=true,expungeDeletes=false,softCommit=false}
[junit4:junit4]   2> 1675 T188 C18 oass.SolrIndexSearcher.<init> Opening Searcher@431e34c7 main
[junit4:junit4]   2> 1675 T188 C18 oass.SolrIndexSearcher.getIndexDir WARNING WARNING: Directory impl does not support setting indexDir: org.apache.lucene.store.RAMDirectory
[junit4:junit4]   2> 1675 T195 oasc.SolrCore.registerSearcher [core0] Registered new searcher Searcher@431e34c7 main{StandardDirectoryReader(segments_1:1:nrt)}
[junit4:junit4]   2> 1675 T188 C18 oasu.DirectUpdateHandler2.commit end_commit_flush
[junit4:junit4]   2> 1676 T188 C18 UPDATE [core0] webapp=/example path=/update params={waitSearcher=true&commit=true&wt=javabin&version=2&softCommit=false} {deleteByQuery=*:* (-1407108407239901184),commit=} 0 5
[junit4:junit4]   2> 1676 T184 oascsi.HttpClientUtil.createClient Creating new http client, config:maxConnections=128&maxConnectionsPerHost=32&followRedirects=false
[junit4:junit4]   2> ASYNC  NEW_CORE C19 name=core1 org.apache.solr.core.SolrCore@25c6f10
[junit4:junit4]   2> 1687 T189 C19 oasc.SolrDeletionPolicy.onInit SolrDeletionPolicy.onInit: commits:num=1
[junit4:junit4]   2> 		commit{dir=org.apache.lucene.store.RAMDirectory@6c14a74 lockFactory=org.apache.lucene.store.NativeFSLockFactory@24b0d6c7,segFN=segments_1,generation=1,filenames=[segments_1]
[junit4:junit4]   2> 1687 T189 C19 oasc.SolrDeletionPolicy.updateCommits newest commit = 1
[junit4:junit4]   2> 1688 T189 C19 oass.SolrIndexSearcher.<init> Opening Searcher@1e4bac35 realtime
[junit4:junit4]   2> 1688 T189 C19 oass.SolrIndexSearcher.getIndexDir WARNING WARNING: Directory impl does not support setting indexDir: org.apache.lucene.store.RAMDirectory
[junit4:junit4]   2> 1689 T189 C19 oasu.DirectUpdateHandler2.commit start commit{flags=0,version=0,optimize=false,openSearcher=true,waitSearcher=true,expungeDeletes=false,softCommit=false}
[junit4:junit4]   2> 1689 T189 C19 oass.SolrIndexSearcher.<init> Opening Searcher@728b49e2 main
[junit4:junit4]   2> 1689 T189 C19 oass.SolrIndexSearcher.getIndexDir WARNING WARNING: Directory impl does not support setting indexDir: org.apache.lucene.store.RAMDirectory
[junit4:junit4]   2> 1689 T196 oasc.SolrCore.registerSearcher [core1] Registered new searcher Searcher@728b49e2 main{StandardDirectoryReader(segments_1:1:nrt)}
[junit4:junit4]   2> 1689 T189 C19 oasu.DirectUpdateHandler2.commit end_commit_flush
[junit4:junit4]   2> 1702 T189 C19 UPDATE [core1] webapp=/example path=/update params={waitSearcher=true&commit=true&wt=javabin&version=2&softCommit=false} {deleteByQuery=*:* (-1407108407255629824),commit=} 0 16
[junit4:junit4]   2> 1703 T184 oascsi.HttpClientUtil.createClient Creating new http client, config:maxConnections=128&maxConnectionsPerHost=32&followRedirects=false
[junit4:junit4]   2> 1709 T190 C18 oasu.DirectUpdateHandler2.commit start commit{flags=0,version=0,optimize=false,openSearcher=true,waitSearcher=true,expungeDeletes=false,softCommit=false}
[junit4:junit4]   2> 1711 T190 C18 oasc.SolrDeletionPolicy.onCommit SolrDeletionPolicy.onCommit: commits:num=2
[junit4:junit4]   2> 		commit{dir=org.apache.lucene.store.RAMDirectory@7073b73e lockFactory=org.apache.lucene.store.NativeFSLockFactory@31123984,segFN=segments_1,generation=1,filenames=[segments_1]
[junit4:junit4]   2> 		commit{dir=org.apache.lucene.store.RAMDirectory@7073b73e lockFactory=org.apache.lucene.store.NativeFSLockFactory@31123984,segFN=segments_2,generation=2,filenames=[_0_Lucene40WithOrds_0.tii, _0.fnm, _0_Lucene40WithOrds_0.frq, _0_SimpleText_0.pst, _0_nrm.cfe, segments_2, _0.fdx, _0_Lucene40WithOrds_0.prx, _0_nrm.cfs, _0.si, _0_Lucene40WithOrds_0.tib, _0.fdt]
[junit4:junit4]   2> 1711 T190 C18 oasc.SolrDeletionPolicy.updateCommits newest commit = 2
[junit4:junit4]   2> 1712 T190 C18 oass.SolrIndexSearcher.<init> Opening Searcher@10cb09c8 main
[junit4:junit4]   2> 1712 T190 C18 oass.SolrIndexSearcher.getIndexDir WARNING WARNING: Directory impl does not support setting indexDir: org.apache.lucene.store.RAMDirectory
[junit4:junit4]   2> 1713 T190 C18 oasu.DirectUpdateHandler2.commit end_commit_flush
[junit4:junit4]   2> 1713 T195 oasc.SolrCore.registerSearcher [core0] Registered new searcher Searcher@10cb09c8 main{StandardDirectoryReader(segments_2:3:nrt _0(5.0):C1)}
[junit4:junit4]   2> 1713 T190 C18 UPDATE [core0] webapp=/example path=/update params={waitSearcher=true&commit=true&wt=javabin&version=2&softCommit=false} {add=[core0 (1407108407277649920)],commit=} 0 6
[junit4:junit4]   2> 1713 T184 oascsi.HttpClientUtil.createClient Creating new http client, config:maxConnections=128&maxConnectionsPerHost=32&followRedirects=false
[junit4:junit4]   2> 1720 T191 C19 oasu.DirectUpdateHandler2.commit start commit{flags=0,version=0,optimize=false,openSearcher=true,waitSearcher=true,expungeDeletes=false,softCommit=false}
[junit4:junit4]   2> 1722 T191 C19 oasc.SolrDeletionPolicy.onCommit SolrDeletionPolicy.onCommit: commits:num=2
[junit4:junit4]   2> 		commit{dir=org.apache.lucene.store.RAMDirectory@6c14a74 lockFactory=org.apache.lucene.store.NativeFSLockFactory@24b0d6c7,segFN=segments_1,generation=1,filenames=[segments_1]
[junit4:junit4]   2> 		commit{dir=org.apache.lucene.store.RAMDirectory@6c14a74 lockFactory=org.apache.lucene.store.NativeFSLockFactory@24b0d6c7,segFN=segments_2,generation=2,filenames=[_0_Lucene40WithOrds_0.tii, _0.fnm, _0_Lucene40WithOrds_0.frq, _0_SimpleText_0.pst, _0_nrm.cfe, segments_2, _0.fdx, _0_Lucene40WithOrds_0.prx, _0_nrm.cfs, _0.si, _0_Lucene40WithOrds_0.tib, _0.fdt]
[junit4:junit4]   2> 1722 T191 C19 oasc.SolrDeletionPolicy.updateCommits newest commit = 2
[junit4:junit4]   2> 1723 T191 C19 oass.SolrIndexSearcher.<init> Opening Searcher@60a220eb main
[junit4:junit4]   2> 1723 T191 C19 oass.SolrIndexSearcher.getIndexDir WARNING WARNING: Directory impl does not support setting indexDir: org.apache.lucene.store.RAMDirectory
[junit4:junit4]   2> 1724 T196 oasc.SolrCore.registerSearcher [core1] Registered new searcher Searcher@60a220eb main{StandardDirectoryReader(segments_2:3:nrt _0(5.0):C1)}
[junit4:junit4]   2> 1724 T191 C19 oasu.DirectUpdateHandler2.commit end_commit_flush
[junit4:junit4]   2> 1724 T191 C19 UPDATE [core1] webapp=/example path=/update params={waitSearcher=true&commit=true&wt=javabin&version=2&softCommit=false} {add=[core1 (1407108407290232832)],commit=} 0 5
[junit4:junit4]   2> 1725 T184 oascsi.HttpClientUtil.createClient Creating new http client, config:maxConnections=128&maxConnectionsPerHost=32&followRedirects=false
[junit4:junit4]   2> 1731 T192 C18 REQ [core0] webapp=/example path=/select params={wt=javabin&q=*:*&version=2} hits=1 status=0 QTime=1 
[junit4:junit4]   2> 1731 T184 oascsi.HttpClientUtil.createClient Creating new http client, config:maxConnections=128&maxConnectionsPerHost=32&followRedirects=false
[junit4:junit4]   2> 1737 T193 C19 REQ [core1] webapp=/example path=/select params={wt=javabin&q=*:*&version=2} hits=1 status=0 QTime=1 
[junit4:junit4]   2> 1737 T184 oascsi.HttpClientUtil.createClient Creating new http client, config:maxConnections=128&maxConnectionsPerHost=32&followRedirects=false
[junit4:junit4]   2> 1756 T188 C19 REQ [core1] webapp=/example path=/select params={fl=id,score&shard.url=localhost:55281/example/core1&NOW=1341923148454&start=0&q=*:*&distrib=false&isShard=true&wt=javabin&fsv=true&rows=10&version=2} hits=1 status=0 QTime=7 
[junit4:junit4]   2> 201805 T189 C18 REQ [core0] webapp=/example path=/select params={fl=id,score&shard.url=localhost:55281/example/core0&NOW=1341923148454&start=0&q=*:*&distrib=false&isShard=true&wt=javabin&fsv=true&rows=10&version=2} hits=1 status=0 QTime=1 
[junit4:junit4]   2> 201817 T189 C19 REQ [core1] webapp=/example path=/select params={fl=id,s:[shard]&shard.url=localhost:55281/example/core1&NOW=1341923148454&q=*:*&ids=core1&distrib=false&isShard=true&wt=javabin&version=2} status=0 QTime=2 
[junit4:junit4]   2> 201819 T194 C18 oasc.SolrException.log SEVERE org.apache.solr.common.SolrException: org.apache.solr.client.solrj.SolrServerException: IOException occured when talking to server at: http://localhost:55281/example/core0
[junit4:junit4]   2> 		at org.apache.solr.handler.component.SearchHandler.handleRequestBody(SearchHandler.java:300)
[junit4:junit4]   2> 		at org.apache.solr.handler.RequestHandlerBase.handleRequest(RequestHandlerBase.java:129)
[junit4:junit4]   2> 		at org.apache.solr.core.SolrCore.execute(SolrCore.java:1619)
[junit4:junit4]   2> 		at org.apache.solr.servlet.SolrDispatchFilter.execute(SolrDispatchFilter.java:454)
[junit4:junit4]   2> 		at org.apache.solr.servlet.SolrDispatchFilter.doFilter(SolrDispatchFilter.java:275)
[junit4:junit4]   2> 		at org.eclipse.jetty.servlet.ServletHandler$CachedChain.doFilter(ServletHandler.java:1337)
[junit4:junit4]   2> 		at org.eclipse.jetty.servlet.ServletHandler.doHandle(ServletHandler.java:484)
[junit4:junit4]   2> 		at org.eclipse.jetty.server.session.SessionHandler.doHandle(SessionHandler.java:231)
[junit4:junit4]   2> 		at org.eclipse.jetty.server.handler.ScopedHandler.handle(ScopedHandler.java:119)
[junit4:junit4]   2> 		at org.eclipse.jetty.server.handler.GzipHandler.handle(GzipHandler.java:267)
[junit4:junit4]   2> 		at org.eclipse.jetty.server.handler.ContextHandler.doHandle(ContextHandler.java:1067)
[junit4:junit4]   2> 		at org.eclipse.jetty.servlet.ServletHandler.doScope(ServletHandler.java:413)
[junit4:junit4]   2> 		at org.eclipse.jetty.server.session.SessionHandler.doScope(SessionHandler.java:192)
[junit4:junit4]   2> 		at org.eclipse.jetty.server.handler.ContextHandler.doScope(ContextHandler.java:999)
[junit4:junit4]   2> 		at org.eclipse.jetty.server.handler.ScopedHandler.handle(ScopedHandler.java:117)
[junit4:junit4]   2> 		at org.eclipse.jetty.server.handler.HandlerWrapper.handle(HandlerWrapper.java:111)
[junit4:junit4]   2> 		at org.eclipse.jetty.server.Server.handle(Server.java:351)
[junit4:junit4]   2> 		at org.eclipse.jetty.server.AbstractHttpConnection.handleRequest(AbstractHttpConnection.java:454)
[junit4:junit4]   2> 		at org.eclipse.jetty.server.BlockingHttpConnection.handleRequest(BlockingHttpConnection.java:47)
[junit4:junit4]   2> 		at org.eclipse.jetty.server.AbstractHttpConnection.headerComplete(AbstractHttpConnection.java:890)
[junit4:junit4]   2> 		at org.eclipse.jetty.server.AbstractHttpConnection$RequestHandler.headerComplete(AbstractHttpConnection.java:944)
[junit4:junit4]   2> 		at org.eclipse.jetty.http.HttpParser.parseNext(HttpParser.java:634)
[junit4:junit4]   2> 		at org.eclipse.jetty.http.HttpParser.parseAvailable(HttpParser.java:230)
[junit4:junit4]   2> 		at org.eclipse.jetty.server.BlockingHttpConnection.handle(BlockingHttpConnection.java:66)
[junit4:junit4]   2> 		at org.eclipse.jetty.server.bio.SocketConnector$ConnectorEndPoint.run(SocketConnector.java:254)
[junit4:junit4]   2> 		at org.eclipse.jetty.util.thread.QueuedThreadPool.runJob(QueuedThreadPool.java:599)
[junit4:junit4]   2> 		at org.eclipse.jetty.util.thread.QueuedThreadPool$3.run(QueuedThreadPool.java:534)
[junit4:junit4]   2> 		at java.lang.Thread.run(Thread.java:722)
[junit4:junit4]   2> 	Caused by: org.apache.solr.client.solrj.SolrServerException: IOException occured when talking to server at: http://localhost:55281/example/core0
[junit4:junit4]   2> 		at org.apache.solr.client.solrj.impl.HttpSolrServer.request(HttpSolrServer.java:417)
[junit4:junit4]   2> 		at org.apache.solr.client.solrj.impl.HttpSolrServer.request(HttpSolrServer.java:182)
[junit4:junit4]   2> 		at org.apache.solr.handler.component.HttpShardHandler$1.call(HttpShardHandler.java:165)
[junit4:junit4]   2> 		at org.apache.solr.handler.component.HttpShardHandler$1.call(HttpShardHandler.java:132)
[junit4:junit4]   2> 		at java.util.concurrent.FutureTask$Sync.innerRun(FutureTask.java:334)
[junit4:junit4]   2> 		at java.util.concurrent.FutureTask.run(FutureTask.java:166)
[junit4:junit4]   2> 		at java.util.concurrent.Executors$RunnableAdapter.call(Executors.java:471)
[junit4:junit4]   2> 		at java.util.concurrent.FutureTask$Sync.innerRun(FutureTask.java:334)
[junit4:junit4]   2> 		at java.util.concurrent.FutureTask.run(FutureTask.java:166)
[junit4:junit4]   2> 		at java.util.concurrent.ThreadPoolExecutor.runWorker(ThreadPoolExecutor.java:1110)
[junit4:junit4]   2> 		at java.util.concurrent.ThreadPoolExecutor$Worker.run(ThreadPoolExecutor.java:603)
[junit4:junit4]   2> 		... 1 more
[junit4:junit4]   2> 	Caused by: org.apache.http.NoHttpResponseException: The target server failed to respond
[junit4:junit4]   2> 		at org.apache.http.impl.conn.DefaultResponseParser.parseHead(DefaultResponseParser.java:101)
[junit4:junit4]   2> 		at org.apache.http.impl.io.AbstractMessageParser.parse(AbstractMessageParser.java:252)
[junit4:junit4]   2> 		at org.apache.http.impl.AbstractHttpClientConnection.receiveResponseHeader(AbstractHttpClientConnection.java:282)
[junit4:junit4]   2> 		at org.apache.http.impl.conn.DefaultClientConnection.receiveResponseHeader(DefaultClientConnection.java:247)
[junit4:junit4]   2> 		at org.apache.http.impl.conn.AbstractClientConnAdapter.receiveResponseHeader(AbstractClientConnAdapter.java:216)
[junit4:junit4]   2> 		at org.apache.http.protocol.HttpRequestExecutor.doReceiveResponse(HttpRequestExecutor.java:298)
[junit4:junit4]   2> 		at org.apache.http.protocol.HttpRequestExecutor.execute(HttpRequestExecutor.java:125)
[junit4:junit4]   2> 		at org.apache.http.impl.client.DefaultRequestDirector.tryExecute(DefaultRequestDirector.java:647)
[junit4:junit4]   2> 		at org.apache.http.impl.client.DefaultRequestDirector.execute(DefaultRequestDirector.java:464)
[junit4:junit4]   2> 		at org.apache.http.impl.client.AbstractHttpClient.execute(AbstractHttpClient.java:820)
[junit4:junit4]   2> 		at org.apache.http.impl.client.AbstractHttpClient.execute(AbstractHttpClient.java:754)
[junit4:junit4]   2> 		at org.apache.http.impl.client.AbstractHttpClient.execute(AbstractHttpClient.java:732)
[junit4:junit4]   2> 		at org.apache.solr.client.solrj.impl.HttpSolrServer.request(HttpSolrServer.java:353)
[junit4:junit4]   2> 		... 11 more
[junit4:junit4]   2> 	
[junit4:junit4]   2> 201823 T194 C18 REQ [core0] webapp=/example path=/select params={shards=localhost:55281/example/core0,localhost:55281/example/core1&fl=id,s:[shard]&wt=javabin&q=*:*&version=2} status=500 QTime=200082 
[junit4:junit4]   2> 201828 T194 C18 oasc.SolrException.log SEVERE null:org.apache.solr.common.SolrException: org.apache.solr.client.solrj.SolrServerException: IOException occured when talking to server at: http://localhost:55281/example/core0
[junit4:junit4]   2> 		at org.apache.solr.handler.component.SearchHandler.handleRequestBody(SearchHandler.java:300)
[junit4:junit4]   2> 		at org.apache.solr.handler.RequestHandlerBase.handleRequest(RequestHandlerBase.java:129)
[junit4:junit4]   2> 		at org.apache.solr.core.SolrCore.execute(SolrCore.java:1619)
[junit4:junit4]   2> 		at org.apache.solr.servlet.SolrDispatchFilter.execute(SolrDispatchFilter.java:454)
[junit4:junit4]   2> 		at org.apache.solr.servlet.SolrDispatchFilter.doFilter(SolrDispatchFilter.java:275)
[junit4:junit4]   2> 		at org.eclipse.jetty.servlet.ServletHandler$CachedChain.doFilter(ServletHandler.java:1337)
[junit4:junit4]   2> 		at org.eclipse.jetty.servlet.ServletHandler.doHandle(ServletHandler.java:484)
[junit4:junit4]   2> 		at org.eclipse.jetty.server.session.SessionHandler.doHandle(SessionHandler.java:231)
[junit4:junit4]   2> 		at org.eclipse.jetty.server.handler.ScopedHandler.handle(ScopedHandler.java:119)
[junit4:junit4]   2> 		at org.eclipse.jetty.server.handler.GzipHandler.handle(GzipHandler.java:267)
[junit4:junit4]   2> 		at org.eclipse.jetty.server.handler.ContextHandler.doHandle(ContextHandler.java:1067)
[junit4:junit4]   2> 		at org.eclipse.jetty.servlet.ServletHandler.doScope(ServletHandler.java:413)
[junit4:junit4]   2> 		at org.eclipse.jetty.server.session.SessionHandler.doScope(SessionHandler.java:192)
[junit4:junit4]   2> 		at org.eclipse.jetty.server.handler.ContextHandler.doScope(ContextHandler.java:999)
[junit4:junit4]   2> 		at org.eclipse.jetty.server.handler.ScopedHandler.handle(ScopedHandler.java:117)
[junit4:junit4]   2> 		at org.eclipse.jetty.server.handler.HandlerWrapper.handle(HandlerWrapper.java:111)
[junit4:junit4]   2> 		at org.eclipse.jetty.server.Server.handle(Server.java:351)
[junit4:junit4]   2> 		at org.eclipse.jetty.server.AbstractHttpConnection.handleRequest(AbstractHttpConnection.java:454)
[junit4:junit4]   2> 		at org.eclipse.jetty.server.BlockingHttpConnection.handleRequest(BlockingHttpConnection.java:47)
[junit4:junit4]   2> 		at org.eclipse.jetty.server.AbstractHttpConnection.headerComplete(AbstractHttpConnection.java:890)
[junit4:junit4]   2> 		at org.eclipse.jetty.server.AbstractHttpConnection$RequestHandler.headerComplete(AbstractHttpConnection.java:944)
[junit4:junit4]   2> 		at org.eclipse.jetty.http.HttpParser.parseNext(HttpParser.java:634)
[junit4:junit4]   2> 		at org.eclipse.jetty.http.HttpParser.parseAvailable(HttpParser.java:230)
[junit4:junit4]   2> 		at org.eclipse.jetty.server.BlockingHttpConnection.handle(BlockingHttpConnection.java:66)
[junit4:junit4]   2> 		at org.eclipse.jetty.server.bio.SocketConnector$ConnectorEndPoint.run(SocketConnector.java:254)
[junit4:junit4]   2> 		at org.eclipse.jetty.util.thread.QueuedThreadPool.runJob(QueuedThreadPool.java:599)
[junit4:junit4]   2> 		at org.eclipse.jetty.util.thread.QueuedThreadPool$3.run(QueuedThreadPool.java:534)
[junit4:junit4]   2> 		at java.lang.Thread.run(Thread.java:722)
[junit4:junit4]   2> 	Caused by: org.apache.solr.client.solrj.SolrServerException: IOException occured when talking to server at: http://localhost:55281/example/core0
[junit4:junit4]   2> 		at org.apache.solr.client.solrj.impl.HttpSolrServer.request(HttpSolrServer.java:417)
[junit4:junit4]   2> 		at org.apache.solr.client.solrj.impl.HttpSolrServer.request(HttpSolrServer.java:182)
[junit4:junit4]   2> 		at org.apache.solr.handler.component.HttpShardHandler$1.call(HttpShardHandler.java:165)
[junit4:junit4]   2> 		at org.apache.solr.handler.component.HttpShardHandler$1.call(HttpShardHandler.java:132)
[junit4:junit4]   2> 		at java.util.concurrent.FutureTask$Sync.innerRun(FutureTask.java:334)
[junit4:junit4]   2> 		at java.util.concurrent.FutureTask.run(FutureTask.java:166)
[junit4:junit4]   2> 		at java.util.concurrent.Executors$RunnableAdapter.call(Executors.java:471)
[junit4:junit4]   2> 		at java.util.concurrent.FutureTask$Sync.innerRun(FutureTask.java:334)
[junit4:junit4]   2> 		at java.util.concurrent.FutureTask.run(FutureTask.java:166)
[junit4:junit4]   2> 		at java.util.concurrent.ThreadPoolExecutor.runWorker(ThreadPoolExecutor.java:1110)
[junit4:junit4]   2> 		at java.util.concurrent.ThreadPoolExecutor$Worker.run(ThreadPoolExecutor.java:603)
[junit4:junit4]   2> 		... 1 more
[junit4:junit4]   2> 	Caused by: org.apache.http.NoHttpResponseException: The target server failed to respond
[junit4:junit4]   2> 		at org.apache.http.impl.conn.DefaultResponseParser.parseHead(DefaultResponseParser.java:101)
[junit4:junit4]   2> 		at org.apache.http.impl.io.AbstractMessageParser.parse(AbstractMessageParser.java:252)
[junit4:junit4]   2> 		at org.apache.http.impl.AbstractHttpClientConnection.receiveResponseHeader(AbstractHttpClientConnection.java:282)
[junit4:junit4]   2> 		at org.apache.http.impl.conn.DefaultClientConnection.receiveResponseHeader(DefaultClientConnection.java:247)
[junit4:junit4]   2> 		at org.apache.http.impl.conn.AbstractClientConnAdapter.receiveResponseHeader(AbstractClientConnAdapter.java:216)
[junit4:junit4]   2> 		at org.apache.http.protocol.HttpRequestExecutor.doReceiveResponse(HttpRequestExecutor.java:298)
[junit4:junit4]   2> 		at org.apache.http.protocol.HttpRequestExecutor.execute(HttpRequestExecutor.java:125)
[junit4:junit4]   2> 		at org.apache.http.impl.client.DefaultRequestDirector.tryExecute(DefaultRequestDirector.java:647)
[junit4:junit4]   2> 		at org.apache.http.impl.client.DefaultRequestDirector.execute(DefaultRequestDirector.java:464)
[junit4:junit4]   2> 		at org.apache.http.impl.client.AbstractHttpClient.execute(AbstractHttpClient.java:820)
[junit4:junit4]   2> 		at org.apache.http.impl.client.AbstractHttpClient.execute(AbstractHttpClient.java:754)
[junit4:junit4]   2> 		at org.apache.http.impl.client.AbstractHttpClient.execute(AbstractHttpClient.java:732)
[junit4:junit4]   2> 		at org.apache.solr.client.solrj.impl.HttpSolrServer.request(HttpSolrServer.java:353)
[junit4:junit4]   2> 		... 11 more
[junit4:junit4]   2> 	
[junit4:junit4]   2> 201832 T184 oasu.AbstractSolrTestCase.tearDown ####TEARDOWN_START testDistributed
[junit4:junit4]   2> 201833 T184 oasc.CoreContainer.shutdown Shutting down CoreContainer instance=1929078963
[junit4:junit4]   2> 201833 T184 oasc.SolrCore.close [collection1]  CLOSING SolrCore org.apache.solr.core.SolrCore@3176aba9
[junit4:junit4]   2> 201834 T184 oasc.SolrCore.closeSearcher [collection1] Closing main searcher on request.
[junit4:junit4]   2> 201834 T184 oasu.DirectUpdateHandler2.close closing DirectUpdateHandler2{commits=0,autocommits=0,soft autocommits=0,optimizes=0,rollbacks=0,expungeDeletes=0,docsPending=0,adds=0,deletesById=0,deletesByQuery=0,errors=0,cumulative_adds=0,cumulative_deletesById=0,cumulative_deletesByQuery=0,cumulative_errors=0}
[junit4:junit4]   2> 201835 T184 oasc.CoreContainer.shutdown Shutting down CoreContainer instance=1358375881
[junit4:junit4]   2> 201836 T184 oasc.SolrCore.close [core0]  CLOSING SolrCore org.apache.solr.core.SolrCore@54da4f92
[junit4:junit4]   2> 201836 T184 oasc.SolrCore.closeSearcher [core0] Closing main searcher on request.
[junit4:junit4]   2> 201836 T184 oasu.DirectUpdateHandler2.close closing DirectUpdateHandler2{commits=2,autocommits=0,soft autocommits=0,optimizes=0,rollbacks=0,expungeDeletes=0,docsPending=0,adds=0,deletesById=0,deletesByQuery=0,errors=0,cumulative_adds=1,cumulative_deletesById=0,cumulative_deletesByQuery=1,cumulative_errors=0}
[junit4:junit4]   2> 201838 T184 oasc.SolrCore.close [core1]  CLOSING SolrCore org.apache.solr.core.SolrCore@25c6f10
[junit4:junit4]   2> 201838 T184 oasc.SolrCore.closeSearcher [core1] Closing main searcher on request.
[junit4:junit4]   2> 201838 T184 oasu.DirectUpdateHandler2.close closing DirectUpdateHandler2{commits=2,autocommits=0,soft autocommits=0,optimizes=0,rollbacks=0,expungeDeletes=0,docsPending=0,adds=0,deletesById=0,deletesByQuery=0,errors=0,cumulative_adds=1,cumulative_deletesById=0,cumulative_deletesByQuery=1,cumulative_errors=0}
[junit4:junit4]   2> 201840 T184 oejsh.ContextHandler.doStop stopped o.e.j.s.ServletContextHandler{/example,null}
[junit4:junit4]   2> NOTE: reproduce with: ant test  -Dtestcase=MultiCoreExampleJettyTest -Dtests.method=testDistributed -Dtests.seed=4B78A024F9DC07F9 -Dtests.multiplier=3 -Dtests.slow=true -Dtests.locale=sr_ME_#Latn -Dtests.timezone=America/North_Dakota/Center -Dtests.file.encoding=ISO-8859-1
[junit4:junit4]   2>
[junit4:junit4]    > (@AfterClass output)
[junit4:junit4]   2> NOTE: test params are: codec=Lucene40: {id=PostingsFormat(name=SimpleText), _version_=PostingsFormat(name=Lucene40WithOrds), core1=MockFixedIntBlock(blockSize=1678), core0=PostingsFormat(name=MockSep), name=PostingsFormat(name=SimpleText), type=MockFixedIntBlock(blockSize=1678)}, sim=DefaultSimilarity, locale=sr_ME_#Latn, timezone=America/North_Dakota/Center
[junit4:junit4]   2> NOTE: Linux 3.2.0-26-generic amd64/Oracle Corporation 1.7.0_04 (64-bit)/cpus=8,threads=1,free=74529920,total=131072000
[junit4:junit4]   2> NOTE: All tests run in this JVM: [TestLBHttpSolrServer, DocumentAnalysisResponseTest, AnlysisResponseBaseTest, SolrParamTest, SolrDocumentTest, LargeVolumeJettyTest, TestFastInputStream, MergeIndexesEmbeddedTest, TestDocumentObjectBinder, LargeVolumeBinaryJettyTest, MultiCoreExampleJettyTest]
[junit4:junit4]   2> 
[junit4:junit4] Completed on J0 in 201.39s, 2 tests, 1 error <<< FAILURES!

[...truncated 5 lines...]
BUILD FAILED
/mnt/ssd/jenkins/workspace/Lucene-Solr-trunk-Linux-Java7-64/checkout/build.xml:29: The following error occurred while executing this line:
/mnt/ssd/jenkins/workspace/Lucene-Solr-trunk-Linux-Java7-64/checkout/solr/build.xml:151: The following error occurred while executing this line:
/mnt/ssd/jenkins/workspace/Lucene-Solr-trunk-Linux-Java7-64/checkout/lucene/module-build.xml:62: The following error occurred while executing this line:
/mnt/ssd/jenkins/workspace/Lucene-Solr-trunk-Linux-Java7-64/checkout/lucene/common-build.xml:1096: The following error occurred while executing this line:
/mnt/ssd/jenkins/workspace/Lucene-Solr-trunk-Linux-Java7-64/checkout/lucene/common-build.xml:793: There were test failures: 42 suites, 229 tests, 1 error

Total time: 31 minutes 10 seconds
Build step 'Execute shell' marked build as failure
Archiving artifacts
Recording test results
Email was triggered for: Failure
Sending email for trigger: Failure




Mime
View raw message