lucene-dev mailing list archives

Site index · List index
Message view « Date » · « Thread »
Top « Date » · « Thread »
From Policeman Jenkins Server <jenk...@sd-datasolutions.de>
Subject [JENKINS] Lucene-Solr-trunk-Windows-Java6-64 - Build # 862 - Failure!
Date Sun, 22 Jul 2012 14:38:37 GMT
Build: http://jenkins.sd-datasolutions.de/job/Lucene-Solr-trunk-Windows-Java6-64/862/

2 tests failed.
REGRESSION:  org.apache.solr.cloud.LeaderElectionTest.testStressElection

Error Message:
Could not get leader props

Stack Trace:
java.lang.RuntimeException: Could not get leader props
	at __randomizedtesting.SeedInfo.seed([38EA8B00D6E6792E:C7BC5FAEB1A8683D]:0)
	at org.apache.solr.cloud.LeaderElectionTest.getLeaderUrl(LeaderElectionTest.java:212)
	at org.apache.solr.cloud.LeaderElectionTest.getLeaderThread(LeaderElectionTest.java:311)
	at org.apache.solr.cloud.LeaderElectionTest.testStressElection(LeaderElectionTest.java:423)
	at sun.reflect.NativeMethodAccessorImpl.invoke0(Native Method)
	at sun.reflect.NativeMethodAccessorImpl.invoke(NativeMethodAccessorImpl.java:39)
	at sun.reflect.DelegatingMethodAccessorImpl.invoke(DelegatingMethodAccessorImpl.java:25)
	at java.lang.reflect.Method.invoke(Method.java:597)
	at com.carrotsearch.randomizedtesting.RandomizedRunner.invoke(RandomizedRunner.java:1995)
	at com.carrotsearch.randomizedtesting.RandomizedRunner.access$1100(RandomizedRunner.java:132)
	at com.carrotsearch.randomizedtesting.RandomizedRunner$6.evaluate(RandomizedRunner.java:818)
	at com.carrotsearch.randomizedtesting.RandomizedRunner$7.evaluate(RandomizedRunner.java:877)
	at com.carrotsearch.randomizedtesting.RandomizedRunner$8.evaluate(RandomizedRunner.java:891)
	at com.carrotsearch.randomizedtesting.rules.SystemPropertiesRestoreRule$1.evaluate(SystemPropertiesRestoreRule.java:53)
	at org.apache.lucene.util.TestRuleSetupTeardownChained$1.evaluate(TestRuleSetupTeardownChained.java:50)
	at org.apache.lucene.util.TestRuleFieldCacheSanity$1.evaluate(TestRuleFieldCacheSanity.java:32)
	at org.apache.lucene.util.AbstractBeforeAfterRule$1.evaluate(AbstractBeforeAfterRule.java:45)
	at com.carrotsearch.randomizedtesting.rules.SystemPropertiesInvariantRule$1.evaluate(SystemPropertiesInvariantRule.java:55)
	at org.apache.lucene.util.TestRuleReportUncaughtExceptions$1.evaluate(TestRuleReportUncaughtExceptions.java:68)
	at org.apache.lucene.util.TestRuleThreadAndTestName$1.evaluate(TestRuleThreadAndTestName.java:48)
	at org.apache.lucene.util.TestRuleIgnoreAfterMaxFailures$1.evaluate(TestRuleIgnoreAfterMaxFailures.java:70)
	at org.apache.lucene.util.TestRuleMarkFailure$1.evaluate(TestRuleMarkFailure.java:48)
	at com.carrotsearch.randomizedtesting.RandomizedRunner.runSingleTest(RandomizedRunner.java:825)
	at com.carrotsearch.randomizedtesting.RandomizedRunner.access$700(RandomizedRunner.java:132)
	at com.carrotsearch.randomizedtesting.RandomizedRunner$3$1.run(RandomizedRunner.java:671)
	at com.carrotsearch.randomizedtesting.RandomizedRunner$3.evaluate(RandomizedRunner.java:697)
	at com.carrotsearch.randomizedtesting.RandomizedRunner$4.evaluate(RandomizedRunner.java:736)
	at com.carrotsearch.randomizedtesting.RandomizedRunner$5.evaluate(RandomizedRunner.java:747)
	at com.carrotsearch.randomizedtesting.rules.SystemPropertiesRestoreRule$1.evaluate(SystemPropertiesRestoreRule.java:53)
	at org.apache.lucene.util.AbstractBeforeAfterRule$1.evaluate(AbstractBeforeAfterRule.java:45)
	at org.apache.lucene.util.TestRuleReportUncaughtExceptions$1.evaluate(TestRuleReportUncaughtExceptions.java:68)
	at org.apache.lucene.util.TestRuleStoreClassName$1.evaluate(TestRuleStoreClassName.java:38)
	at org.apache.lucene.util.TestRuleIcuHack$1.evaluate(TestRuleIcuHack.java:51)
	at com.carrotsearch.randomizedtesting.rules.SystemPropertiesInvariantRule$1.evaluate(SystemPropertiesInvariantRule.java:55)
	at org.apache.lucene.util.TestRuleNoInstanceHooksOverrides$1.evaluate(TestRuleNoInstanceHooksOverrides.java:53)
	at org.apache.lucene.util.TestRuleNoStaticHooksShadowing$1.evaluate(TestRuleNoStaticHooksShadowing.java:52)
	at org.apache.lucene.util.TestRuleAssertionsRequired$1.evaluate(TestRuleAssertionsRequired.java:36)
	at org.apache.lucene.util.TestRuleMarkFailure$1.evaluate(TestRuleMarkFailure.java:48)
	at org.apache.lucene.util.TestRuleIgnoreAfterMaxFailures$1.evaluate(TestRuleIgnoreAfterMaxFailures.java:70)
	at org.apache.lucene.util.TestRuleIgnoreTestSuites$1.evaluate(TestRuleIgnoreTestSuites.java:55)
	at com.carrotsearch.randomizedtesting.RandomizedRunner.runSuite(RandomizedRunner.java:605)
	at com.carrotsearch.randomizedtesting.RandomizedRunner.access$400(RandomizedRunner.java:132)
	at com.carrotsearch.randomizedtesting.RandomizedRunner$2.run(RandomizedRunner.java:551)


FAILED:  junit.framework.TestSuite.org.apache.solr.cloud.LeaderElectionTest

Error Message:
ERROR: SolrZkClient opens=33 closes=31

Stack Trace:
java.lang.AssertionError: ERROR: SolrZkClient opens=33 closes=31
	at __randomizedtesting.SeedInfo.seed([38EA8B00D6E6792E]:0)
	at org.junit.Assert.fail(Assert.java:93)
	at org.apache.solr.SolrTestCaseJ4.endTrackingZkClients(SolrTestCaseJ4.java:230)
	at org.apache.solr.SolrTestCaseJ4.afterClass(SolrTestCaseJ4.java:83)
	at sun.reflect.GeneratedMethodAccessor15.invoke(Unknown Source)
	at sun.reflect.DelegatingMethodAccessorImpl.invoke(DelegatingMethodAccessorImpl.java:25)
	at java.lang.reflect.Method.invoke(Method.java:597)
	at com.carrotsearch.randomizedtesting.RandomizedRunner.invoke(RandomizedRunner.java:1995)
	at com.carrotsearch.randomizedtesting.RandomizedRunner.access$1100(RandomizedRunner.java:132)
	at com.carrotsearch.randomizedtesting.RandomizedRunner$5.evaluate(RandomizedRunner.java:754)
	at com.carrotsearch.randomizedtesting.rules.SystemPropertiesRestoreRule$1.evaluate(SystemPropertiesRestoreRule.java:53)
	at org.apache.lucene.util.AbstractBeforeAfterRule$1.evaluate(AbstractBeforeAfterRule.java:45)
	at org.apache.lucene.util.TestRuleReportUncaughtExceptions$1.evaluate(TestRuleReportUncaughtExceptions.java:68)
	at org.apache.lucene.util.TestRuleStoreClassName$1.evaluate(TestRuleStoreClassName.java:38)
	at org.apache.lucene.util.TestRuleIcuHack$1.evaluate(TestRuleIcuHack.java:51)
	at com.carrotsearch.randomizedtesting.rules.SystemPropertiesInvariantRule$1.evaluate(SystemPropertiesInvariantRule.java:55)
	at org.apache.lucene.util.TestRuleNoInstanceHooksOverrides$1.evaluate(TestRuleNoInstanceHooksOverrides.java:53)
	at org.apache.lucene.util.TestRuleNoStaticHooksShadowing$1.evaluate(TestRuleNoStaticHooksShadowing.java:52)
	at org.apache.lucene.util.TestRuleAssertionsRequired$1.evaluate(TestRuleAssertionsRequired.java:36)
	at org.apache.lucene.util.TestRuleMarkFailure$1.evaluate(TestRuleMarkFailure.java:48)
	at org.apache.lucene.util.TestRuleIgnoreAfterMaxFailures$1.evaluate(TestRuleIgnoreAfterMaxFailures.java:70)
	at org.apache.lucene.util.TestRuleIgnoreTestSuites$1.evaluate(TestRuleIgnoreTestSuites.java:55)
	at com.carrotsearch.randomizedtesting.RandomizedRunner.runSuite(RandomizedRunner.java:605)
	at com.carrotsearch.randomizedtesting.RandomizedRunner.access$400(RandomizedRunner.java:132)
	at com.carrotsearch.randomizedtesting.RandomizedRunner$2.run(RandomizedRunner.java:551)




Build Log:
[...truncated 6698 lines...]
[junit4:junit4] Suite: org.apache.solr.cloud.LeaderElectionTest
[junit4:junit4]    > (@BeforeClass output)
[junit4:junit4]   2> Creating dataDir: C:\Jenkins\workspace\Lucene-Solr-trunk-Windows-Java6-64\solr\build\solr-core\test\J0\.\solrtest-LeaderElectionTest-1342967462927
[junit4:junit4]   2> 
[junit4:junit4] ERROR   47.1s | LeaderElectionTest.testStressElection
[junit4:junit4]    > Throwable #1: java.lang.RuntimeException: Could not get leader props
[junit4:junit4]    > 	at __randomizedtesting.SeedInfo.seed([38EA8B00D6E6792E:C7BC5FAEB1A8683D]:0)
[junit4:junit4]    > 	at org.apache.solr.cloud.LeaderElectionTest.getLeaderUrl(LeaderElectionTest.java:212)
[junit4:junit4]    > 	at org.apache.solr.cloud.LeaderElectionTest.getLeaderThread(LeaderElectionTest.java:311)
[junit4:junit4]    > 	at org.apache.solr.cloud.LeaderElectionTest.testStressElection(LeaderElectionTest.java:423)
[junit4:junit4]    > 	at sun.reflect.NativeMethodAccessorImpl.invoke0(Native Method)
[junit4:junit4]    > 	at sun.reflect.NativeMethodAccessorImpl.invoke(NativeMethodAccessorImpl.java:39)
[junit4:junit4]    > 	at sun.reflect.DelegatingMethodAccessorImpl.invoke(DelegatingMethodAccessorImpl.java:25)
[junit4:junit4]    > 	at java.lang.reflect.Method.invoke(Method.java:597)
[junit4:junit4]    > 	at com.carrotsearch.randomizedtesting.RandomizedRunner.invoke(RandomizedRunner.java:1995)
[junit4:junit4]    > 	at com.carrotsearch.randomizedtesting.RandomizedRunner.access$1100(RandomizedRunner.java:132)
[junit4:junit4]    > 	at com.carrotsearch.randomizedtesting.RandomizedRunner$6.evaluate(RandomizedRunner.java:818)
[junit4:junit4]    > 	at com.carrotsearch.randomizedtesting.RandomizedRunner$7.evaluate(RandomizedRunner.java:877)
[junit4:junit4]    > 	at com.carrotsearch.randomizedtesting.RandomizedRunner$8.evaluate(RandomizedRunner.java:891)
[junit4:junit4]    > 	at com.carrotsearch.randomizedtesting.rules.SystemPropertiesRestoreRule$1.evaluate(SystemPropertiesRestoreRule.java:53)
[junit4:junit4]    > 	at org.apache.lucene.util.TestRuleSetupTeardownChained$1.evaluate(TestRuleSetupTeardownChained.java:50)
[junit4:junit4]    > 	at org.apache.lucene.util.TestRuleFieldCacheSanity$1.evaluate(TestRuleFieldCacheSanity.java:32)
[junit4:junit4]    > 	at org.apache.lucene.util.AbstractBeforeAfterRule$1.evaluate(AbstractBeforeAfterRule.java:45)
[junit4:junit4]    > 	at com.carrotsearch.randomizedtesting.rules.SystemPropertiesInvariantRule$1.evaluate(SystemPropertiesInvariantRule.java:55)
[junit4:junit4]    > 	at org.apache.lucene.util.TestRuleReportUncaughtExceptions$1.evaluate(TestRuleReportUncaughtExceptions.java:68)
[junit4:junit4]    > 	at org.apache.lucene.util.TestRuleThreadAndTestName$1.evaluate(TestRuleThreadAndTestName.java:48)
[junit4:junit4]    > 	at org.apache.lucene.util.TestRuleIgnoreAfterMaxFailures$1.evaluate(TestRuleIgnoreAfterMaxFailures.java:70)
[junit4:junit4]    > 	at org.apache.lucene.util.TestRuleMarkFailure$1.evaluate(TestRuleMarkFailure.java:48)
[junit4:junit4]    > 	at com.carrotsearch.randomizedtesting.RandomizedRunner.runSingleTest(RandomizedRunner.java:825)
[junit4:junit4]    > 	at com.carrotsearch.randomizedtesting.RandomizedRunner.access$700(RandomizedRunner.java:132)
[junit4:junit4]    > 	at com.carrotsearch.randomizedtesting.RandomizedRunner$3$1.run(RandomizedRunner.java:671)
[junit4:junit4]    > 	at com.carrotsearch.randomizedtesting.RandomizedRunner$3.evaluate(RandomizedRunner.java:697)
[junit4:junit4]    > 	at com.carrotsearch.randomizedtesting.RandomizedRunner$4.evaluate(RandomizedRunner.java:736)
[junit4:junit4]    > 	at com.carrotsearch.randomizedtesting.RandomizedRunner$5.evaluate(RandomizedRunner.java:747)
[junit4:junit4]    > 	at com.carrotsearch.randomizedtesting.rules.SystemPropertiesRestoreRule$1.evaluate(SystemPropertiesRestoreRule.java:53)
[junit4:junit4]    > 	at org.apache.lucene.util.AbstractBeforeAfterRule$1.evaluate(AbstractBeforeAfterRule.java:45)
[junit4:junit4]    > 	at org.apache.lucene.util.TestRuleReportUncaughtExceptions$1.evaluate(TestRuleReportUncaughtExceptions.java:68)
[junit4:junit4]    > 	at org.apache.lucene.util.TestRuleStoreClassName$1.evaluate(TestRuleStoreClassName.java:38)
[junit4:junit4]    > 	at org.apache.lucene.util.TestRuleIcuHack$1.evaluate(TestRuleIcuHack.java:51)
[junit4:junit4]    > 	at com.carrotsearch.randomizedtesting.rules.SystemPropertiesInvariantRule$1.evaluate(SystemPropertiesInvariantRule.java:55)
[junit4:junit4]    > 	at org.apache.lucene.util.TestRuleNoInstanceHooksOverrides$1.evaluate(TestRuleNoInstanceHooksOverrides.java:53)
[junit4:junit4]    > 	at org.apache.lucene.util.TestRuleNoStaticHooksShadowing$1.evaluate(TestRuleNoStaticHooksShadowing.java:52)
[junit4:junit4]    > 	at org.apache.lucene.util.TestRuleAssertionsRequired$1.evaluate(TestRuleAssertionsRequired.java:36)
[junit4:junit4]    > 	at org.apache.lucene.util.TestRuleMarkFailure$1.evaluate(TestRuleMarkFailure.java:48)
[junit4:junit4]    > 	at org.apache.lucene.util.TestRuleIgnoreAfterMaxFailures$1.evaluate(TestRuleIgnoreAfterMaxFailures.java:70)
[junit4:junit4]    > 	at org.apache.lucene.util.TestRuleIgnoreTestSuites$1.evaluate(TestRuleIgnoreTestSuites.java:55)
[junit4:junit4]    > 	at com.carrotsearch.randomizedtesting.RandomizedRunner.runSuite(RandomizedRunner.java:605)
[junit4:junit4]    > 	at com.carrotsearch.randomizedtesting.RandomizedRunner.access$400(RandomizedRunner.java:132)
[junit4:junit4]    > 	at com.carrotsearch.randomizedtesting.RandomizedRunner$2.run(RandomizedRunner.java:551)
[junit4:junit4]    > 
[junit4:junit4]   2> 6 T2206 oas.SolrTestCaseJ4.setUp ###Starting testStressElection
[junit4:junit4]   2> 6 T2206 oasc.ZkTestServer.run STARTING ZK TEST SERVER
[junit4:junit4]   2> 12 T2207 oazs.ZooKeeperServer.setTickTime tickTime set to 1000
[junit4:junit4]   2> 13 T2207 oazs.NIOServerCnxn$Factory.<init> binding to port 0.0.0.0/0.0.0.0:0
[junit4:junit4]   2> 15 T2207 oazsp.FileTxnSnapLog.save Snapshotting: 0
[junit4:junit4]   2> 158 T2206 oaz.ZooKeeper.<init> Initiating client connection, connectString=127.0.0.1:65136 sessionTimeout=10000 watcher=org.apache.solr.common.cloud.ConnectionManager@5380d637
[junit4:junit4]   2> 160 T2212 oaz.ClientCnxn$SendThread.startConnect Opening socket connection to server /127.0.0.1:65136
[junit4:junit4]   2> 162 T2212 oaz.ClientCnxn$SendThread.primeConnection Socket connection established to 127.0.0.1/127.0.0.1:65136, initiating session
[junit4:junit4]   2> 162 T2208 oazs.NIOServerCnxn$Factory.run Accepted socket connection from /127.0.0.1:65139
[junit4:junit4]   2> 163 T2208 oazs.NIOServerCnxn.readConnectRequest Client attempting to establish new session at /127.0.0.1:65139
[junit4:junit4]   2> 163 T2210 oazsp.FileTxnLog.append Creating new log file: log.1
[junit4:junit4]   2> 172 T2210 oazs.NIOServerCnxn.finishSessionInit Established session 0x138af193c1f0000 with negotiated timeout 10000 for client /127.0.0.1:65139
[junit4:junit4]   2> 172 T2212 oaz.ClientCnxn$SendThread.readConnectResult Session establishment complete on server 127.0.0.1/127.0.0.1:65136, sessionid = 0x138af193c1f0000, negotiated timeout = 10000
[junit4:junit4]   2> 172 T2213 oascc.ConnectionManager.process Watcher org.apache.solr.common.cloud.ConnectionManager@5380d637 name:ZooKeeperConnection Watcher:127.0.0.1:65136 got event WatchedEvent state:SyncConnected type:None path:null path:null type:None
[junit4:junit4]   2> 175 T2211 oazs.PrepRequestProcessor.pRequest Processed session termination for sessionid: 0x138af193c1f0000
[junit4:junit4]   2> 177 T2208 oazs.NIOServerCnxn.doIO WARNING EndOfStreamException: Unable to read additional data from client sessionid 0x138af193c1f0000, likely client has closed socket
[junit4:junit4]   2> 177 T2206 oaz.ZooKeeper.close Session: 0x138af193c1f0000 closed
[junit4:junit4]   2> 177 T2208 oazs.NIOServerCnxn.closeSock Closed socket connection for client /127.0.0.1:65139 which had sessionid 0x138af193c1f0000
[junit4:junit4]   2> 177 T2206 oaz.ZooKeeper.<init> Initiating client connection, connectString=127.0.0.1:65136 sessionTimeout=10000 watcher=org.apache.solr.common.cloud.ConnectionManager@3b621193
[junit4:junit4]   2> 177 T2213 oaz.ClientCnxn$EventThread.run EventThread shut down
[junit4:junit4]   2> 179 T2214 oaz.ClientCnxn$SendThread.startConnect Opening socket connection to server /127.0.0.1:65136
[junit4:junit4]   2> 181 T2214 oaz.ClientCnxn$SendThread.primeConnection Socket connection established to 127.0.0.1/127.0.0.1:65136, initiating session
[junit4:junit4]   2> 181 T2208 oazs.NIOServerCnxn$Factory.run Accepted socket connection from /127.0.0.1:65142
[junit4:junit4]   2> 181 T2208 oazs.NIOServerCnxn.readConnectRequest Client attempting to establish new session at /127.0.0.1:65142
[junit4:junit4]   2> 184 T2210 oazs.NIOServerCnxn.finishSessionInit Established session 0x138af193c1f0001 with negotiated timeout 10000 for client /127.0.0.1:65142
[junit4:junit4]   2> 184 T2214 oaz.ClientCnxn$SendThread.readConnectResult Session establishment complete on server 127.0.0.1/127.0.0.1:65136, sessionid = 0x138af193c1f0001, negotiated timeout = 10000
[junit4:junit4]   2> 184 T2215 oascc.ConnectionManager.process Watcher org.apache.solr.common.cloud.ConnectionManager@3b621193 name:ZooKeeperConnection Watcher:127.0.0.1:65136 got event WatchedEvent state:SyncConnected type:None path:null path:null type:None
[junit4:junit4]   2> 184 T2206 oascc.SolrZkClient.makePath makePath: /solr
[junit4:junit4]   2> 190 T2211 oazs.PrepRequestProcessor.pRequest Processed session termination for sessionid: 0x138af193c1f0001
[junit4:junit4]   2> 193 T2206 oaz.ZooKeeper.close Session: 0x138af193c1f0001 closed
[junit4:junit4]   2> 193 T2208 oazs.NIOServerCnxn.doIO WARNING EndOfStreamException: Unable to read additional data from client sessionid 0x138af193c1f0001, likely client has closed socket
[junit4:junit4]   2> 193 T2206 oaz.ZooKeeper.<init> Initiating client connection, connectString=127.0.0.1:65136/solr sessionTimeout=30000 watcher=org.apache.solr.common.cloud.ConnectionManager@3911bda8
[junit4:junit4]   2> 193 T2215 oaz.ClientCnxn$EventThread.run EventThread shut down
[junit4:junit4]   2> 193 T2208 oazs.NIOServerCnxn.closeSock Closed socket connection for client /127.0.0.1:65142 which had sessionid 0x138af193c1f0001
[junit4:junit4]   2> 194 T2216 oaz.ClientCnxn$SendThread.startConnect Opening socket connection to server /127.0.0.1:65136
[junit4:junit4]   2> 195 T2216 oaz.ClientCnxn$SendThread.primeConnection Socket connection established to 127.0.0.1/127.0.0.1:65136, initiating session
[junit4:junit4]   2> 195 T2208 oazs.NIOServerCnxn$Factory.run Accepted socket connection from /127.0.0.1:65145
[junit4:junit4]   2> 195 T2208 oazs.NIOServerCnxn.readConnectRequest Client attempting to establish new session at /127.0.0.1:65145
[junit4:junit4]   2> 198 T2210 oazs.NIOServerCnxn.finishSessionInit Established session 0x138af193c1f0002 with negotiated timeout 20000 for client /127.0.0.1:65145
[junit4:junit4]   2> 198 T2216 oaz.ClientCnxn$SendThread.readConnectResult Session establishment complete on server 127.0.0.1/127.0.0.1:65136, sessionid = 0x138af193c1f0002, negotiated timeout = 20000
[junit4:junit4]   2> 198 T2217 oascc.ConnectionManager.process Watcher org.apache.solr.common.cloud.ConnectionManager@3911bda8 name:ZooKeeperConnection Watcher:127.0.0.1:65136/solr got event WatchedEvent state:SyncConnected type:None path:null path:null type:None
[junit4:junit4]   2> 200 T2206 oaz.ZooKeeper.<init> Initiating client connection, connectString=127.0.0.1:65136/solr sessionTimeout=30000 watcher=org.apache.solr.common.cloud.ConnectionManager@4eb2d325
[junit4:junit4]   2> 201 T2219 oaz.ClientCnxn$SendThread.startConnect Opening socket connection to server /127.0.0.1:65136
[junit4:junit4]   2> 203 T2219 oaz.ClientCnxn$SendThread.primeConnection Socket connection established to 127.0.0.1/127.0.0.1:65136, initiating session
[junit4:junit4]   2> 203 T2208 oazs.NIOServerCnxn$Factory.run Accepted socket connection from /127.0.0.1:65148
[junit4:junit4]   2> 203 T2208 oazs.NIOServerCnxn.readConnectRequest Client attempting to establish new session at /127.0.0.1:65148
[junit4:junit4]   2> 206 T2210 oazs.NIOServerCnxn.finishSessionInit Established session 0x138af193c1f0003 with negotiated timeout 20000 for client /127.0.0.1:65148
[junit4:junit4]   2> 206 T2219 oaz.ClientCnxn$SendThread.readConnectResult Session establishment complete on server 127.0.0.1/127.0.0.1:65136, sessionid = 0x138af193c1f0003, negotiated timeout = 20000
[junit4:junit4]   2> 206 T2220 oascc.ConnectionManager.process Watcher org.apache.solr.common.cloud.ConnectionManager@4eb2d325 name:ZooKeeperConnection Watcher:127.0.0.1:65136/solr got event WatchedEvent state:SyncConnected type:None path:null path:null type:None
[junit4:junit4]   2> 209 T2221 oascc.SolrZkClient.makePath makePath: /collections/collection1/leader_elect/shard1/election
[junit4:junit4]   2> 227 T2221 oascc.SolrZkClient.makePath makePath: /collections/collection1/leaders/shard1
[junit4:junit4]   2> 238 T2211 oazs.PrepRequestProcessor.pRequest Got user-level KeeperException when processing sessionid:0x138af193c1f0003 type:create cxid:0x17 zxid:0xfffffffffffffffe txntype:unknown reqpath:n/a Error Path:/solr/overseer/queue Error:KeeperErrorCode = NoNode for /solr/overseer/queue
[junit4:junit4]   2> 405 T222 oaz.ClientCnxn$SendThread.startConnect Opening socket connection to server 127.0.0.1/127.0.0.1:63596
[junit4:junit4]   2> 985 T2186 oash.SnapPuller.fetchLatestIndex SEVERE Master at: http://localhost:65118/solr is not available. Index fetch failed. Exception: org.apache.solr.client.solrj.SolrServerException: Server refused connection at: http://localhost:65118/solr
[junit4:junit4]   2> 986 T2186 oash.SnapPuller.logReplicationTimeAndConfFiles WARNING Exception while updating statistics java.io.FileNotFoundException: .\org.apache.solr.handler.TestReplicationHandler$SolrInstance-1342967421258\slave\collection1\data\replication.properties (The system cannot find the path specified)
[junit4:junit4]   2> 	at java.io.FileOutputStream.open(Native Method)
[junit4:junit4]   2> 	at java.io.FileOutputStream.<init>(FileOutputStream.java:194)
[junit4:junit4]   2> 	at java.io.FileOutputStream.<init>(FileOutputStream.java:145)
[junit4:junit4]   2> 	at org.apache.solr.handler.SnapPuller.logReplicationTimeAndConfFiles(SnapPuller.java:480)
[junit4:junit4]   2> 	at org.apache.solr.handler.SnapPuller.fetchLatestIndex(SnapPuller.java:406)
[junit4:junit4]   2> 	at org.apache.solr.handler.ReplicationHandler.doFetch(ReplicationHandler.java:297)
[junit4:junit4]   2> 	at org.apache.solr.handler.SnapPuller$1.run(SnapPuller.java:175)
[junit4:junit4]   2> 	at java.util.concurrent.Executors$RunnableAdapter.call(Executors.java:441)
[junit4:junit4]   2> 	at java.util.concurrent.FutureTask$Sync.innerRunAndReset(FutureTask.java:317)
[junit4:junit4]   2> 	at java.util.concurrent.FutureTask.runAndReset(FutureTask.java:150)
[junit4:junit4]   2> 	at java.util.concurrent.ScheduledThreadPoolExecutor$ScheduledFutureTask.access$101(ScheduledThreadPoolExecutor.java:98)
[junit4:junit4]   2> 	at java.util.concurrent.ScheduledThreadPoolExecutor$ScheduledFutureTask.runPeriodic(ScheduledThreadPoolExecutor.java:180)
[junit4:junit4]   2> 	at java.util.concurrent.ScheduledThreadPoolExecutor$ScheduledFutureTask.run(ScheduledThreadPoolExecutor.java:204)
[junit4:junit4]   2> 	at java.util.concurrent.ThreadPoolExecutor$Worker.runTask(ThreadPoolExecutor.java:886)
[junit4:junit4]   2> 	at java.util.concurrent.ThreadPoolExecutor$Worker.run(ThreadPoolExecutor.java:908)
[junit4:junit4]   2> 	at java.lang.Thread.run(Thread.java:662)
[junit4:junit4]   2> 
[junit4:junit4]   2> 1889 T222 oaz.ClientCnxn$SendThread.run WARNING Session 0x138af104e680010 for server null, unexpected error, closing socket connection and attempting reconnect java.net.ConnectException: Connection refused: no further information
[junit4:junit4]   2> 	at sun.nio.ch.SocketChannelImpl.checkConnect(Native Method)
[junit4:junit4]   2> 	at sun.nio.ch.SocketChannelImpl.finishConnect(SocketChannelImpl.java:599)
[junit4:junit4]   2> 	at org.apache.zookeeper.ClientCnxn$SendThread.run(ClientCnxn.java:1143)
[junit4:junit4]   2> 
[junit4:junit4]   2> 3191 T2222 oaz.ZooKeeper.<init> Initiating client connection, connectString=127.0.0.1:65136/solr sessionTimeout=30000 watcher=org.apache.solr.common.cloud.ConnectionManager@2c46492b
[junit4:junit4]   2> 3197 T2226 oaz.ClientCnxn$SendThread.startConnect Opening socket connection to server /127.0.0.1:65136
[junit4:junit4]   2> 3198 T2226 oaz.ClientCnxn$SendThread.primeConnection Socket connection established to 127.0.0.1/127.0.0.1:65136, initiating session
[junit4:junit4]   2> 3198 T2208 oazs.NIOServerCnxn$Factory.run Accepted socket connection from /127.0.0.1:65152
[junit4:junit4]   2> 3198 T2208 oazs.NIOServerCnxn.readConnectRequest Client attempting to establish new session at /127.0.0.1:65152
[junit4:junit4]   2> 3201 T2226 oaz.ClientCnxn$SendThread.readConnectResult Session establishment complete on server 127.0.0.1/127.0.0.1:65136, sessionid = 0x138af193c1f0004, negotiated timeout = 20000
[junit4:junit4]   2> 3201 T2210 oazs.NIOServerCnxn.finishSessionInit Established session 0x138af193c1f0004 with negotiated timeout 20000 for client /127.0.0.1:65152
[junit4:junit4]   2> 3204 T2227 oascc.ConnectionManager.process Watcher org.apache.solr.common.cloud.ConnectionManager@2c46492b name:ZooKeeperConnection Watcher:127.0.0.1:65136/solr got event WatchedEvent state:SyncConnected type:None path:null path:null type:None
[junit4:junit4]   2> 3206 T2222 oaz.ZooKeeper.<init> Initiating client connection, connectString=127.0.0.1:65136/solr sessionTimeout=30000 watcher=org.apache.solr.common.cloud.ConnectionManager@2efe6f97
[junit4:junit4]   2> 3209 T2230 oaz.ClientCnxn$SendThread.startConnect Opening socket connection to server /127.0.0.1:65136
[junit4:junit4]   2> 3209 T2208 oazs.NIOServerCnxn$Factory.run Accepted socket connection from /127.0.0.1:65155
[junit4:junit4]   2> 3210 T2230 oaz.ClientCnxn$SendThread.primeConnection Socket connection established to 127.0.0.1/127.0.0.1:65136, initiating session
[junit4:junit4]   2> 3210 T2208 oazs.NIOServerCnxn.readConnectRequest Client attempting to establish new session at /127.0.0.1:65155
[junit4:junit4]   2> 3214 T2210 oazs.NIOServerCnxn.finishSessionInit Established session 0x138af193c1f0005 with negotiated timeout 20000 for client /127.0.0.1:65155
[junit4:junit4]   2> 3214 T2230 oaz.ClientCnxn$SendThread.readConnectResult Session establishment complete on server 127.0.0.1/127.0.0.1:65136, sessionid = 0x138af193c1f0005, negotiated timeout = 20000
[junit4:junit4]   2> 3214 T2231 oascc.ConnectionManager.process Watcher org.apache.solr.common.cloud.ConnectionManager@2efe6f97 name:ZooKeeperConnection Watcher:127.0.0.1:65136/solr got event WatchedEvent state:SyncConnected type:None path:null path:null type:None
[junit4:junit4]   2> 3216 T2222 oaz.ZooKeeper.<init> Initiating client connection, connectString=127.0.0.1:65136/solr sessionTimeout=30000 watcher=org.apache.solr.common.cloud.ConnectionManager@75eeafbc
[junit4:junit4]   2> 3217 T2211 oazs.PrepRequestProcessor.pRequest Processed session termination for sessionid: 0x138af193c1f0003
[junit4:junit4]   2> 3219 T2234 oaz.ClientCnxn$SendThread.startConnect Opening socket connection to server /127.0.0.1:65136
[junit4:junit4]   2> 3220 T2208 oazs.NIOServerCnxn.closeSock Closed socket connection for client /127.0.0.1:65148 which had sessionid 0x138af193c1f0003
[junit4:junit4]   2> 3220 T2223 oaz.ZooKeeper.close Session: 0x138af193c1f0003 closed
[junit4:junit4]   2> 3220 T2220 oaz.ClientCnxn$EventThread.run EventThread shut down
[junit4:junit4]   2> 3222 T2208 oazs.NIOServerCnxn$Factory.run Accepted socket connection from /127.0.0.1:65158
[junit4:junit4]   2> 3222 T2234 oaz.ClientCnxn$SendThread.primeConnection Socket connection established to 127.0.0.1/127.0.0.1:65136, initiating session
[junit4:junit4]   2> 3222 T2208 oazs.NIOServerCnxn.readConnectRequest Client attempting to establish new session at /127.0.0.1:65158
[junit4:junit4]   2> 3226 T2210 oazs.NIOServerCnxn.finishSessionInit Established session 0x138af193c1f0006 with negotiated timeout 20000 for client /127.0.0.1:65158
[junit4:junit4]   2> 3226 T2234 oaz.ClientCnxn$SendThread.readConnectResult Session establishment complete on server 127.0.0.1/127.0.0.1:65136, sessionid = 0x138af193c1f0006, negotiated timeout = 20000
[junit4:junit4]   2> 3226 T2235 oascc.ConnectionManager.process Watcher org.apache.solr.common.cloud.ConnectionManager@75eeafbc name:ZooKeeperConnection Watcher:127.0.0.1:65136/solr got event WatchedEvent state:SyncConnected type:None path:null path:null type:None
[junit4:junit4]   2> 3227 T2222 oaz.ZooKeeper.<init> Initiating client connection, connectString=127.0.0.1:65136/solr sessionTimeout=30000 watcher=org.apache.solr.common.cloud.ConnectionManager@1a34d0b5
[junit4:junit4]   2> 3229 T2238 oaz.ClientCnxn$SendThread.startConnect Opening socket connection to server /127.0.0.1:65136
[junit4:junit4]   2> 3230 T2238 oaz.ClientCnxn$SendThread.primeConnection Socket connection established to 127.0.0.1/127.0.0.1:65136, initiating session
[junit4:junit4]   2> 3230 T2208 oazs.NIOServerCnxn$Factory.run Accepted socket connection from /127.0.0.1:65161
[junit4:junit4]   2> 3230 T2208 oazs.NIOServerCnxn.readConnectRequest Client attempting to establish new session at /127.0.0.1:65161
[junit4:junit4]   2> 3235 T2210 oazs.NIOServerCnxn.finishSessionInit Established session 0x138af193c1f0007 with negotiated timeout 20000 for client /127.0.0.1:65161
[junit4:junit4]   2> 3235 T2238 oaz.ClientCnxn$SendThread.readConnectResult Session establishment complete on server 127.0.0.1/127.0.0.1:65136, sessionid = 0x138af193c1f0007, negotiated timeout = 20000
[junit4:junit4]   2> 3235 T2239 oascc.ConnectionManager.process Watcher org.apache.solr.common.cloud.ConnectionManager@1a34d0b5 name:ZooKeeperConnection Watcher:127.0.0.1:65136/solr got event WatchedEvent state:SyncConnected type:None path:null path:null type:None
[junit4:junit4]   2> 3236 T2222 oaz.ZooKeeper.<init> Initiating client connection, connectString=127.0.0.1:65136/solr sessionTimeout=30000 watcher=org.apache.solr.common.cloud.ConnectionManager@24984906
[junit4:junit4]   2> 3236 T2211 oazs.PrepRequestProcessor.pRequest Processed session termination for sessionid: 0x138af193c1f0005
[junit4:junit4]   2> 3238 T2242 oaz.ClientCnxn$SendThread.startConnect Opening socket connection to server /127.0.0.1:65136
[junit4:junit4]   2> 3239 T2242 oaz.ClientCnxn$SendThread.primeConnection Socket connection established to 127.0.0.1/127.0.0.1:65136, initiating session
[junit4:junit4]   2> 3239 T2208 oazs.NIOServerCnxn$Factory.run Accepted socket connection from /127.0.0.1:65164
[junit4:junit4]   2> 3241 T2208 oazs.NIOServerCnxn.readConnectRequest Client attempting to establish new session at /127.0.0.1:65164
[junit4:junit4]   2> 3241 T2223 oaz.ZooKeeper.close Session: 0x138af193c1f0005 closed
[junit4:junit4]   2> 3241 T2208 oazs.NIOServerCnxn.doIO WARNING EndOfStreamException: Unable to read additional data from client sessionid 0x138af193c1f0005, likely client has closed socket
[junit4:junit4]   2> 3241 T2231 oaz.ClientCnxn$EventThread.run EventThread shut down
[junit4:junit4]   2> 3242 T2208 oazs.NIOServerCnxn.closeSock Closed socket connection for client /127.0.0.1:65155 which had sessionid 0x138af193c1f0005
[junit4:junit4]   2> 3243 T2210 oazs.NIOServerCnxn.finishSessionInit Established session 0x138af193c1f0008 with negotiated timeout 20000 for client /127.0.0.1:65164
[junit4:junit4]   2> 3243 T2242 oaz.ClientCnxn$SendThread.readConnectResult Session establishment complete on server 127.0.0.1/127.0.0.1:65136, sessionid = 0x138af193c1f0008, negotiated timeout = 20000
[junit4:junit4]   2> 3243 T2243 oascc.ConnectionManager.process Watcher org.apache.solr.common.cloud.ConnectionManager@24984906 name:ZooKeeperConnection Watcher:127.0.0.1:65136/solr got event WatchedEvent state:SyncConnected type:None path:null path:null type:None
[junit4:junit4]   2> 3257 T2211 oazs.PrepRequestProcessor.pRequest Processed session termination for sessionid: 0x138af193c1f0004
[junit4:junit4]   2> 3261 T2223 oaz.ZooKeeper.close Session: 0x138af193c1f0004 closed
[junit4:junit4]   2> 3261 T2227 oaz.ClientCnxn$EventThread.run EventThread shut down
[junit4:junit4]   2> 3261 T2208 oazs.NIOServerCnxn.doIO WARNING EndOfStreamException: Unable to read additional data from client sessionid 0x138af193c1f0004, likely client has closed socket
[junit4:junit4]   2> 3262 T2208 oazs.NIOServerCnxn.closeSock Closed socket connection for client /127.0.0.1:65152 which had sessionid 0x138af193c1f0004
[junit4:junit4]   2> 3268 T2236 oascc.SolrZkClient.makePath makePath: /collections/collection1/leaders/shard1
[junit4:junit4]   2> 3268 T2238 oaz.ClientCnxn$SendThread.run WARNING Session 0x138af193c1f0007 for server 127.0.0.1/127.0.0.1:65136, unexpected error, closing socket connection and attempting reconnect java.nio.channels.ClosedChannelException
[junit4:junit4]   2> 	at sun.nio.ch.SocketChannelImpl.ensureReadOpen(SocketChannelImpl.java:122)
[junit4:junit4]   2> 	at sun.nio.ch.SocketChannelImpl.read(SocketChannelImpl.java:165)
[junit4:junit4]   2> 	at org.apache.zookeeper.ClientCnxn$SendThread.doIO(ClientCnxn.java:856)
[junit4:junit4]   2> 	at org.apache.zookeeper.ClientCnxn$SendThread.run(ClientCnxn.java:1154)
[junit4:junit4]   2> 
[junit4:junit4]   2> 3268 T2208 oazs.NIOServerCnxn.doIO WARNING EndOfStreamException: Unable to read additional data from client sessionid 0x138af193c1f0007, likely client has closed socket
[junit4:junit4]   2> 3270 T2208 oazs.NIOServerCnxn.closeSock Closed socket connection for client /127.0.0.1:65161 which had sessionid 0x138af193c1f0007
[junit4:junit4]   2> 3277 T2211 oazs.PrepRequestProcessor.pRequest Processed session termination for sessionid: 0x138af193c1f0006
[junit4:junit4]   2> 3280 T2223 oaz.ZooKeeper.close Session: 0x138af193c1f0006 closed
[junit4:junit4]   2> 3280 T2235 oaz.ClientCnxn$EventThread.run EventThread shut down
[junit4:junit4]   2> 3280 T2208 oazs.NIOServerCnxn.doIO WARNING EndOfStreamException: Unable to read additional data from client sessionid 0x138af193c1f0006, likely client has closed socket
[junit4:junit4]   2> 3281 T2208 oazs.NIOServerCnxn.closeSock Closed socket connection for client /127.0.0.1:65158 which had sessionid 0x138af193c1f0006
[junit4:junit4]   2> 4194 T222 oaz.ClientCnxn$SendThread.startConnect Opening socket connection to server 127.0.0.1/127.0.0.1:63596
[junit4:junit4]   2> 5690 T222 oaz.ClientCnxn$SendThread.run WARNING Session 0x138af104e680010 for server null, unexpected error, closing socket connection and attempting reconnect java.net.ConnectException: Connection refused: no further information
[junit4:junit4]   2> 	at sun.nio.ch.SocketChannelImpl.checkConnect(Native Method)
[junit4:junit4]   2> 	at sun.nio.ch.SocketChannelImpl.finishConnect(SocketChannelImpl.java:599)
[junit4:junit4]   2> 	at org.apache.zookeeper.ClientCnxn$SendThread.run(ClientCnxn.java:1143)
[junit4:junit4]   2> 
[junit4:junit4]   2> 8032 T222 oaz.ClientCnxn$SendThread.startConnect Opening socket connection to server 127.0.0.1/127.0.0.1:63596
[junit4:junit4]   2> 9362 T222 oaz.ClientCnxn$SendThread.run WARNING Session 0x138af104e680010 for server null, unexpected error, closing socket connection and attempting reconnect java.net.ConnectException: Connection refused: no further information
[junit4:junit4]   2> 	at sun.nio.ch.SocketChannelImpl.checkConnect(Native Method)
[junit4:junit4]   2> 	at sun.nio.ch.SocketChannelImpl.finishConnect(SocketChannelImpl.java:599)
[junit4:junit4]   2> 	at org.apache.zookeeper.ClientCnxn$SendThread.run(ClientCnxn.java:1143)
[junit4:junit4]   2> 
[junit4:junit4]   2> 11167 T222 oaz.ClientCnxn$SendThread.startConnect Opening socket connection to server 127.0.0.1/127.0.0.1:63596
[junit4:junit4]   2> 11713 T2239 oascc.ConnectionManager.process Watcher org.apache.solr.common.cloud.ConnectionManager@1a34d0b5 name:ZooKeeperConnection Watcher:127.0.0.1:65136/solr got event WatchedEvent state:Disconnected type:None path:null path:null type:None
[junit4:junit4]   2> 12517 T222 oaz.ClientCnxn$SendThread.run WARNING Session 0x138af104e680010 for server null, unexpected error, closing socket connection and attempting reconnect java.net.ConnectException: Connection refused: no further information
[junit4:junit4]   2> 	at sun.nio.ch.SocketChannelImpl.checkConnect(Native Method)
[junit4:junit4]   2> 	at sun.nio.ch.SocketChannelImpl.finishConnect(SocketChannelImpl.java:599)
[junit4:junit4]   2> 	at org.apache.zookeeper.ClientCnxn$SendThread.run(ClientCnxn.java:1143)
[junit4:junit4]   2> 
[junit4:junit4]   2> 13743 T2238 oaz.ClientCnxn$SendThread.startConnect Opening socket connection to server 127.0.0.1/127.0.0.1:65136
[junit4:junit4]   2> 13743 T2238 oaz.ClientCnxn$SendThread.primeConnection Socket connection established to 127.0.0.1/127.0.0.1:65136, initiating session
[junit4:junit4]   2> 13743 T2208 oazs.NIOServerCnxn$Factory.run Accepted socket connection from /127.0.0.1:65168
[junit4:junit4]   2> 13745 T2208 oazs.NIOServerCnxn.readConnectRequest Client attempting to renew session 0x138af193c1f0007 at /127.0.0.1:65168
[junit4:junit4]   2> 13745 T2208 oazs.NIOServerCnxn.finishSessionInit Established session 0x138af193c1f0007 with negotiated timeout 20000 for client /127.0.0.1:65168
[junit4:junit4]   2> 13745 T2238 oaz.ClientCnxn$SendThread.readConnectResult Session establishment complete on server 127.0.0.1/127.0.0.1:65136, sessionid = 0x138af193c1f0007, negotiated timeout = 20000
[junit4:junit4]   2> 13746 T2239 oascc.ConnectionManager.process Watcher org.apache.solr.common.cloud.ConnectionManager@1a34d0b5 name:ZooKeeperConnection Watcher:127.0.0.1:65136/solr got event WatchedEvent state:SyncConnected type:None path:null path:null type:None
[junit4:junit4]   2> 14532 T222 oaz.ClientCnxn$SendThread.startConnect Opening socket connection to server 127.0.0.1/127.0.0.1:63596
[junit4:junit4]   2> 15865 T222 oaz.ClientCnxn$SendThread.run WARNING Session 0x138af104e680010 for server null, unexpected error, closing socket connection and attempting reconnect java.net.ConnectException: Connection refused: no further information
[junit4:junit4]   2> 	at sun.nio.ch.SocketChannelImpl.checkConnect(Native Method)
[junit4:junit4]   2> 	at sun.nio.ch.SocketChannelImpl.finishConnect(SocketChannelImpl.java:599)
[junit4:junit4]   2> 	at org.apache.zookeeper.ClientCnxn$SendThread.run(ClientCnxn.java:1143)
[junit4:junit4]   2> 
[junit4:junit4]   2> 17405 T222 oaz.ClientCnxn$SendThread.startConnect Opening socket connection to server 127.0.0.1/127.0.0.1:63596
[junit4:junit4]   2> 18718 T222 oaz.ClientCnxn$SendThread.run WARNING Session 0x138af104e680010 for server null, unexpected error, closing socket connection and attempting reconnect java.net.ConnectException: Connection refused: no further information
[junit4:junit4]   2> 	at sun.nio.ch.SocketChannelImpl.checkConnect(Native Method)
[junit4:junit4]   2> 	at sun.nio.ch.SocketChannelImpl.finishConnect(SocketChannelImpl.java:599)
[junit4:junit4]   2> 	at org.apache.zookeeper.ClientCnxn$SendThread.run(ClientCnxn.java:1143)
[junit4:junit4]   2> 
[junit4:junit4]   2> 21239 T222 oaz.ClientCnxn$SendThread.startConnect Opening socket connection to server 127.0.0.1/127.0.0.1:63596
[junit4:junit4]   2> 22426 T222 oaz.ClientCnxn$SendThread.run WARNING Session 0x138af104e680010 for server null, unexpected error, closing socket connection and attempting reconnect java.net.ConnectException: Connection refused: no further information
[junit4:junit4]   2> 	at sun.nio.ch.SocketChannelImpl.checkConnect(Native Method)
[junit4:junit4]   2> 	at sun.nio.ch.SocketChannelImpl.finishConnect(SocketChannelImpl.java:599)
[junit4:junit4]   2> 	at org.apache.zookeeper.ClientCnxn$SendThread.run(ClientCnxn.java:1143)
[junit4:junit4]   2> 
[junit4:junit4]   2> 24107 T222 oaz.ClientCnxn$SendThread.startConnect Opening socket connection to server 127.0.0.1/127.0.0.1:63596
[junit4:junit4]   2> 25276 T222 oaz.ClientCnxn$SendThread.run WARNING Session 0x138af104e680010 for server null, unexpected error, closing socket connection and attempting reconnect java.net.ConnectException: Connection refused: no further information
[junit4:junit4]   2> 	at sun.nio.ch.SocketChannelImpl.checkConnect(Native Method)
[junit4:junit4]   2> 	at sun.nio.ch.SocketChannelImpl.finishConnect(SocketChannelImpl.java:599)
[junit4:junit4]   2> 	at org.apache.zookeeper.ClientCnxn$SendThread.run(ClientCnxn.java:1143)
[junit4:junit4]   2> 
[junit4:junit4]   2> 27658 T222 oaz.ClientCnxn$SendThread.startConnect Opening socket connection to server 127.0.0.1/127.0.0.1:63596
[junit4:junit4]   2> 28859 T222 oaz.ClientCnxn$SendThread.run WARNING Session 0x138af104e680010 for server null, unexpected error, closing socket connection and attempting reconnect java.net.ConnectException: Connection refused: no further information
[junit4:junit4]   2> 	at sun.nio.ch.SocketChannelImpl.checkConnect(Native Method)
[junit4:junit4]   2> 	at sun.nio.ch.SocketChannelImpl.finishConnect(SocketChannelImpl.java:599)
[junit4:junit4]   2> 	at org.apache.zookeeper.ClientCnxn$SendThread.run(ClientCnxn.java:1143)
[junit4:junit4]   2> 
[junit4:junit4]   2> 30218 T222 oaz.ClientCnxn$SendThread.startConnect Opening socket connection to server 127.0.0.1/127.0.0.1:63596
[junit4:junit4]   2> 31416 T222 oaz.ClientCnxn$SendThread.run WARNING Session 0x138af104e680010 for server null, unexpected error, closing socket connection and attempting reconnect java.net.ConnectException: Connection refused: no further information
[junit4:junit4]   2> 	at sun.nio.ch.SocketChannelImpl.checkConnect(Native Method)
[junit4:junit4]   2> 	at sun.nio.ch.SocketChannelImpl.finishConnect(SocketChannelImpl.java:599)
[junit4:junit4]   2> 	at org.apache.zookeeper.ClientCnxn$SendThread.run(ClientCnxn.java:1143)
[junit4:junit4]   2> 
[junit4:junit4]   2> 33570 T222 oaz.ClientCnxn$SendThread.startConnect Opening socket connection to server 127.0.0.1/127.0.0.1:63596
[junit4:junit4]   2> 34640 T222 oaz.ClientCnxn$SendThread.run WARNING Session 0x138af104e680010 for server null, unexpected error, closing socket connection and attempting reconnect java.net.ConnectException: Connection refused: no further information
[junit4:junit4]   2> 	at sun.nio.ch.SocketChannelImpl.checkConnect(Native Method)
[junit4:junit4]   2> 	at sun.nio.ch.SocketChannelImpl.finishConnect(SocketChannelImpl.java:599)
[junit4:junit4]   2> 	at org.apache.zookeeper.ClientCnxn$SendThread.run(ClientCnxn.java:1143)
[junit4:junit4]   2> 
[junit4:junit4]   2> 36570 T222 oaz.ClientCnxn$SendThread.startConnect Opening socket connection to server 127.0.0.1/127.0.0.1:63596
[junit4:junit4]   2> 37673 T222 oaz.ClientCnxn$SendThread.run WARNING Session 0x138af104e680010 for server null, unexpected error, closing socket connection and attempting reconnect java.net.ConnectException: Connection refused: no further information
[junit4:junit4]   2> 	at sun.nio.ch.SocketChannelImpl.checkConnect(Native Method)
[junit4:junit4]   2> 	at sun.nio.ch.SocketChannelImpl.finishConnect(SocketChannelImpl.java:599)
[junit4:junit4]   2> 	at org.apache.zookeeper.ClientCnxn$SendThread.run(ClientCnxn.java:1143)
[junit4:junit4]   2> 
[junit4:junit4]   2> 39857 T222 oaz.ClientCnxn$SendThread.startConnect Opening socket connection to server 127.0.0.1/127.0.0.1:63596
[junit4:junit4]   2> 40946 T222 oaz.ClientCnxn$SendThread.run WARNING Session 0x138af104e680010 for server null, unexpected error, closing socket connection and attempting reconnect java.net.ConnectException: Connection refused: no further information
[junit4:junit4]   2> 	at sun.nio.ch.SocketChannelImpl.checkConnect(Native Method)
[junit4:junit4]   2> 	at sun.nio.ch.SocketChannelImpl.finishConnect(SocketChannelImpl.java:599)
[junit4:junit4]   2> 	at org.apache.zookeeper.ClientCnxn$SendThread.run(ClientCnxn.java:1143)
[junit4:junit4]   2> 
[junit4:junit4]   2> 42525 T222 oaz.ClientCnxn$SendThread.startConnect Opening socket connection to server 127.0.0.1/127.0.0.1:63596
[junit4:junit4]   2> 43596 T222 oaz.ClientCnxn$SendThread.run WARNING Session 0x138af104e680010 for server null, unexpected error, closing socket connection and attempting reconnect java.net.ConnectException: Connection refused: no further information
[junit4:junit4]   2> 	at sun.nio.ch.SocketChannelImpl.checkConnect(Native Method)
[junit4:junit4]   2> 	at sun.nio.ch.SocketChannelImpl.finishConnect(SocketChannelImpl.java:599)
[junit4:junit4]   2> 	at org.apache.zookeeper.ClientCnxn$SendThread.run(ClientCnxn.java:1143)
[junit4:junit4]   2> 
[junit4:junit4]   2> 44842 T222 oaz.ClientCnxn$SendThread.startConnect Opening socket connection to server 127.0.0.1/127.0.0.1:63596
[junit4:junit4]   2> 44874 T2211 oazs.PrepRequestProcessor.pRequest Processed session termination for sessionid: 0x138af193c1f0002
[junit4:junit4]   2> 44877 T2208 oazs.NIOServerCnxn.closeSock Closed socket connection for client /127.0.0.1:65145 which had sessionid 0x138af193c1f0002
[junit4:junit4]   2> 44877 T2206 oaz.ZooKeeper.close Session: 0x138af193c1f0002 closed
[junit4:junit4]   2> 44877 T2210 oazs.SyncRequestProcessor.run SyncRequestProcessor exited!
[junit4:junit4]   2> 44877 T2206 oazs.FinalRequestProcessor.shutdown shutdown of request processor complete
[junit4:junit4]   2> 44877 T2211 oazs.PrepRequestProcessor.run PrepRequestProcessor exited loop!
[junit4:junit4]   2> 44877 T2217 oaz.ClientCnxn$EventThread.run EventThread shut down
[junit4:junit4]   2> 45052 T2209 oazs.SessionTrackerImpl.run SessionTrackerImpl exited loop!
[junit4:junit4]   2> 45822 T222 oaz.ClientCnxn$SendThread.run WARNING Session 0x138af104e680010 for server null, unexpected error, closing socket connection and attempting reconnect java.net.ConnectException: Connection refused: no further information
[junit4:junit4]   2> 	at sun.nio.ch.SocketChannelImpl.checkConnect(Native Method)
[junit4:junit4]   2> 	at sun.nio.ch.SocketChannelImpl.finishConnect(SocketChannelImpl.java:599)
[junit4:junit4]   2> 	at org.apache.zookeeper.ClientCnxn$SendThread.run(ClientCnxn.java:1143)
[junit4:junit4]   2> 
[junit4:junit4]   2> 47082 T2206 oazs.NIOServerCnxn.closeSock Closed socket connection for client /127.0.0.1:65164 which had sessionid 0x138af193c1f0008
[junit4:junit4]   2> 47083 T2206 oazs.NIOServerCnxn.closeSock Closed socket connection for client /127.0.0.1:65168 which had sessionid 0x138af193c1f0007
[junit4:junit4]   2> 47083 T2208 oazs.NIOServerCnxn$Factory.run NIOServerCnxn factory exited run method
[junit4:junit4]   2> 47083 T2242 oaz.ClientCnxn$SendThread.run Unable to read additional data from server sessionid 0x138af193c1f0008, likely server has closed socket, closing socket connection and attempting reconnect
[junit4:junit4]   2> 47084 T2238 oaz.ClientCnxn$SendThread.run Unable to read additional data from server sessionid 0x138af193c1f0007, likely server has closed socket, closing socket connection and attempting reconnect
[junit4:junit4]   2> 47086 T2206 oazs.FinalRequestProcessor.shutdown shutdown of request processor complete
[junit4:junit4]   2> 47086 T2206 oas.SolrTestCaseJ4.tearDown ###Ending testStressElection
[junit4:junit4]   1> / (2)
[junit4:junit4]   1>  /overseer (1)
[junit4:junit4]   1>  DATA:
[junit4:junit4]   1>      
[junit4:junit4]   1>   /overseer/queue (1)
[junit4:junit4]   1>   DATA:
[junit4:junit4]   1>       
[junit4:junit4]   1>    /overseer/queue/qn-0000000000 (0)
[junit4:junit4]   1>    DATA:
[junit4:junit4]   1>        {
[junit4:junit4]   1>          "operation":"leader",
[junit4:junit4]   1>          "shard":"shard1",
[junit4:junit4]   1>          "core":"",
[junit4:junit4]   1>          "collection":"collection1",
[junit4:junit4]   1>          "base_url":"0"}
[junit4:junit4]   1>  /collections (1)
[junit4:junit4]   1>   /collections/collection1 (2)
[junit4:junit4]   1>    /collections/collection1/leader_elect (1)
[junit4:junit4]   1>     /collections/collection1/leader_elect/shard1 (1)
[junit4:junit4]   1>      /collections/collection1/leader_elect/shard1/election (2)
[junit4:junit4]   1>       /collections/collection1/leader_elect/shard1/election/88012715651432456-5-n_0000000003 (0)
[junit4:junit4]   1>       /collections/collection1/leader_elect/shard1/election/88012715651432455-4-n_0000000002 (0)
[junit4:junit4]   1>    /collections/collection1/leaders (0)
[junit4:junit4]   1> 
[junit4:junit4]   2> NOTE: reproduce with: ant test  -Dtestcase=LeaderElectionTest -Dtests.method=testStressElection -Dtests.seed=38EA8B00D6E6792E -Dtests.slow=true -Dtests.locale=sr_RS -Dtests.timezone=Brazil/DeNoronha -Dtests.file.encoding=US-ASCII
[junit4:junit4]   1> 
[junit4:junit4]   2>
[junit4:junit4]    > (@AfterClass output)
[junit4:junit4]   2> 58409 T2206 oas.SolrTestCaseJ4.deleteCore ###deleteCore
[junit4:junit4]   2> 58414 T2206 oas.SolrTestCaseJ4.endTrackingZkClients SEVERE ERROR: SolrZkClient opens=33 closes=31
[junit4:junit4]   2> NOTE: test params are: codec=Lucene40: {}, sim=DefaultSimilarity, locale=sr_RS, timezone=Brazil/DeNoronha
[junit4:junit4]   2> NOTE: Windows 7 6.1 amd64/Sun Microsystems Inc. 1.6.0_33 (64-bit)/cpus=2,threads=5,free=62571024,total=260833280
[junit4:junit4]   2> NOTE: All tests run in this JVM: [TestNGramFilters, TestFiltering, TestLatvianStemFilterFactory, HighlighterConfigTest, TestCollationField, TestGalicianStemFilterFactory, TestIndonesianStemFilterFactory, TestPropInject, FullSolrCloudTest, TestIBSimilarityFactory, RequiredFieldsTest, TestGermanStemFilterFactory, TestFinnishLightStemFilterFactory, TestShingleFilterFactory, LeaderElectionIntegrationTest, TestJoin, TestStopFilterFactory, SimpleFacetsTest, TestJmxIntegration, SuggesterTest, OpenExchangeRatesOrgProviderTest, LoggingHandlerTest, TestMultiWordSynonyms, IndexSchemaRuntimeFieldTest, TestSolrQueryParser, QueryEqualityTest, TestHTMLStripCharFilterFactory, TermVectorComponentTest, TestPortugueseStemFilterFactory, TestUtils, TestGermanLightStemFilterFactory, TestRemoteStreaming, TestLRUCache, NoCacheHeaderTest, RAMDirectoryFactoryTest, OutputWriterTest, DirectUpdateHandlerTest, TestItalianLightStemFilterFactory, URLClassifyProcessorTest, BasicZkTest, TestReversedWildcardFilterFactory, CommonGramsQueryFilterFactoryTest, StatelessScriptUpdateProcessorFactoryTest, TestSurroundQueryParser, PolyFieldTest, TestQueryUtils, TestConfig, AnalysisAfterCoreReloadTest, DirectUpdateHandlerOptimizeTest, TestKeepFilterFactory, TestPorterStemFilterFactory, TestMappingCharFilterFactory, SolrInfoMBeanTest, TestMergePolicyConfig, TestUAX29URLEmailTokenizerFactory, FileUtilsTest, TestQueryTypes, SuggesterTSTTest, DistributedSpellCheckComponentTest, TestBrazilianStemFilterFactory, TestJapaneseBaseFormFilterFactory, ResourceLoaderTest, TestFastLRUCache, WordBreakSolrSpellCheckerTest, PeerSyncTest, TestCSVLoader, DateFieldTest, TestDefaultSimilarityFactory, DebugComponentTest, TestCapitalizationFilterFactory, BasicDistributedZkTest, MoreLikeThisHandlerTest, TestJapaneseKatakanaStemFilterFactory, DoubleMetaphoneFilterFactoryTest, TestMultiCoreConfBootstrap, TestEnglishMinimalStemFilterFactory, BadComponentTest, UUIDFieldTest, TestCzechStemFilterFactory, DateMathParserTest, TestSuggestSpellingConverter, TestHunspellStemFilterFactory, SolrIndexConfigTest, QueryElevationComponentTest, SolrCoreTest, SpellPossibilityIteratorTest, TestFunctionQuery, TestPersianNormalizationFilterFactory, TestKeywordMarkerFilterFactory, RequestHandlersTest, TestDFRSimilarityFactory, TestDocSet, TestIndexSearcher, CircularListTest, SuggesterFSTTest, TestRangeQuery, TestXIncludeConfig, TestPhraseSuggestions, CacheHeaderTest, TestLMDirichletSimilarityFactory, TestPhoneticFilterFactory, SoftAutoCommitTest, JSONWriterTest, TestSolrJ, StandardRequestHandlerTest, BinaryUpdateRequestHandlerTest, TestSystemIdResolver, EchoParamsTest, CurrencyFieldTest, TestSynonymFilterFactory, TestFrenchLightStemFilterFactory, PreAnalyzedFieldTest, UniqFieldsUpdateProcessorFactoryTest, SOLR749Test, TestArbitraryIndexDir, TestKStemFilterFactory, OverseerTest, TestCoreContainer, UpdateParamsTest, TestFrenchMinimalStemFilterFactory, MinimalSchemaTest, FastVectorHighlighterTest, LegacyHTMLStripCharFilterTest, DirectSolrConnectionTest, TestNorwegianLightStemFilterFactory, TestSolrDeletionPolicy1, TestBeiderMorseFilterFactory, TestThaiWordFilterFactory, TestSwedishLightStemFilterFactory, TestHindiFilters, XsltUpdateRequestHandlerTest, TestCJKBigramFilterFactory, SortByFunctionTest, DistributedTermsComponentTest, NumericFieldsTest, TestGermanMinimalStemFilterFactory, TestOmitPositions, ZkControllerTest, ZkCLITest, CopyFieldTest, FieldMutatingUpdateProcessorTest, RecoveryZkTest, SpellCheckComponentTest, FullSolrCloudDistribCmdsTest, TestReplicationHandler, LeaderElectionTest]
[junit4:junit4]   2> NOTE: reproduce with: ant test  -Dtestcase=LeaderElectionTest -Dtests.seed=38EA8B00D6E6792E -Dtests.slow=true -Dtests.locale=sr_RS -Dtests.timezone=Brazil/DeNoronha -Dtests.file.encoding=US-ASCII
[junit4:junit4]   2> 
[junit4:junit4] ERROR   0.00s | LeaderElectionTest (suite)
[junit4:junit4]    > Throwable #1: java.lang.AssertionError: ERROR: SolrZkClient opens=33 closes=31
[junit4:junit4]    > 	at __randomizedtesting.SeedInfo.seed([38EA8B00D6E6792E]:0)
[junit4:junit4]    > 	at org.junit.Assert.fail(Assert.java:93)
[junit4:junit4]    > 	at org.apache.solr.SolrTestCaseJ4.endTrackingZkClients(SolrTestCaseJ4.java:230)
[junit4:junit4]    > 	at org.apache.solr.SolrTestCaseJ4.afterClass(SolrTestCaseJ4.java:83)
[junit4:junit4]    > 	at sun.reflect.GeneratedMethodAccessor15.invoke(Unknown Source)
[junit4:junit4]    > 	at sun.reflect.DelegatingMethodAccessorImpl.invoke(DelegatingMethodAccessorImpl.java:25)
[junit4:junit4]    > 	at java.lang.reflect.Method.invoke(Method.java:597)
[junit4:junit4]    > 	at com.carrotsearch.randomizedtesting.RandomizedRunner.invoke(RandomizedRunner.java:1995)
[junit4:junit4]    > 	at com.carrotsearch.randomizedtesting.RandomizedRunner.access$1100(RandomizedRunner.java:132)
[junit4:junit4]    > 	at com.carrotsearch.randomizedtesting.RandomizedRunner$5.evaluate(RandomizedRunner.java:754)
[junit4:junit4]    > 	at com.carrotsearch.randomizedtesting.rules.SystemPropertiesRestoreRule$1.evaluate(SystemPropertiesRestoreRule.java:53)
[junit4:junit4]    > 	at org.apache.lucene.util.AbstractBeforeAfterRule$1.evaluate(AbstractBeforeAfterRule.java:45)
[junit4:junit4]    > 	at org.apache.lucene.util.TestRuleReportUncaughtExceptions$1.evaluate(TestRuleReportUncaughtExceptions.java:68)
[junit4:junit4]    > 	at org.apache.lucene.util.TestRuleStoreClassName$1.evaluate(TestRuleStoreClassName.java:38)
[junit4:junit4]    > 	at org.apache.lucene.util.TestRuleIcuHack$1.evaluate(TestRuleIcuHack.java:51)
[junit4:junit4]    > 	at com.carrotsearch.randomizedtesting.rules.SystemPropertiesInvariantRule$1.evaluate(SystemPropertiesInvariantRule.java:55)
[junit4:junit4]    > 	at org.apache.lucene.util.TestRuleNoInstanceHooksOverrides$1.evaluate(TestRuleNoInstanceHooksOverrides.java:53)
[junit4:junit4]    > 	at org.apache.lucene.util.TestRuleNoStaticHooksShadowing$1.evaluate(TestRuleNoStaticHooksShadowing.java:52)
[junit4:junit4]    > 	at org.apache.lucene.util.TestRuleAssertionsRequired$1.evaluate(TestRuleAssertionsRequired.java:36)
[junit4:junit4]    > 	at org.apache.lucene.util.TestRuleMarkFailure$1.evaluate(TestRuleMarkFailure.java:48)
[junit4:junit4]    > 	at org.apache.lucene.util.TestRuleIgnoreAfterMaxFailures$1.evaluate(TestRuleIgnoreAfterMaxFailures.java:70)
[junit4:junit4]    > 	at org.apache.lucene.util.TestRuleIgnoreTestSuites$1.evaluate(TestRuleIgnoreTestSuites.java:55)
[junit4:junit4]    > 	at com.carrotsearch.randomizedtesting.RandomizedRunner.runSuite(RandomizedRunner.java:605)
[junit4:junit4]    > 	at com.carrotsearch.randomizedtesting.RandomizedRunner.access$400(RandomizedRunner.java:132)
[junit4:junit4]    > 	at com.carrotsearch.randomizedtesting.RandomizedRunner$2.run(RandomizedRunner.java:551)
[junit4:junit4]    >
[junit4:junit4] Completed in 58.43s, 4 tests, 1 failure, 1 error <<< FAILURES!

[...truncated 440 lines...]
BUILD FAILED
C:\Jenkins\workspace\Lucene-Solr-trunk-Windows-Java6-64\build.xml:29: The following error occurred while executing this line:
C:\Jenkins\workspace\Lucene-Solr-trunk-Windows-Java6-64\solr\build.xml:144: The following error occurred while executing this line:
C:\Jenkins\workspace\Lucene-Solr-trunk-Windows-Java6-64\lucene\module-build.xml:62: The following error occurred while executing this line:
C:\Jenkins\workspace\Lucene-Solr-trunk-Windows-Java6-64\lucene\common-build.xml:1094: The following error occurred while executing this line:
C:\Jenkins\workspace\Lucene-Solr-trunk-Windows-Java6-64\lucene\common-build.xml:789: There were test failures: 296 suites, 1052 tests, 1 suite-level error, 1 error, 10 ignored (5 assumptions)

Total time: 34 minutes 22 seconds
Build step 'Invoke Ant' marked build as failure
Recording test results
Email was triggered for: Failure
Sending email for trigger: Failure




Mime
View raw message