lucene-dev mailing list archives

Site index · List index
Message view « Date » · « Thread »
Top « Date » · « Thread »
From Policeman Jenkins Server <jenk...@sd-datasolutions.de>
Subject [JENKINS] Lucene-Solr-trunk-Linux-Java8-64 - Build # 10 - Still Failing!
Date Sun, 08 Jul 2012 20:35:41 GMT
Build: http://jenkins.sd-datasolutions.de/job/Lucene-Solr-trunk-Linux-Java8-64/10/

2 tests failed.
REGRESSION:  org.apache.solr.handler.component.SpellCheckComponentTest.testPerDictionary

Error Message:
mismatch: '0'!='2' @ spellcheck/suggestions/bar/startOffset

Stack Trace:
java.lang.RuntimeException: mismatch: '0'!='2' @ spellcheck/suggestions/bar/startOffset
	at __randomizedtesting.SeedInfo.seed([89133562CE447602:4E1DC1CAC628634A]:0)
	at org.apache.solr.SolrTestCaseJ4.assertJQ(SolrTestCaseJ4.java:573)
	at org.apache.solr.SolrTestCaseJ4.assertJQ(SolrTestCaseJ4.java:521)
	at org.apache.solr.handler.component.SpellCheckComponentTest.testPerDictionary(SpellCheckComponentTest.java:102)
	at sun.reflect.NativeMethodAccessorImpl.invoke0(Native Method)
	at sun.reflect.NativeMethodAccessorImpl.invoke(NativeMethodAccessorImpl.java:57)
	at sun.reflect.DelegatingMethodAccessorImpl.invoke(DelegatingMethodAccessorImpl.java:43)
	at java.lang.reflect.Method.invoke(Method.java:474)
	at com.carrotsearch.randomizedtesting.RandomizedRunner.invoke(RandomizedRunner.java:1995)
	at com.carrotsearch.randomizedtesting.RandomizedRunner.access$1100(RandomizedRunner.java:132)
	at com.carrotsearch.randomizedtesting.RandomizedRunner$6.evaluate(RandomizedRunner.java:818)
	at com.carrotsearch.randomizedtesting.RandomizedRunner$7.evaluate(RandomizedRunner.java:877)
	at com.carrotsearch.randomizedtesting.RandomizedRunner$8.evaluate(RandomizedRunner.java:891)
	at com.carrotsearch.randomizedtesting.rules.SystemPropertiesRestoreRule$1.evaluate(SystemPropertiesRestoreRule.java:53)
	at org.apache.lucene.util.TestRuleSetupTeardownChained$1.evaluate(TestRuleSetupTeardownChained.java:50)
	at org.apache.lucene.util.TestRuleFieldCacheSanity$1.evaluate(TestRuleFieldCacheSanity.java:32)
	at org.apache.lucene.util.AbstractBeforeAfterRule$1.evaluate(AbstractBeforeAfterRule.java:45)
	at com.carrotsearch.randomizedtesting.rules.SystemPropertiesInvariantRule$1.evaluate(SystemPropertiesInvariantRule.java:55)
	at org.apache.lucene.util.TestRuleReportUncaughtExceptions$1.evaluate(TestRuleReportUncaughtExceptions.java:68)
	at org.apache.lucene.util.TestRuleThreadAndTestName$1.evaluate(TestRuleThreadAndTestName.java:48)
	at org.apache.lucene.util.TestRuleIgnoreAfterMaxFailures$1.evaluate(TestRuleIgnoreAfterMaxFailures.java:70)
	at org.apache.lucene.util.TestRuleMarkFailure$1.evaluate(TestRuleMarkFailure.java:48)
	at com.carrotsearch.randomizedtesting.RandomizedRunner.runSingleTest(RandomizedRunner.java:825)
	at com.carrotsearch.randomizedtesting.RandomizedRunner.access$700(RandomizedRunner.java:132)
	at com.carrotsearch.randomizedtesting.RandomizedRunner$3$1.run(RandomizedRunner.java:671)
	at com.carrotsearch.randomizedtesting.RandomizedRunner$3.evaluate(RandomizedRunner.java:697)
	at com.carrotsearch.randomizedtesting.RandomizedRunner$4.evaluate(RandomizedRunner.java:736)
	at com.carrotsearch.randomizedtesting.RandomizedRunner$5.evaluate(RandomizedRunner.java:747)
	at com.carrotsearch.randomizedtesting.rules.SystemPropertiesRestoreRule$1.evaluate(SystemPropertiesRestoreRule.java:53)
	at org.apache.lucene.util.AbstractBeforeAfterRule$1.evaluate(AbstractBeforeAfterRule.java:45)
	at org.apache.lucene.util.TestRuleReportUncaughtExceptions$1.evaluate(TestRuleReportUncaughtExceptions.java:68)
	at org.apache.lucene.util.TestRuleStoreClassName$1.evaluate(TestRuleStoreClassName.java:38)
	at org.apache.lucene.util.TestRuleIcuHack$1.evaluate(TestRuleIcuHack.java:51)
	at com.carrotsearch.randomizedtesting.rules.SystemPropertiesInvariantRule$1.evaluate(SystemPropertiesInvariantRule.java:55)
	at org.apache.lucene.util.TestRuleNoInstanceHooksOverrides$1.evaluate(TestRuleNoInstanceHooksOverrides.java:53)
	at org.apache.lucene.util.TestRuleNoStaticHooksShadowing$1.evaluate(TestRuleNoStaticHooksShadowing.java:52)
	at org.apache.lucene.util.TestRuleAssertionsRequired$1.evaluate(TestRuleAssertionsRequired.java:36)
	at org.apache.lucene.util.TestRuleMarkFailure$1.evaluate(TestRuleMarkFailure.java:48)
	at org.apache.lucene.util.TestRuleIgnoreAfterMaxFailures$1.evaluate(TestRuleIgnoreAfterMaxFailures.java:70)
	at org.apache.lucene.util.TestRuleIgnoreTestSuites$1.evaluate(TestRuleIgnoreTestSuites.java:55)
	at com.carrotsearch.randomizedtesting.RandomizedRunner.runSuite(RandomizedRunner.java:605)
	at com.carrotsearch.randomizedtesting.RandomizedRunner.access$400(RandomizedRunner.java:132)
	at com.carrotsearch.randomizedtesting.RandomizedRunner$2.run(RandomizedRunner.java:551)


FAILED:  org.apache.solr.handler.component.DistributedQueryElevationComponentTest.testDistribSearch

Error Message:
Index: 18, Size: 18

Stack Trace:
java.lang.IndexOutOfBoundsException: Index: 18, Size: 18
	at __randomizedtesting.SeedInfo.seed([89133562CE447602:8F5BB7AB91B163E]:0)
	at java.util.ArrayList.rangeCheck(ArrayList.java:603)
	at java.util.ArrayList.get(ArrayList.java:381)
	at org.apache.solr.common.util.NamedList.getName(NamedList.java:127)
	at org.apache.solr.BaseDistributedSearchTestCase.compare(BaseDistributedSearchTestCase.java:466)
	at org.apache.solr.BaseDistributedSearchTestCase.compare(BaseDistributedSearchTestCase.java:612)
	at org.apache.solr.BaseDistributedSearchTestCase.compare(BaseDistributedSearchTestCase.java:500)
	at org.apache.solr.BaseDistributedSearchTestCase.compare(BaseDistributedSearchTestCase.java:612)
	at org.apache.solr.BaseDistributedSearchTestCase.compare(BaseDistributedSearchTestCase.java:500)
	at org.apache.solr.BaseDistributedSearchTestCase.compareResponses(BaseDistributedSearchTestCase.java:667)
	at org.apache.solr.BaseDistributedSearchTestCase.query(BaseDistributedSearchTestCase.java:392)
	at org.apache.solr.handler.component.DistributedQueryElevationComponentTest.doTest(DistributedQueryElevationComponentTest.java:81)
	at org.apache.solr.BaseDistributedSearchTestCase.testDistribSearch(BaseDistributedSearchTestCase.java:679)
	at sun.reflect.NativeMethodAccessorImpl.invoke0(Native Method)
	at sun.reflect.NativeMethodAccessorImpl.invoke(NativeMethodAccessorImpl.java:57)
	at sun.reflect.DelegatingMethodAccessorImpl.invoke(DelegatingMethodAccessorImpl.java:43)
	at java.lang.reflect.Method.invoke(Method.java:474)
	at com.carrotsearch.randomizedtesting.RandomizedRunner.invoke(RandomizedRunner.java:1995)
	at com.carrotsearch.randomizedtesting.RandomizedRunner.access$1100(RandomizedRunner.java:132)
	at com.carrotsearch.randomizedtesting.RandomizedRunner$6.evaluate(RandomizedRunner.java:818)
	at com.carrotsearch.randomizedtesting.RandomizedRunner$7.evaluate(RandomizedRunner.java:877)
	at com.carrotsearch.randomizedtesting.RandomizedRunner$8.evaluate(RandomizedRunner.java:891)
	at com.carrotsearch.randomizedtesting.rules.SystemPropertiesRestoreRule$1.evaluate(SystemPropertiesRestoreRule.java:53)
	at org.apache.lucene.util.TestRuleSetupTeardownChained$1.evaluate(TestRuleSetupTeardownChained.java:50)
	at org.apache.lucene.util.TestRuleFieldCacheSanity$1.evaluate(TestRuleFieldCacheSanity.java:32)
	at org.apache.lucene.util.AbstractBeforeAfterRule$1.evaluate(AbstractBeforeAfterRule.java:45)
	at com.carrotsearch.randomizedtesting.rules.SystemPropertiesInvariantRule$1.evaluate(SystemPropertiesInvariantRule.java:55)
	at org.apache.lucene.util.TestRuleReportUncaughtExceptions$1.evaluate(TestRuleReportUncaughtExceptions.java:68)
	at org.apache.lucene.util.TestRuleThreadAndTestName$1.evaluate(TestRuleThreadAndTestName.java:48)
	at org.apache.lucene.util.TestRuleIgnoreAfterMaxFailures$1.evaluate(TestRuleIgnoreAfterMaxFailures.java:70)
	at org.apache.lucene.util.TestRuleMarkFailure$1.evaluate(TestRuleMarkFailure.java:48)
	at com.carrotsearch.randomizedtesting.RandomizedRunner.runSingleTest(RandomizedRunner.java:825)
	at com.carrotsearch.randomizedtesting.RandomizedRunner.access$700(RandomizedRunner.java:132)
	at com.carrotsearch.randomizedtesting.RandomizedRunner$3$1.run(RandomizedRunner.java:671)
	at com.carrotsearch.randomizedtesting.RandomizedRunner$3.evaluate(RandomizedRunner.java:697)
	at com.carrotsearch.randomizedtesting.RandomizedRunner$4.evaluate(RandomizedRunner.java:736)
	at com.carrotsearch.randomizedtesting.RandomizedRunner$5.evaluate(RandomizedRunner.java:747)
	at com.carrotsearch.randomizedtesting.rules.SystemPropertiesRestoreRule$1.evaluate(SystemPropertiesRestoreRule.java:53)
	at org.apache.lucene.util.AbstractBeforeAfterRule$1.evaluate(AbstractBeforeAfterRule.java:45)
	at org.apache.lucene.util.TestRuleReportUncaughtExceptions$1.evaluate(TestRuleReportUncaughtExceptions.java:68)
	at org.apache.lucene.util.TestRuleStoreClassName$1.evaluate(TestRuleStoreClassName.java:38)
	at org.apache.lucene.util.TestRuleIcuHack$1.evaluate(TestRuleIcuHack.java:51)
	at com.carrotsearch.randomizedtesting.rules.SystemPropertiesInvariantRule$1.evaluate(SystemPropertiesInvariantRule.java:55)
	at org.apache.lucene.util.TestRuleNoInstanceHooksOverrides$1.evaluate(TestRuleNoInstanceHooksOverrides.java:53)
	at org.apache.lucene.util.TestRuleNoStaticHooksShadowing$1.evaluate(TestRuleNoStaticHooksShadowing.java:52)
	at org.apache.lucene.util.TestRuleAssertionsRequired$1.evaluate(TestRuleAssertionsRequired.java:36)
	at org.apache.lucene.util.TestRuleMarkFailure$1.evaluate(TestRuleMarkFailure.java:48)
	at org.apache.lucene.util.TestRuleIgnoreAfterMaxFailures$1.evaluate(TestRuleIgnoreAfterMaxFailures.java:70)
	at org.apache.lucene.util.TestRuleIgnoreTestSuites$1.evaluate(TestRuleIgnoreTestSuites.java:55)
	at com.carrotsearch.randomizedtesting.RandomizedRunner.runSuite(RandomizedRunner.java:605)
	at com.carrotsearch.randomizedtesting.RandomizedRunner.access$400(RandomizedRunner.java:132)
	at com.carrotsearch.randomizedtesting.RandomizedRunner$2.run(RandomizedRunner.java:551)




Build Log:
[...truncated 7932 lines...]
[junit4:junit4] Suite: org.apache.solr.handler.component.SpellCheckComponentTest
[junit4:junit4]    > (@BeforeClass output)
[junit4:junit4]   2> 0 T931 oas.SolrTestCaseJ4.initCore ####initCore
[junit4:junit4]   2> Creating dataDir: /mnt/ssd/jenkins/workspace/Lucene-Solr-trunk-Linux-Java8-64/checkout/solr/build/solr-core/test/J0/./solrtest-SpellCheckComponentTest-1341779606111
[junit4:junit4]   2> 1 T931 oasc.SolrResourceLoader.<init> new SolrResourceLoader for directory: '/mnt/ssd/jenkins/workspace/Lucene-Solr-trunk-Linux-Java8-64/checkout/solr/build/solr-core/test-files/solr/collection1/'
[junit4:junit4]   2> 1 T931 oasc.SolrResourceLoader.replaceClassLoader Adding 'file:/mnt/ssd/jenkins/workspace/Lucene-Solr-trunk-Linux-Java8-64/checkout/solr/build/solr-core/test-files/solr/collection1/lib/README' to classloader
[junit4:junit4]   2> 1 T931 oasc.SolrResourceLoader.replaceClassLoader Adding 'file:/mnt/ssd/jenkins/workspace/Lucene-Solr-trunk-Linux-Java8-64/checkout/solr/build/solr-core/test-files/solr/collection1/lib/classes/' to classloader
[junit4:junit4]   2> 21 T931 oasc.SolrConfig.<init> Using Lucene MatchVersion: LUCENE_50
[junit4:junit4]   2> 51 T931 oasc.SolrConfig.<init> Loaded SolrConfig: solrconfig-spellcheckcomponent.xml
[junit4:junit4]   2> 52 T931 oass.IndexSchema.readSchema Reading Solr Schema
[junit4:junit4]   2> 55 T931 oass.IndexSchema.readSchema Schema name=test
[junit4:junit4]   2> 395 T931 oass.OpenExchangeRatesOrgProvider.init Initialized with rates=open-exchange-rates.json, refreshInterval=1440.
[junit4:junit4]   2> 402 T931 oass.IndexSchema.readSchema default search field in schema is text
[junit4:junit4]   2> 405 T931 oass.IndexSchema.readSchema unique key field: id
[junit4:junit4]   2> 409 T931 oass.FileExchangeRateProvider.reload Reloading exchange rates from file currency.xml
[junit4:junit4]   2> 411 T931 oass.FileExchangeRateProvider.reload Reloading exchange rates from file currency.xml
[junit4:junit4]   2> 413 T931 oass.OpenExchangeRatesOrgProvider.reload Reloading exchange rates from open-exchange-rates.json
[junit4:junit4]   2> 414 T931 oass.OpenExchangeRatesOrgProvider.reload Reloading exchange rates from open-exchange-rates.json
[junit4:junit4]   2> 414 T931 oasc.SolrResourceLoader.locateSolrHome JNDI not configured for solr (NoInitialContextEx)
[junit4:junit4]   2> 414 T931 oasc.SolrResourceLoader.locateSolrHome using system property solr.solr.home: /mnt/ssd/jenkins/workspace/Lucene-Solr-trunk-Linux-Java8-64/checkout/solr/build/solr-core/test-files/solr
[junit4:junit4]   2> 415 T931 oasc.SolrResourceLoader.<init> new SolrResourceLoader for directory: '/mnt/ssd/jenkins/workspace/Lucene-Solr-trunk-Linux-Java8-64/checkout/solr/build/solr-core/test-files/solr/'
[junit4:junit4]   2> 415 T931 oasc.CoreContainer.<init> New CoreContainer 817544414
[junit4:junit4]   2> 415 T931 oasc.SolrCore.<init> [collection1] Opening new SolrCore at /mnt/ssd/jenkins/workspace/Lucene-Solr-trunk-Linux-Java8-64/checkout/solr/build/solr-core/test-files/solr/collection1/, dataDir=/mnt/ssd/jenkins/workspace/Lucene-Solr-trunk-Linux-Java8-64/checkout/solr/build/solr-core/test/J0/./solrtest-SpellCheckComponentTest-1341779606111/
[junit4:junit4]   2> 415 T931 oasc.SolrCore.<init> JMX monitoring not detected for core: collection1
[junit4:junit4]   2> 416 T931 oasc.SolrCore.getNewIndexDir WARNING New index directory detected: old=null new=/mnt/ssd/jenkins/workspace/Lucene-Solr-trunk-Linux-Java8-64/checkout/solr/build/solr-core/test/J0/./solrtest-SpellCheckComponentTest-1341779606111/index/
[junit4:junit4]   2> 416 T931 oasc.SolrCore.initIndex WARNING [collection1] Solr index directory '/mnt/ssd/jenkins/workspace/Lucene-Solr-trunk-Linux-Java8-64/checkout/solr/build/solr-core/test/J0/./solrtest-SpellCheckComponentTest-1341779606111/index' doesn't exist. Creating new index...
[junit4:junit4]   2> 418 T931 oasc.SolrDeletionPolicy.onCommit SolrDeletionPolicy.onCommit: commits:num=1
[junit4:junit4]   2> 		commit{dir=MockDirWrapper(org.apache.lucene.store.RAMDirectory@33c5abd0 lockFactory=org.apache.lucene.store.NativeFSLockFactory@2cb33a9c),segFN=segments_1,generation=1,filenames=[segments_1]
[junit4:junit4]   2> 418 T931 oasc.SolrDeletionPolicy.updateCommits newest commit = 1
[junit4:junit4]   2> 419 T931 oasc.RequestHandlers.initHandlersFromConfig created standard: solr.StandardRequestHandler
[junit4:junit4]   2> 419 T931 oasc.RequestHandlers.initHandlersFromConfig created spellCheckCompRH: org.apache.solr.handler.component.SearchHandler
[junit4:junit4]   2> 419 T931 oasc.RequestHandlers.initHandlersFromConfig created spellCheckCompRH1: org.apache.solr.handler.component.SearchHandler
[junit4:junit4]   2> 420 T931 oasc.RequestHandlers.initHandlersFromConfig created spellCheckWithWordbreak: org.apache.solr.handler.component.SearchHandler
[junit4:junit4]   2> 423 T931 oass.SolrIndexSearcher.<init> Opening Searcher@2bb097f0 main
[junit4:junit4]   2> 423 T931 oass.SolrIndexSearcher.getIndexDir WARNING WARNING: Directory impl does not support setting indexDir: org.apache.lucene.store.MockDirectoryWrapper
[junit4:junit4]   2> 423 T931 oasu.CommitTracker.<init> Hard AutoCommit: disabled
[junit4:junit4]   2> 424 T931 oasu.CommitTracker.<init> Soft AutoCommit: disabled
[junit4:junit4]   2> 424 T931 oashc.SpellCheckComponent.inform Initializing spell checkers
[junit4:junit4]   2> 426 T931 oashc.SpellCheckComponent.inform Registering newSearcher listener for spellchecker: default
[junit4:junit4]   2> 429 T931 oashc.SpellCheckComponent.inform Registering newSearcher listener for spellchecker: default_teststop
[junit4:junit4]   2> 432 T931 oass.DirectSolrSpellChecker.init init: {name=direct,classname=solr.DirectSolrSpellChecker,minQueryLength=3,maxQueryFrequency=100.0,field=teststop}
[junit4:junit4]   2> 432 T931 oass.DirectSolrSpellChecker.init init: {name=direct_lowerfilt,classname=solr.DirectSolrSpellChecker,minQueryLength=3,maxQueryFrequency=100.0,field=lowerfilt}
[junit4:junit4]   2> 436 T931 oashc.SpellCheckComponent.inform Registering newSearcher listener for spellchecker: threshold
[junit4:junit4]   2> 436 T931 oass.DirectSolrSpellChecker.init init: {name=threshold_direct,classname=solr.DirectSolrSpellChecker,field=lowerfilt,spellcheckIndexDir=spellcheckerThreshold,buildOnCommit=true,thresholdTokenFrequency=0.29}
[junit4:junit4]   2> 436 T931 oashc.SpellCheckComponent.inform Registering newSearcher listener for spellchecker: threshold_direct
[junit4:junit4]   2> 438 T931 oashc.SpellCheckComponent.inform Registering newSearcher listener for spellchecker: multipleFields
[junit4:junit4]   2> 445 T931 oashc.SpellCheckComponent.inform Registering newSearcher listener for spellchecker: freq
[junit4:junit4]   2> 448 T931 oashc.SpellCheckComponent.inform Registering newSearcher listener for spellchecker: fqcn
[junit4:junit4]   2> 448 T931 oashc.HttpShardHandlerFactory.getParameter Setting socketTimeout to: 0
[junit4:junit4]   2> 449 T931 oashc.HttpShardHandlerFactory.getParameter Setting urlScheme to: http://
[junit4:junit4]   2> 449 T931 oashc.HttpShardHandlerFactory.getParameter Setting connTimeout to: 0
[junit4:junit4]   2> 449 T931 oashc.HttpShardHandlerFactory.getParameter Setting maxConnectionsPerHost to: 20
[junit4:junit4]   2> 449 T931 oashc.HttpShardHandlerFactory.getParameter Setting corePoolSize to: 0
[junit4:junit4]   2> 449 T931 oashc.HttpShardHandlerFactory.getParameter Setting maximumPoolSize to: 2147483647
[junit4:junit4]   2> 450 T931 oashc.HttpShardHandlerFactory.getParameter Setting maxThreadIdleTime to: 5
[junit4:junit4]   2> 450 T931 oashc.HttpShardHandlerFactory.getParameter Setting sizeOfQueue to: -1
[junit4:junit4]   2> 450 T931 oashc.HttpShardHandlerFactory.getParameter Setting fairnessPolicy to: false
[junit4:junit4]   2> 450 T931 oascsi.HttpClientUtil.createClient Creating new http client, config:maxConnectionsPerHost=20&maxConnections=10000&socketTimeout=0&connTimeout=0&retry=false
[junit4:junit4]   2> 452 T932 oasc.SolrCore.registerSearcher [collection1] Registered new searcher Searcher@2bb097f0 main{StandardDirectoryReader(segments_1:1)}
[junit4:junit4]   2> 452 T931 oasc.CoreContainer.register registering core: collection1
[junit4:junit4]   2> 453 T931 oas.SolrTestCaseJ4.initCore ####initCore end
[junit4:junit4]   2> 
[junit4:junit4] ERROR   0.63s J0 | SpellCheckComponentTest.testPerDictionary
[junit4:junit4]    > Throwable #1: java.lang.RuntimeException: mismatch: '0'!='2' @ spellcheck/suggestions/bar/startOffset
[junit4:junit4]    > 	at __randomizedtesting.SeedInfo.seed([89133562CE447602:4E1DC1CAC628634A]:0)
[junit4:junit4]    > 	at org.apache.solr.SolrTestCaseJ4.assertJQ(SolrTestCaseJ4.java:573)
[junit4:junit4]    > 	at org.apache.solr.SolrTestCaseJ4.assertJQ(SolrTestCaseJ4.java:521)
[junit4:junit4]    > 	at org.apache.solr.handler.component.SpellCheckComponentTest.testPerDictionary(SpellCheckComponentTest.java:102)
[junit4:junit4]    > 	at sun.reflect.NativeMethodAccessorImpl.invoke0(Native Method)
[junit4:junit4]    > 	at sun.reflect.NativeMethodAccessorImpl.invoke(NativeMethodAccessorImpl.java:57)
[junit4:junit4]    > 	at sun.reflect.DelegatingMethodAccessorImpl.invoke(DelegatingMethodAccessorImpl.java:43)
[junit4:junit4]    > 	at java.lang.reflect.Method.invoke(Method.java:474)
[junit4:junit4]    > 	at com.carrotsearch.randomizedtesting.RandomizedRunner.invoke(RandomizedRunner.java:1995)
[junit4:junit4]    > 	at com.carrotsearch.randomizedtesting.RandomizedRunner.access$1100(RandomizedRunner.java:132)
[junit4:junit4]    > 	at com.carrotsearch.randomizedtesting.RandomizedRunner$6.evaluate(RandomizedRunner.java:818)
[junit4:junit4]    > 	at com.carrotsearch.randomizedtesting.RandomizedRunner$7.evaluate(RandomizedRunner.java:877)
[junit4:junit4]    > 	at com.carrotsearch.randomizedtesting.RandomizedRunner$8.evaluate(RandomizedRunner.java:891)
[junit4:junit4]    > 	at com.carrotsearch.randomizedtesting.rules.SystemPropertiesRestoreRule$1.evaluate(SystemPropertiesRestoreRule.java:53)
[junit4:junit4]    > 	at org.apache.lucene.util.TestRuleSetupTeardownChained$1.evaluate(TestRuleSetupTeardownChained.java:50)
[junit4:junit4]    > 	at org.apache.lucene.util.TestRuleFieldCacheSanity$1.evaluate(TestRuleFieldCacheSanity.java:32)
[junit4:junit4]    > 	at org.apache.lucene.util.AbstractBeforeAfterRule$1.evaluate(AbstractBeforeAfterRule.java:45)
[junit4:junit4]    > 	at com.carrotsearch.randomizedtesting.rules.SystemPropertiesInvariantRule$1.evaluate(SystemPropertiesInvariantRule.java:55)
[junit4:junit4]    > 	at org.apache.lucene.util.TestRuleReportUncaughtExceptions$1.evaluate(TestRuleReportUncaughtExceptions.java:68)
[junit4:junit4]    > 	at org.apache.lucene.util.TestRuleThreadAndTestName$1.evaluate(TestRuleThreadAndTestName.java:48)
[junit4:junit4]    > 	at org.apache.lucene.util.TestRuleIgnoreAfterMaxFailures$1.evaluate(TestRuleIgnoreAfterMaxFailures.java:70)
[junit4:junit4]    > 	at org.apache.lucene.util.TestRuleMarkFailure$1.evaluate(TestRuleMarkFailure.java:48)
[junit4:junit4]    > 	at com.carrotsearch.randomizedtesting.RandomizedRunner.runSingleTest(RandomizedRunner.java:825)
[junit4:junit4]    > 	at com.carrotsearch.randomizedtesting.RandomizedRunner.access$700(RandomizedRunner.java:132)
[junit4:junit4]    > 	at com.carrotsearch.randomizedtesting.RandomizedRunner$3$1.run(RandomizedRunner.java:671)
[junit4:junit4]    > 	at com.carrotsearch.randomizedtesting.RandomizedRunner$3.evaluate(RandomizedRunner.java:697)
[junit4:junit4]    > 	at com.carrotsearch.randomizedtesting.RandomizedRunner$4.evaluate(RandomizedRunner.java:736)
[junit4:junit4]    > 	at com.carrotsearch.randomizedtesting.RandomizedRunner$5.evaluate(RandomizedRunner.java:747)
[junit4:junit4]    > 	at com.carrotsearch.randomizedtesting.rules.SystemPropertiesRestoreRule$1.evaluate(SystemPropertiesRestoreRule.java:53)
[junit4:junit4]    > 	at org.apache.lucene.util.AbstractBeforeAfterRule$1.evaluate(AbstractBeforeAfterRule.java:45)
[junit4:junit4]    > 	at org.apache.lucene.util.TestRuleReportUncaughtExceptions$1.evaluate(TestRuleReportUncaughtExceptions.java:68)
[junit4:junit4]    > 	at org.apache.lucene.util.TestRuleStoreClassName$1.evaluate(TestRuleStoreClassName.java:38)
[junit4:junit4]    > 	at org.apache.lucene.util.TestRuleIcuHack$1.evaluate(TestRuleIcuHack.java:51)
[junit4:junit4]    > 	at com.carrotsearch.randomizedtesting.rules.SystemPropertiesInvariantRule$1.evaluate(SystemPropertiesInvariantRule.java:55)
[junit4:junit4]    > 	at org.apache.lucene.util.TestRuleNoInstanceHooksOverrides$1.evaluate(TestRuleNoInstanceHooksOverrides.java:53)
[junit4:junit4]    > 	at org.apache.lucene.util.TestRuleNoStaticHooksShadowing$1.evaluate(TestRuleNoStaticHooksShadowing.java:52)
[junit4:junit4]    > 	at org.apache.lucene.util.TestRuleAssertionsRequired$1.evaluate(TestRuleAssertionsRequired.java:36)
[junit4:junit4]    > 	at org.apache.lucene.util.TestRuleMarkFailure$1.evaluate(TestRuleMarkFailure.java:48)
[junit4:junit4]    > 	at org.apache.lucene.util.TestRuleIgnoreAfterMaxFailures$1.evaluate(TestRuleIgnoreAfterMaxFailures.java:70)
[junit4:junit4]    > 	at org.apache.lucene.util.TestRuleIgnoreTestSuites$1.evaluate(TestRuleIgnoreTestSuites.java:55)
[junit4:junit4]    > 	at com.carrotsearch.randomizedtesting.RandomizedRunner.runSuite(RandomizedRunner.java:605)
[junit4:junit4]    > 	at com.carrotsearch.randomizedtesting.RandomizedRunner.access$400(RandomizedRunner.java:132)
[junit4:junit4]    > 	at com.carrotsearch.randomizedtesting.RandomizedRunner$2.run(RandomizedRunner.java:551)
[junit4:junit4]    > 
[junit4:junit4]   2> 2960 T931 oas.SolrTestCaseJ4.setUp ###Starting testPerDictionary
[junit4:junit4]   2> 2963 T931 C70 UPDATE [collection1] webapp=null path=null params={} {add=[0]} 0 0
[junit4:junit4]   2> 2969 T931 C70 UPDATE [collection1] webapp=null path=null params={} {add=[1]} 0 1
[junit4:junit4]   2> 2980 T931 C70 UPDATE [collection1] webapp=null path=null params={} {add=[2]} 0 5
[junit4:junit4]   2> 2996 T931 C70 UPDATE [collection1] webapp=null path=null params={} {add=[3]} 0 1
[junit4:junit4]   2> 3000 T931 C70 UPDATE [collection1] webapp=null path=null params={} {add=[4]} 0 0
[junit4:junit4]   2> 3006 T931 C70 UPDATE [collection1] webapp=null path=null params={} {add=[5]} 0 1
[junit4:junit4]   2> 3011 T931 C70 UPDATE [collection1] webapp=null path=null params={} {add=[6]} 0 1
[junit4:junit4]   2> 3015 T931 C70 UPDATE [collection1] webapp=null path=null params={} {add=[7]} 0 0
[junit4:junit4]   2> 3020 T931 C70 UPDATE [collection1] webapp=null path=null params={} {add=[8]} 0 1
[junit4:junit4]   2> 3024 T931 C70 UPDATE [collection1] webapp=null path=null params={} {add=[9]} 0 0
[junit4:junit4]   2> 3028 T931 C70 oasu.DirectUpdateHandler2.commit start commit{flags=0,version=0,optimize=false,openSearcher=true,waitSearcher=true,expungeDeletes=false,softCommit=false}
[junit4:junit4]   2> 3030 T931 C70 oasc.SolrDeletionPolicy.onCommit SolrDeletionPolicy.onCommit: commits:num=2
[junit4:junit4]   2> 		commit{dir=MockDirWrapper(org.apache.lucene.store.RAMDirectory@33c5abd0 lockFactory=org.apache.lucene.store.NativeFSLockFactory@2cb33a9c),segFN=segments_9,generation=9,filenames=[segments_9]
[junit4:junit4]   2> 		commit{dir=MockDirWrapper(org.apache.lucene.store.RAMDirectory@33c5abd0 lockFactory=org.apache.lucene.store.NativeFSLockFactory@2cb33a9c),segFN=segments_a,generation=10,filenames=[_4_nrm.cfe, _4.si, _4_nrm.cfs, _4.fdx, segments_a, _4_Lucene40_0.prx, _4.fnm, _4_Lucene40_0.tim, _4_Lucene40_0.frq, _4_Lucene40_0.tip, _4.fdt]
[junit4:junit4]   2> 3030 T931 C70 oasc.SolrDeletionPolicy.updateCommits newest commit = 10
[junit4:junit4]   2> 3031 T931 C70 oass.SolrIndexSearcher.<init> Opening Searcher@428e3d96 main
[junit4:junit4]   2> 3032 T931 C70 oass.SolrIndexSearcher.getIndexDir WARNING WARNING: Directory impl does not support setting indexDir: org.apache.lucene.store.MockDirectoryWrapper
[junit4:junit4]   2> 3032 T932 oashc.SpellCheckComponent$SpellCheckerListener.buildSpellIndex Building spell index for spell checker: default
[junit4:junit4]   2> 3033 T931 C70 oasu.DirectUpdateHandler2.commit end_commit_flush
[junit4:junit4]   2> 3059 T932 oashc.SpellCheckComponent$SpellCheckerListener.buildSpellIndex Building spell index for spell checker: default_teststop
[junit4:junit4]   2> 3079 T932 oashc.SpellCheckComponent$SpellCheckerListener.buildSpellIndex Building spell index for spell checker: threshold
[junit4:junit4]   2> 3121 T932 oashc.SpellCheckComponent$SpellCheckerListener.buildSpellIndex Building spell index for spell checker: threshold_direct
[junit4:junit4]   2> 3121 T932 oashc.SpellCheckComponent$SpellCheckerListener.buildSpellIndex Building spell index for spell checker: multipleFields
[junit4:junit4]   2> 3159 T932 oashc.SpellCheckComponent$SpellCheckerListener.buildSpellIndex Building spell index for spell checker: freq
[junit4:junit4]   2> 3229 T932 oashc.SpellCheckComponent$SpellCheckerListener.buildSpellIndex Building spell index for spell checker: fqcn
[junit4:junit4]   2> 3289 T932 oasc.SolrCore.registerSearcher [collection1] Registered new searcher Searcher@428e3d96 main{StandardDirectoryReader(segments_a:15 _4(5.0):C10)}
[junit4:junit4]   2> 3289 T931 C70 UPDATE [collection1] webapp=null path=null params={} {commit=} 0 261
[junit4:junit4]   2> 3292 T931 C70 REQ [collection1] webapp=null path=null params={qt=spellCheckCompRH&spellcheck..perDict.foo=bar&spellcheck.build=true&spellcheck..perDict.bar=foo&q=documemt&spellcheck=true&spellcheck.dictionary=perDict&json.nl=map} hits=0 status=0 QTime=1 
[junit4:junit4]   2> 3295 T931 oas.SolrTestCaseJ4.assertJQ SEVERE query failed JSON validation. error=mismatch: '0'!='2' @ spellcheck/suggestions/bar/startOffset
[junit4:junit4]   2> 	 expected =/spellcheck/suggestions/bar=={"numFound":1, "startOffset":0, "endOffset":1, "suggestion":["foo"]}
[junit4:junit4]   2> 	 response = {
[junit4:junit4]   2> 	  "responseHeader":{
[junit4:junit4]   2> 	    "status":0,
[junit4:junit4]   2> 	    "QTime":1},
[junit4:junit4]   2> 	  "command":"build",
[junit4:junit4]   2> 	  "response":{"numFound":0,"start":0,"docs":[]
[junit4:junit4]   2> 	  },
[junit4:junit4]   2> 	  "spellcheck":{
[junit4:junit4]   2> 	    "suggestions":{
[junit4:junit4]   2> 	      "foo":{
[junit4:junit4]   2> 	        "numFound":1,
[junit4:junit4]   2> 	        "startOffset":0,
[junit4:junit4]   2> 	        "endOffset":1,
[junit4:junit4]   2> 	        "suggestion":["bar"]},
[junit4:junit4]   2> 	      "bar":{
[junit4:junit4]   2> 	        "numFound":1,
[junit4:junit4]   2> 	        "startOffset":2,
[junit4:junit4]   2> 	        "endOffset":3,
[junit4:junit4]   2> 	        "suggestion":["foo"]}}}}
[junit4:junit4]   2> 	
[junit4:junit4]   2> 	 request = qt=spellCheckCompRH&spellcheck..perDict.foo=bar&spellcheck.build=true&spellcheck..perDict.bar=foo&q=documemt&spellcheck=true&spellcheck.dictionary=perDict&json.nl=map
[junit4:junit4]   2> 3296 T931 oas.SolrTestCaseJ4.tearDown ###Ending testPerDictionary
[junit4:junit4]   2> 3299 T931 C70 oasu.DirectUpdateHandler2.deleteAll [collection1] REMOVING ALL DOCUMENTS FROM INDEX
[junit4:junit4]   2> 3300 T931 C70 UPDATE [collection1] webapp=null path=null params={} {deleteByQuery=*:*} 0 1
[junit4:junit4]   2> 3304 T931 C70 oasu.DirectUpdateHandler2.commit start commit{flags=0,version=0,optimize=false,openSearcher=true,waitSearcher=true,expungeDeletes=false,softCommit=false}
[junit4:junit4]   2> 3304 T931 C70 oasc.SolrDeletionPolicy.onCommit SolrDeletionPolicy.onCommit: commits:num=2
[junit4:junit4]   2> 		commit{dir=MockDirWrapper(org.apache.lucene.store.RAMDirectory@33c5abd0 lockFactory=org.apache.lucene.store.NativeFSLockFactory@2cb33a9c),segFN=segments_a,generation=10,filenames=[_4_nrm.cfe, _4.si, _4_nrm.cfs, _4.fdx, segments_a, _4_Lucene40_0.prx, _4.fnm, _4_Lucene40_0.tim, _4_Lucene40_0.frq, _4_Lucene40_0.tip, _4.fdt]
[junit4:junit4]   2> 		commit{dir=MockDirWrapper(org.apache.lucene.store.RAMDirectory@33c5abd0 lockFactory=org.apache.lucene.store.NativeFSLockFactory@2cb33a9c),segFN=segments_b,generation=11,filenames=[segments_b]
[junit4:junit4]   2> 3305 T931 C70 oasc.SolrDeletionPolicy.updateCommits newest commit = 11
[junit4:junit4]   2> 3305 T931 C70 oass.SolrIndexSearcher.<init> Opening Searcher@ea982c4 main
[junit4:junit4]   2> 3306 T931 C70 oass.SolrIndexSearcher.getIndexDir WARNING WARNING: Directory impl does not support setting indexDir: org.apache.lucene.store.MockDirectoryWrapper
[junit4:junit4]   2> 3306 T932 oashc.SpellCheckComponent$SpellCheckerListener.buildSpellIndex Building spell index for spell checker: default
[junit4:junit4]   2> 3306 T931 C70 oasu.DirectUpdateHandler2.commit end_commit_flush
[junit4:junit4]   2> 3333 T932 oashc.SpellCheckComponent$SpellCheckerListener.buildSpellIndex Building spell index for spell checker: default_teststop
[junit4:junit4]   2> 3360 T932 oashc.SpellCheckComponent$SpellCheckerListener.buildSpellIndex Building spell index for spell checker: threshold
[junit4:junit4]   2> 3379 T932 oashc.SpellCheckComponent$SpellCheckerListener.buildSpellIndex Building spell index for spell checker: threshold_direct
[junit4:junit4]   2> 3380 T932 oashc.SpellCheckComponent$SpellCheckerListener.buildSpellIndex Building spell index for spell checker: multipleFields
[junit4:junit4]   2> 3430 T932 oashc.SpellCheckComponent$SpellCheckerListener.buildSpellIndex Building spell index for spell checker: freq
[junit4:junit4]   2> 3461 T932 oashc.SpellCheckComponent$SpellCheckerListener.buildSpellIndex Building spell index for spell checker: fqcn
[junit4:junit4]   2> 3520 T932 oasc.SolrCore.registerSearcher [collection1] Registered new searcher Searcher@ea982c4 main{StandardDirectoryReader(segments_b:16)}
[junit4:junit4]   2> 3521 T931 C70 UPDATE [collection1] webapp=null path=null params={} {commit=} 0 217
[junit4:junit4]   2> NOTE: reproduce with: ant test  -Dtestcase=SpellCheckComponentTest -Dtests.method=testPerDictionary -Dtests.seed=89133562CE447602 -Dtests.multiplier=3 -Dtests.slow=true -Dtests.locale=es_PE -Dtests.timezone=Asia/Seoul -Dtests.file.encoding=UTF-8
[junit4:junit4]   2>
[junit4:junit4]    > (@AfterClass output)
[junit4:junit4]   2> 8377 T931 oas.SolrTestCaseJ4.deleteCore ###deleteCore
[junit4:junit4]   2> 8378 T931 oasc.CoreContainer.shutdown Shutting down CoreContainer instance=817544414
[junit4:junit4]   2> 8378 T931 oasc.SolrCore.close [collection1]  CLOSING SolrCore org.apache.solr.core.SolrCore@2aa3e99e
[junit4:junit4]   2> 8378 T931 oasc.SolrCore.closeSearcher [collection1] Closing main searcher on request.
[junit4:junit4]   2> 8378 T931 oasu.DirectUpdateHandler2.close closing DirectUpdateHandler2{commits=20,autocommits=0,soft autocommits=0,optimizes=0,rollbacks=0,expungeDeletes=0,docsPending=0,adds=0,deletesById=0,deletesByQuery=0,errors=0,cumulative_adds=92,cumulative_deletesById=0,cumulative_deletesByQuery=9,cumulative_errors=0}
[junit4:junit4]   2> NOTE: test params are: codec=Lucene40: {gram3=PostingsFormat(name=MockRandom), gram2=MockFixedIntBlock(blockSize=654), end4=PostingsFormat(name=NestedPulsing), end2=MockFixedIntBlock(blockSize=654), start2=PostingsFormat(name=MockRandom), start3=MockFixedIntBlock(blockSize=654), end3=PostingsFormat(name=MockRandom), end1=PostingsFormat(name=SimpleText), start1=PostingsFormat(name=NestedPulsing), start4=PostingsFormat(name=SimpleText), word=PostingsFormat(name=SimpleText), gram1=PostingsFormat(name=SimpleText), gram4=PostingsFormat(name=NestedPulsing)}, sim=RandomSimilarityProvider(queryNorm=true,coord=false): {}, locale=es_PE, timezone=Asia/Seoul
[junit4:junit4]   2> NOTE: Linux 3.2.0-26-generic amd64/Oracle Corporation 1.8.0-ea (64-bit)/cpus=8,threads=1,free=104759328,total=332070912
[junit4:junit4]   2> NOTE: All tests run in this JVM: [SpatialFilterTest, OutputWriterTest, TestDistributedGrouping, XmlUpdateRequestHandlerTest, TestBM25SimilarityFactory, MinimalSchemaTest, TestItalianLightStemFilterFactory, TestPortugueseStemFilterFactory, TestFiltering, CoreAdminHandlerTest, SolrCoreCheckLockOnStartupTest, CopyFieldTest, TestCodecSupport, TestLFUCache, SolrIndexConfigTest, BinaryUpdateRequestHandlerTest, DirectUpdateHandlerOptimizeTest, SuggesterWFSTTest, SolrInfoMBeanTest, TestStandardFactories, TestSynonymFilterFactory, TestTypeTokenFilterFactory, TestStressReorder, LegacyHTMLStripCharFilterTest, TermsComponentTest, AnalysisAfterCoreReloadTest, TestSolrCoreProperties, SnowballPorterFilterFactoryTest, TestReversedWildcardFilterFactory, TestGermanStemFilterFactory, PrimitiveFieldTypeTest, BadComponentTest, StatsComponentTest, TestBinaryField, TestFunctionQuery, TestIrishLowerCaseFilterFactory, TestPortugueseMinimalStemFilterFactory, TestPatternReplaceCharFilterFactory, TestFrenchMinimalStemFilterFactory, TestGreekLowerCaseFilterFactory, TestLatvianStemFilterFactory, SolrRequestParserTest, TestDictionaryCompoundWordTokenFilterFactory, TestStemmerOverrideFilterFactory, FullSolrCloudDistribCmdsTest, TestHashPartitioner, TestSurroundQueryParser, TestFoldingMultitermQuery, CurrencyFieldTest, TestJapanesePartOfSpeechStopFilterFactory, SolrCmdDistributorTest, TestCJKWidthFilterFactory, TestBulgarianStemFilterFactory, TestJmxIntegration, TestArabicFilters, AutoCommitTest, SystemInfoHandlerTest, TestHyphenationCompoundWordTokenFilterFactory, DefaultValueUpdateProcessorTest, TestRandomFaceting, SuggesterTest, FastVectorHighlighterTest, DateFieldTest, ZkNodePropsTest, TestPropInject, TestCapitalizationFilterFactory, TestPerFieldSimilarity, TestQueryUtils, TestPhoneticFilterFactory, TestJapaneseKatakanaStemFilterFactory, HighlighterTest, BasicDistributedZkTest, SpellCheckComponentTest]
[junit4:junit4]   2> 
[junit4:junit4] Completed on J0 in 8.52s, 9 tests, 1 error <<< FAILURES!

[...truncated 108 lines...]
[junit4:junit4] Suite: org.apache.solr.handler.component.DistributedQueryElevationComponentTest
[junit4:junit4] ERROR   1.17s J1 | DistributedQueryElevationComponentTest.testDistribSearch
[junit4:junit4]    > Throwable #1: java.lang.IndexOutOfBoundsException: Index: 18, Size: 18
[junit4:junit4]    > 	at __randomizedtesting.SeedInfo.seed([89133562CE447602:8F5BB7AB91B163E]:0)
[junit4:junit4]    > 	at java.util.ArrayList.rangeCheck(ArrayList.java:603)
[junit4:junit4]    > 	at java.util.ArrayList.get(ArrayList.java:381)
[junit4:junit4]    > 	at org.apache.solr.common.util.NamedList.getName(NamedList.java:127)
[junit4:junit4]    > 	at org.apache.solr.BaseDistributedSearchTestCase.compare(BaseDistributedSearchTestCase.java:466)
[junit4:junit4]    > 	at org.apache.solr.BaseDistributedSearchTestCase.compare(BaseDistributedSearchTestCase.java:612)
[junit4:junit4]    > 	at org.apache.solr.BaseDistributedSearchTestCase.compare(BaseDistributedSearchTestCase.java:500)
[junit4:junit4]    > 	at org.apache.solr.BaseDistributedSearchTestCase.compare(BaseDistributedSearchTestCase.java:612)
[junit4:junit4]    > 	at org.apache.solr.BaseDistributedSearchTestCase.compare(BaseDistributedSearchTestCase.java:500)
[junit4:junit4]    > 	at org.apache.solr.BaseDistributedSearchTestCase.compareResponses(BaseDistributedSearchTestCase.java:667)
[junit4:junit4]    > 	at org.apache.solr.BaseDistributedSearchTestCase.query(BaseDistributedSearchTestCase.java:392)
[junit4:junit4]    > 	at org.apache.solr.handler.component.DistributedQueryElevationComponentTest.doTest(DistributedQueryElevationComponentTest.java:81)
[junit4:junit4]    > 	at org.apache.solr.BaseDistributedSearchTestCase.testDistribSearch(BaseDistributedSearchTestCase.java:679)
[junit4:junit4]    > 	at sun.reflect.NativeMethodAccessorImpl.invoke0(Native Method)
[junit4:junit4]    > 	at sun.reflect.NativeMethodAccessorImpl.invoke(NativeMethodAccessorImpl.java:57)
[junit4:junit4]    > 	at sun.reflect.DelegatingMethodAccessorImpl.invoke(DelegatingMethodAccessorImpl.java:43)
[junit4:junit4]    > 	at java.lang.reflect.Method.invoke(Method.java:474)
[junit4:junit4]    > 	at com.carrotsearch.randomizedtesting.RandomizedRunner.invoke(RandomizedRunner.java:1995)
[junit4:junit4]    > 	at com.carrotsearch.randomizedtesting.RandomizedRunner.access$1100(RandomizedRunner.java:132)
[junit4:junit4]    > 	at com.carrotsearch.randomizedtesting.RandomizedRunner$6.evaluate(RandomizedRunner.java:818)
[junit4:junit4]    > 	at com.carrotsearch.randomizedtesting.RandomizedRunner$7.evaluate(RandomizedRunner.java:877)
[junit4:junit4]    > 	at com.carrotsearch.randomizedtesting.RandomizedRunner$8.evaluate(RandomizedRunner.java:891)
[junit4:junit4]    > 	at com.carrotsearch.randomizedtesting.rules.SystemPropertiesRestoreRule$1.evaluate(SystemPropertiesRestoreRule.java:53)
[junit4:junit4]    > 	at org.apache.lucene.util.TestRuleSetupTeardownChained$1.evaluate(TestRuleSetupTeardownChained.java:50)
[junit4:junit4]    > 	at org.apache.lucene.util.TestRuleFieldCacheSanity$1.evaluate(TestRuleFieldCacheSanity.java:32)
[junit4:junit4]    > 	at org.apache.lucene.util.AbstractBeforeAfterRule$1.evaluate(AbstractBeforeAfterRule.java:45)
[junit4:junit4]    > 	at com.carrotsearch.randomizedtesting.rules.SystemPropertiesInvariantRule$1.evaluate(SystemPropertiesInvariantRule.java:55)
[junit4:junit4]    > 	at org.apache.lucene.util.TestRuleReportUncaughtExceptions$1.evaluate(TestRuleReportUncaughtExceptions.java:68)
[junit4:junit4]    > 	at org.apache.lucene.util.TestRuleThreadAndTestName$1.evaluate(TestRuleThreadAndTestName.java:48)
[junit4:junit4]    > 	at org.apache.lucene.util.TestRuleIgnoreAfterMaxFailures$1.evaluate(TestRuleIgnoreAfterMaxFailures.java:70)
[junit4:junit4]    > 	at org.apache.lucene.util.TestRuleMarkFailure$1.evaluate(TestRuleMarkFailure.java:48)
[junit4:junit4]    > 	at com.carrotsearch.randomizedtesting.RandomizedRunner.runSingleTest(RandomizedRunner.java:825)
[junit4:junit4]    > 	at com.carrotsearch.randomizedtesting.RandomizedRunner.access$700(RandomizedRunner.java:132)
[junit4:junit4]    > 	at com.carrotsearch.randomizedtesting.RandomizedRunner$3$1.run(RandomizedRunner.java:671)
[junit4:junit4]    > 	at com.carrotsearch.randomizedtesting.RandomizedRunner$3.evaluate(RandomizedRunner.java:697)
[junit4:junit4]    > 	at com.carrotsearch.randomizedtesting.RandomizedRunner$4.evaluate(RandomizedRunner.java:736)
[junit4:junit4]    > 	at com.carrotsearch.randomizedtesting.RandomizedRunner$5.evaluate(RandomizedRunner.java:747)
[junit4:junit4]    > 	at com.carrotsearch.randomizedtesting.rules.SystemPropertiesRestoreRule$1.evaluate(SystemPropertiesRestoreRule.java:53)
[junit4:junit4]    > 	at org.apache.lucene.util.AbstractBeforeAfterRule$1.evaluate(AbstractBeforeAfterRule.java:45)
[junit4:junit4]    > 	at org.apache.lucene.util.TestRuleReportUncaughtExceptions$1.evaluate(TestRuleReportUncaughtExceptions.java:68)
[junit4:junit4]    > 	at org.apache.lucene.util.TestRuleStoreClassName$1.evaluate(TestRuleStoreClassName.java:38)
[junit4:junit4]    > 	at org.apache.lucene.util.TestRuleIcuHack$1.evaluate(TestRuleIcuHack.java:51)
[junit4:junit4]    > 	at com.carrotsearch.randomizedtesting.rules.SystemPropertiesInvariantRule$1.evaluate(SystemPropertiesInvariantRule.java:55)
[junit4:junit4]    > 	at org.apache.lucene.util.TestRuleNoInstanceHooksOverrides$1.evaluate(TestRuleNoInstanceHooksOverrides.java:53)
[junit4:junit4]    > 	at org.apache.lucene.util.TestRuleNoStaticHooksShadowing$1.evaluate(TestRuleNoStaticHooksShadowing.java:52)
[junit4:junit4]    > 	at org.apache.lucene.util.TestRuleAssertionsRequired$1.evaluate(TestRuleAssertionsRequired.java:36)
[junit4:junit4]    > 	at org.apache.lucene.util.TestRuleMarkFailure$1.evaluate(TestRuleMarkFailure.java:48)
[junit4:junit4]    > 	at org.apache.lucene.util.TestRuleIgnoreAfterMaxFailures$1.evaluate(TestRuleIgnoreAfterMaxFailures.java:70)
[junit4:junit4]    > 	at org.apache.lucene.util.TestRuleIgnoreTestSuites$1.evaluate(TestRuleIgnoreTestSuites.java:55)
[junit4:junit4]    > 	at com.carrotsearch.randomizedtesting.RandomizedRunner.runSuite(RandomizedRunner.java:605)
[junit4:junit4]    > 	at com.carrotsearch.randomizedtesting.RandomizedRunner.access$400(RandomizedRunner.java:132)
[junit4:junit4]    > 	at com.carrotsearch.randomizedtesting.RandomizedRunner$2.run(RandomizedRunner.java:551)
[junit4:junit4]    > 
[junit4:junit4]   2> 1 T2290 oas.SolrTestCaseJ4.setUp ###Starting testDistribSearch
[junit4:junit4]   2> 2 T2290 oejs.Server.doStart jetty-8.1.2.v20120308
[junit4:junit4]   2> 3 T2290 oejs.AbstractConnector.doStart Started SocketConnector@0.0.0.0:54936
[junit4:junit4]   2> 4 T2290 oasc.SolrResourceLoader.locateSolrHome JNDI not configured for solr (NoInitialContextEx)
[junit4:junit4]   2> 4 T2290 oasc.SolrResourceLoader.locateSolrHome using system property solr.solr.home: /mnt/ssd/jenkins/workspace/Lucene-Solr-trunk-Linux-Java8-64/checkout/solr/build/solr-core/test-files/solr
[junit4:junit4]   2> 5 T2290 oasc.SolrResourceLoader.<init> new SolrResourceLoader for deduced Solr Home: '/mnt/ssd/jenkins/workspace/Lucene-Solr-trunk-Linux-Java8-64/checkout/solr/build/solr-core/test-files/solr/'
[junit4:junit4]   2> 7 T2290 oass.SolrDispatchFilter.init SolrDispatchFilter.init()
[junit4:junit4]   2> 7 T2290 oasc.SolrResourceLoader.locateSolrHome JNDI not configured for solr (NoInitialContextEx)
[junit4:junit4]   2> 8 T2290 oasc.SolrResourceLoader.locateSolrHome using system property solr.solr.home: /mnt/ssd/jenkins/workspace/Lucene-Solr-trunk-Linux-Java8-64/checkout/solr/build/solr-core/test-files/solr
[junit4:junit4]   2> 8 T2290 oasc.CoreContainer$Initializer.initialize looking for solr.xml: /mnt/ssd/jenkins/workspace/Lucene-Solr-trunk-Linux-Java8-64/checkout/solr/build/solr-core/test-files/solr/solr.xml
[junit4:junit4]   2> 8 T2290 oasc.CoreContainer.<init> New CoreContainer 1424714444
[junit4:junit4]   2> 8 T2290 oasc.CoreContainer.load Loading CoreContainer using Solr Home: '/mnt/ssd/jenkins/workspace/Lucene-Solr-trunk-Linux-Java8-64/checkout/solr/build/solr-core/test-files/solr/'
[junit4:junit4]   2> 8 T2290 oasc.SolrResourceLoader.<init> new SolrResourceLoader for directory: '/mnt/ssd/jenkins/workspace/Lucene-Solr-trunk-Linux-Java8-64/checkout/solr/build/solr-core/test-files/solr/'
[junit4:junit4]   2> 14 T2290 oasc.CoreContainer.load Registering Log Listener
[junit4:junit4]   2> 20 T2290 oashc.HttpShardHandlerFactory.getParameter Setting socketTimeout to: 0
[junit4:junit4]   2> 21 T2290 oashc.HttpShardHandlerFactory.getParameter Setting urlScheme to: http://
[junit4:junit4]   2> 21 T2290 oashc.HttpShardHandlerFactory.getParameter Setting connTimeout to: 0
[junit4:junit4]   2> 21 T2290 oashc.HttpShardHandlerFactory.getParameter Setting maxConnectionsPerHost to: 20
[junit4:junit4]   2> 21 T2290 oashc.HttpShardHandlerFactory.getParameter Setting corePoolSize to: 0
[junit4:junit4]   2> 21 T2290 oashc.HttpShardHandlerFactory.getParameter Setting maximumPoolSize to: 2147483647
[junit4:junit4]   2> 22 T2290 oashc.HttpShardHandlerFactory.getParameter Setting maxThreadIdleTime to: 5
[junit4:junit4]   2> 22 T2290 oashc.HttpShardHandlerFactory.getParameter Setting sizeOfQueue to: -1
[junit4:junit4]   2> 22 T2290 oashc.HttpShardHandlerFactory.getParameter Setting fairnessPolicy to: false
[junit4:junit4]   2> 22 T2290 oascsi.HttpClientUtil.createClient Creating new http client, config:maxConnectionsPerHost=20&maxConnections=10000&socketTimeout=0&connTimeout=0&retry=false
[junit4:junit4]   2> 26 T2290 oasc.CoreContainer.create Creating SolrCore 'collection1' using instanceDir: /mnt/ssd/jenkins/workspace/Lucene-Solr-trunk-Linux-Java8-64/checkout/solr/build/solr-core/test-files/solr/collection1
[junit4:junit4]   2> 26 T2290 oasc.SolrResourceLoader.<init> new SolrResourceLoader for directory: '/mnt/ssd/jenkins/workspace/Lucene-Solr-trunk-Linux-Java8-64/checkout/solr/build/solr-core/test-files/solr/collection1/'
[junit4:junit4]   2> 27 T2290 oasc.SolrResourceLoader.replaceClassLoader Adding 'file:/mnt/ssd/jenkins/workspace/Lucene-Solr-trunk-Linux-Java8-64/checkout/solr/build/solr-core/test-files/solr/collection1/lib/README' to classloader
[junit4:junit4]   2> 27 T2290 oasc.SolrResourceLoader.replaceClassLoader Adding 'file:/mnt/ssd/jenkins/workspace/Lucene-Solr-trunk-Linux-Java8-64/checkout/solr/build/solr-core/test-files/solr/collection1/lib/classes/' to classloader
[junit4:junit4]   2> 40 T2290 oasc.SolrConfig.<init> Using Lucene MatchVersion: LUCENE_50
[junit4:junit4]   2> 66 T2290 oasc.SolrConfig.<init> Loaded SolrConfig: solrconfig-elevate.xml
[junit4:junit4]   2> 66 T2290 oass.IndexSchema.readSchema Reading Solr Schema
[junit4:junit4]   2> 68 T2290 oass.IndexSchema.readSchema Schema name=example
[junit4:junit4]   2> 190 T2290 oass.IndexSchema.readSchema default search field in schema is text
[junit4:junit4]   2> 191 T2290 oass.IndexSchema.readSchema unique key field: id
[junit4:junit4]   2> 193 T2290 oasc.SolrCore.<init> [collection1] Opening new SolrCore at /mnt/ssd/jenkins/workspace/Lucene-Solr-trunk-Linux-Java8-64/checkout/solr/build/solr-core/test-files/solr/collection1/, dataDir=./org.apache.solr.handler.component.DistributedQueryElevationComponentTest-1341779699310/control/data/
[junit4:junit4]   2> 193 T2290 oasc.JmxMonitoredMap.<init> JMX monitoring is enabled. Adding Solr mbeans to JMX Server: com.sun.jmx.mbeanserver.JmxMBeanServer@485faba7
[junit4:junit4]   2> 194 T2290 oasc.SolrCore.getNewIndexDir WARNING New index directory detected: old=null new=./org.apache.solr.handler.component.DistributedQueryElevationComponentTest-1341779699310/control/data/index/
[junit4:junit4]   2> 194 T2290 oasc.SolrCore.initIndex WARNING [collection1] Solr index directory './org.apache.solr.handler.component.DistributedQueryElevationComponentTest-1341779699310/control/data/index' doesn't exist. Creating new index...
[junit4:junit4]   2> 195 T2290 oasc.SolrDeletionPolicy.onCommit SolrDeletionPolicy.onCommit: commits:num=1
[junit4:junit4]   2> 		commit{dir=MockDirWrapper(org.apache.lucene.store.RAMDirectory@343d32eb lockFactory=org.apache.lucene.store.SingleInstanceLockFactory@527741f7),segFN=segments_1,generation=1,filenames=[segments_1]
[junit4:junit4]   2> 195 T2290 oasc.SolrDeletionPolicy.updateCommits newest commit = 1
[junit4:junit4]   2> 196 T2290 oasc.RequestHandlers.initHandlersFromConfig created /update: solr.UpdateRequestHandler
[junit4:junit4]   2> 196 T2290 oasc.RequestHandlers.initHandlersFromConfig created /elevate: org.apache.solr.handler.component.SearchHandler
[junit4:junit4]   2> 196 T2290 oasc.RequestHandlers.initHandlersFromConfig created /dataElevate: org.apache.solr.handler.component.SearchHandler
[junit4:junit4]   2> 197 T2290 oashl.XMLLoader.init xsltCacheLifetimeSeconds=60
[junit4:junit4]   2> 197 T2290 oasc.RequestHandlers.initHandlersFromConfig WARNING no default request handler is registered (either '/select' or 'standard')
[junit4:junit4]   2> 198 T2290 oasc.SolrCore.initDeprecatedSupport WARNING solrconfig.xml uses deprecated <admin/gettableFiles>, Please update your config to use the ShowFileRequestHandler.
[junit4:junit4]   2> 198 T2290 oasc.SolrCore.initDeprecatedSupport WARNING adding ShowFileRequestHandler with hidden files: [SOLRCONFIG-MASTER2.XML, SCHEMA-PHRASESUGGEST.XML, SOLRCONFIG-SPELLCHECKER.XML, SCHEMA-IB.XML, SOLRCONFIG-TERMINDEX.XML, BAD-SCHEMA-DUP-FIELD.XML, SCHEMA-DFR.XML, BAD-SCHEMA-UNIQUEKEY-USES-DEFAULT.XML, SOLRCONFIG-MASTER1.XML, XSLT, CURRENCY.XML, STOPWITHBOM.TXT, SCHEMA_CODEC.XML, SCHEMA-BM25.XML, SCHEMA-LUCENEMATCHVERSION.XML, SOLRCONFIG-FUNCTIONQUERY.XML, SOLRCONFIG-PROPINJECT.XML, SOLRCONFIG-SPELLCHECKCOMPONENT.XML, SOLRCONFIG-UPDATE-PROCESSOR-CHAINS.XML, SOLRCONFIG-QUERYSENDER.XML, DA_COMPOUNDDICTIONARY.TXT, SCHEMA-BINARYFIELD.XML, BAD-SCHEMA-NOT-INDEXED-BUT-NORMS.XML, STOP-2.TXT, HUNSPELL-TEST.AFF, STOP-1.TXT, MAPPING-ISOLATIN1ACCENT.TXT, SOLRCONFIG-SLAVE.XML, SYNONYMS.TXT, KEEP-2.TXT, STOP-SNOWBALL.TXT, FRENCHARTICLES.TXT, STOPWORDS.TXT, STEMDICT.TXT, SOLRCONFIG-MERGEPOLICY.XML, SCHEMA11.XML, BAD-SCHEMA-DUP-FIELDTYPE.XML, SOLRCONFIG_CODEC.XML, SOLRCONFIG-LAZYWRITER.XML, DA_UTF8.XML, BAD-MP-SOLRCONFIG.XML, SCHEMA-SPELLCHECKER.XML, SOLRCONFIG-SIMPLELOCK.XML, SOLRCONFIG-CACHING.XML, BAD-SCHEMA-UNIQUEKEY-IS-COPYFIELD-DEST.XML, BAD-SCHEMA-SIM-GLOBAL-VS-FT-MISMATCH.XML, SCHEMA-STOP-KEEP.XML, SOLRCONFIG-SLAVE1.XML, SCHEMASURROUND.XML, PHRASESUGGEST.TXT, SOLRCONFIG-PROPINJECT-INDEXDEFAULT.XML, OPEN-EXCHANGE-RATES.JSON, STOPTYPES-1.TXT, SCHEMA15.XML, KEEP-1.TXT, SOLRCONFIG-ELEVATE.XML, SCHEMA-COPYFIELD-TEST.XML, SCHEMA-REVERSED.XML, BAD_SOLRCONFIG.XML, BAD-SCHEMA-NOT-INDEXED-BUT-TF.XML, SCHEMA-TRIE.XML, SCHEMA-LMJELINEKMERCER.XML, BAD-SCHEMA-NOT-INDEXED-BUT-POS.XML, SOLRCONFIG-REQHANDLER.INCL, BAD-SCHEMA-EXTERNAL-FILEFIELD.XML, SOLRCONFIG-DELPOLICY1.XML, SCHEMA-REPLICATION1.XML, SOLRCONFIG-MASTER1-KEEPONEBACKUP.XML, SOLRCONFIG-MASTER.XML, SCHEMA-NUMERIC.XML, STOPTYPES-2.TXT, SOLRCONFIG-SOLR-749.XML, SOLRCONFIG-TLOG.XML, SCHEMA-MINIMAL.XML, HUNSPELL-TEST.DIC, SCHEMA-FOLDING.XML, SOLRCONFIG_PERF.XML, SOLRCONFIG-PHRASESUGGEST.XML, SOLRCONFIG-SOLCOREPROPERTIES.XML, BAD-SCHEMA-OMIT-TF-BUT-NOT-POS.XML, SOLRCONFIG-MASTER3.XML, ELEVATE.XML, SCHEMA-NOT-REQUIRED-UNIQUE-KEY.XML, SOLRCONFIG-HIGHLIGHT.XML, SCHEMA-REQUIRED-FIELDS.XML, SOLRCONFIG-NATIVELOCK.XML, OLD_SYNONYMS.TXT, STOPWORDSWRONGENCODING.TXT, BAD-SCHEMA-NONTEXT-ANALYZER.XML, SCHEMA-COLLATE.XML, SOLRCONFIG-ALTDIRECTORY.XML, SCHEMA-CHARFILTERS.XML, SCHEMA-TFIDF.XML, SCHEMA-LMDIRICHLET.XML, BAD-SCHEMA-DUP-DYNAMICFIELD.XML, SCHEMA.XML, SOLRCONFIG-DELPOLICY2.XML, PROTWORDS.TXT, SCHEMA-SIM.XML, SOLRCONFIG-ENABLEPLUGIN.XML, WDFTYPES.TXT, SOLRCONFIG-BASIC.XML, SCHEMA-REPLICATION2.XML, SOLRCONFIG-XINCLUDE.XML, COMPOUNDDICTIONARY.TXT, HYPHENATION.DTD, SCHEMA12.XML, SOLRCONFIG-NOCACHE.XML, SOLRCONFIG-TRANSFORMERS.XML, SOLRCONFIG-QUERYSENDER-NOQUERY.XML, SOLRCONFIG-REPEATER.XML]
[junit4:junit4]   2> 200 T2290 oass.SolrIndexSearcher.<init> Opening Searcher@7897baee main
[junit4:junit4]   2> 201 T2290 oass.SolrIndexSearcher.getIndexDir WARNING WARNING: Directory impl does not support setting indexDir: org.apache.lucene.store.MockDirectoryWrapper
[junit4:junit4]   2> 201 T2290 oasu.CommitTracker.<init> Hard AutoCommit: disabled
[junit4:junit4]   2> 201 T2290 oasu.CommitTracker.<init> Soft AutoCommit: disabled
[junit4:junit4]   2> 202 T2290 oashc.QueryElevationComponent.inform Loading QueryElevation from: /mnt/ssd/jenkins/workspace/Lucene-Solr-trunk-Linux-Java8-64/checkout/solr/build/solr-core/test-files/solr/collection1/conf/elevate.xml
[junit4:junit4]   2> 206 T2290 oashc.QueryElevationComponent.inform Loading QueryElevation from: /mnt/ssd/jenkins/workspace/Lucene-Solr-trunk-Linux-Java8-64/checkout/solr/build/solr-core/test-files/solr/collection1/conf/elevate.xml
[junit4:junit4]   2> 212 T2300 oasc.SolrCore.registerSearcher [collection1] Registered new searcher Searcher@7897baee main{StandardDirectoryReader(segments_1:1)}
[junit4:junit4]   2> 211 T2290 oasc.CoreContainer.register registering core: collection1
[junit4:junit4]   2> 212 T2290 oass.SolrDispatchFilter.init user.dir=/mnt/ssd/jenkins/workspace/Lucene-Solr-trunk-Linux-Java8-64/checkout/solr/build/solr-core/test/J1
[junit4:junit4]   2> 212 T2290 oass.SolrDispatchFilter.init SolrDispatchFilter.init() done
[junit4:junit4]   2> 212 T2290 oascsi.HttpClientUtil.createClient Creating new http client, config:maxConnections=128&maxConnectionsPerHost=32&followRedirects=false
[junit4:junit4]   2> 214 T2290 oejs.Server.doStart jetty-8.1.2.v20120308
[junit4:junit4]   2> 215 T2290 oejs.AbstractConnector.doStart Started SocketConnector@0.0.0.0:43361
[junit4:junit4]   2> 216 T2290 oasc.SolrResourceLoader.locateSolrHome JNDI not configured for solr (NoInitialContextEx)
[junit4:junit4]   2> 216 T2290 oasc.SolrResourceLoader.locateSolrHome using system property solr.solr.home: /mnt/ssd/jenkins/workspace/Lucene-Solr-trunk-Linux-Java8-64/checkout/solr/build/solr-core/test-files/solr
[junit4:junit4]   2> 217 T2290 oasc.SolrResourceLoader.<init> new SolrResourceLoader for deduced Solr Home: '/mnt/ssd/jenkins/workspace/Lucene-Solr-trunk-Linux-Java8-64/checkout/solr/build/solr-core/test-files/solr/'
[junit4:junit4]   2> 219 T2290 oass.SolrDispatchFilter.init SolrDispatchFilter.init()
[junit4:junit4]   2> 219 T2290 oasc.SolrResourceLoader.locateSolrHome JNDI not configured for solr (NoInitialContextEx)
[junit4:junit4]   2> 219 T2290 oasc.SolrResourceLoader.locateSolrHome using system property solr.solr.home: /mnt/ssd/jenkins/workspace/Lucene-Solr-trunk-Linux-Java8-64/checkout/solr/build/solr-core/test-files/solr
[junit4:junit4]   2> 220 T2290 oasc.CoreContainer$Initializer.initialize looking for solr.xml: /mnt/ssd/jenkins/workspace/Lucene-Solr-trunk-Linux-Java8-64/checkout/solr/build/solr-core/test-files/solr/solr.xml
[junit4:junit4]   2> 220 T2290 oasc.CoreContainer.<init> New CoreContainer 624422337
[junit4:junit4]   2> 220 T2290 oasc.CoreContainer.load Loading CoreContainer using Solr Home: '/mnt/ssd/jenkins/workspace/Lucene-Solr-trunk-Linux-Java8-64/checkout/solr/build/solr-core/test-files/solr/'
[junit4:junit4]   2> 220 T2290 oasc.SolrResourceLoader.<init> new SolrResourceLoader for directory: '/mnt/ssd/jenkins/workspace/Lucene-Solr-trunk-Linux-Java8-64/checkout/solr/build/solr-core/test-files/solr/'
[junit4:junit4]   2> 225 T2290 oasc.CoreContainer.load Registering Log Listener
[junit4:junit4]   2> 231 T2290 oashc.HttpShardHandlerFactory.getParameter Setting socketTimeout to: 0
[junit4:junit4]   2> 232 T2290 oashc.HttpShardHandlerFactory.getParameter Setting urlScheme to: http://
[junit4:junit4]   2> 232 T2290 oashc.HttpShardHandlerFactory.getParameter Setting connTimeout to: 0
[junit4:junit4]   2> 232 T2290 oashc.HttpShardHandlerFactory.getParameter Setting maxConnectionsPerHost to: 20
[junit4:junit4]   2> 232 T2290 oashc.HttpShardHandlerFactory.getParameter Setting corePoolSize to: 0
[junit4:junit4]   2> 233 T2290 oashc.HttpShardHandlerFactory.getParameter Setting maximumPoolSize to: 2147483647
[junit4:junit4]   2> 233 T2290 oashc.HttpShardHandlerFactory.getParameter Setting maxThreadIdleTime to: 5
[junit4:junit4]   2> 233 T2290 oashc.HttpShardHandlerFactory.getParameter Setting sizeOfQueue to: -1
[junit4:junit4]   2> 233 T2290 oashc.HttpShardHandlerFactory.getParameter Setting fairnessPolicy to: false
[junit4:junit4]   2> 233 T2290 oascsi.HttpClientUtil.createClient Creating new http client, config:maxConnectionsPerHost=20&maxConnections=10000&socketTimeout=0&connTimeout=0&retry=false
[junit4:junit4]   2> 237 T2290 oasc.CoreContainer.create Creating SolrCore 'collection1' using instanceDir: /mnt/ssd/jenkins/workspace/Lucene-Solr-trunk-Linux-Java8-64/checkout/solr/build/solr-core/test-files/solr/collection1
[junit4:junit4]   2> 237 T2290 oasc.SolrResourceLoader.<init> new SolrResourceLoader for directory: '/mnt/ssd/jenkins/workspace/Lucene-Solr-trunk-Linux-Java8-64/checkout/solr/build/solr-core/test-files/solr/collection1/'
[junit4:junit4]   2> 238 T2290 oasc.SolrResourceLoader.replaceClassLoader Adding 'file:/mnt/ssd/jenkins/workspace/Lucene-Solr-trunk-Linux-Java8-64/checkout/solr/build/solr-core/test-files/solr/collection1/lib/README' to classloader
[junit4:junit4]   2> 238 T2290 oasc.SolrResourceLoader.replaceClassLoader Adding 'file:/mnt/ssd/jenkins/workspace/Lucene-Solr-trunk-Linux-Java8-64/checkout/solr/build/solr-core/test-files/solr/collection1/lib/classes/' to classloader
[junit4:junit4]   2> 253 T2290 oasc.SolrConfig.<init> Using Lucene MatchVersion: LUCENE_50
[junit4:junit4]   2> 280 T2290 oasc.SolrConfig.<init> Loaded SolrConfig: solrconfig-elevate.xml
[junit4:junit4]   2> 280 T2290 oass.IndexSchema.readSchema Reading Solr Schema
[junit4:junit4]   2> 282 T2290 oass.IndexSchema.readSchema Schema name=example
[junit4:junit4]   2> 382 T2290 oass.IndexSchema.readSchema default search field in schema is text
[junit4:junit4]   2> 384 T2290 oass.IndexSchema.readSchema unique key field: id
[junit4:junit4]   2> 386 T2290 oasc.SolrCore.<init> [collection1] Opening new SolrCore at /mnt/ssd/jenkins/workspace/Lucene-Solr-trunk-Linux-Java8-64/checkout/solr/build/solr-core/test-files/solr/collection1/, dataDir=./org.apache.solr.handler.component.DistributedQueryElevationComponentTest-1341779699310/shard0/data/
[junit4:junit4]   2> 386 T2290 oasc.JmxMonitoredMap.<init> JMX monitoring is enabled. Adding Solr mbeans to JMX Server: com.sun.jmx.mbeanserver.JmxMBeanServer@485faba7
[junit4:junit4]   2> 386 T2290 oasc.SolrCore.getNewIndexDir WARNING New index directory detected: old=null new=./org.apache.solr.handler.component.DistributedQueryElevationComponentTest-1341779699310/shard0/data/index/
[junit4:junit4]   2> 387 T2290 oasc.SolrCore.initIndex WARNING [collection1] Solr index directory './org.apache.solr.handler.component.DistributedQueryElevationComponentTest-1341779699310/shard0/data/index' doesn't exist. Creating new index...
[junit4:junit4]   2> 388 T2290 oasc.SolrDeletionPolicy.onCommit SolrDeletionPolicy.onCommit: commits:num=1
[junit4:junit4]   2> 		commit{dir=MockDirWrapper(org.apache.lucene.store.RAMDirectory@6ad45306 lockFactory=org.apache.lucene.store.SingleInstanceLockFactory@1c2db33),segFN=segments_1,generation=1,filenames=[segments_1]
[junit4:junit4]   2> 388 T2290 oasc.SolrDeletionPolicy.updateCommits newest commit = 1
[junit4:junit4]   2> 389 T2290 oasc.RequestHandlers.initHandlersFromConfig created /update: solr.UpdateRequestHandler
[junit4:junit4]   2> 389 T2290 oasc.RequestHandlers.initHandlersFromConfig created /elevate: org.apache.solr.handler.component.SearchHandler
[junit4:junit4]   2> 390 T2290 oasc.RequestHandlers.initHandlersFromConfig created /dataElevate: org.apache.solr.handler.component.SearchHandler
[junit4:junit4]   2> 390 T2290 oashl.XMLLoader.init xsltCacheLifetimeSeconds=60
[junit4:junit4]   2> 391 T2290 oasc.RequestHandlers.initHandlersFromConfig WARNING no default request handler is registered (either '/select' or 'standard')
[junit4:junit4]   2> 392 T2290 oasc.SolrCore.initDeprecatedSupport WARNING solrconfig.xml uses deprecated <admin/gettableFiles>, Please update your config to use the ShowFileRequestHandler.
[junit4:junit4]   2> 393 T2290 oasc.SolrCore.initDeprecatedSupport WARNING adding ShowFileRequestHandler with hidden files: [SOLRCONFIG-MASTER2.XML, SCHEMA-PHRASESUGGEST.XML, SOLRCONFIG-SPELLCHECKER.XML, SCHEMA-IB.XML, SOLRCONFIG-TERMINDEX.XML, BAD-SCHEMA-DUP-FIELD.XML, SCHEMA-DFR.XML, BAD-SCHEMA-UNIQUEKEY-USES-DEFAULT.XML, SOLRCONFIG-MASTER1.XML, XSLT, CURRENCY.XML, STOPWITHBOM.TXT, SCHEMA_CODEC.XML, SCHEMA-BM25.XML, SCHEMA-LUCENEMATCHVERSION.XML, SOLRCONFIG-FUNCTIONQUERY.XML, SOLRCONFIG-PROPINJECT.XML, SOLRCONFIG-SPELLCHECKCOMPONENT.XML, SOLRCONFIG-UPDATE-PROCESSOR-CHAINS.XML, SOLRCONFIG-QUERYSENDER.XML, DA_COMPOUNDDICTIONARY.TXT, SCHEMA-BINARYFIELD.XML, BAD-SCHEMA-NOT-INDEXED-BUT-NORMS.XML, STOP-2.TXT, HUNSPELL-TEST.AFF, STOP-1.TXT, MAPPING-ISOLATIN1ACCENT.TXT, SOLRCONFIG-SLAVE.XML, SYNONYMS.TXT, KEEP-2.TXT, STOP-SNOWBALL.TXT, FRENCHARTICLES.TXT, STOPWORDS.TXT, STEMDICT.TXT, SOLRCONFIG-MERGEPOLICY.XML, SCHEMA11.XML, BAD-SCHEMA-DUP-FIELDTYPE.XML, SOLRCONFIG_CODEC.XML, SOLRCONFIG-LAZYWRITER.XML, DA_UTF8.XML, BAD-MP-SOLRCONFIG.XML, SCHEMA-SPELLCHECKER.XML, SOLRCONFIG-SIMPLELOCK.XML, SOLRCONFIG-CACHING.XML, BAD-SCHEMA-UNIQUEKEY-IS-COPYFIELD-DEST.XML, BAD-SCHEMA-SIM-GLOBAL-VS-FT-MISMATCH.XML, SCHEMA-STOP-KEEP.XML, SOLRCONFIG-SLAVE1.XML, SCHEMASURROUND.XML, PHRASESUGGEST.TXT, SOLRCONFIG-PROPINJECT-INDEXDEFAULT.XML, OPEN-EXCHANGE-RATES.JSON, STOPTYPES-1.TXT, SCHEMA15.XML, KEEP-1.TXT, SOLRCONFIG-ELEVATE.XML, SCHEMA-COPYFIELD-TEST.XML, SCHEMA-REVERSED.XML, BAD_SOLRCONFIG.XML, BAD-SCHEMA-NOT-INDEXED-BUT-TF.XML, SCHEMA-TRIE.XML, SCHEMA-LMJELINEKMERCER.XML, BAD-SCHEMA-NOT-INDEXED-BUT-POS.XML, SOLRCONFIG-REQHANDLER.INCL, BAD-SCHEMA-EXTERNAL-FILEFIELD.XML, SOLRCONFIG-DELPOLICY1.XML, SCHEMA-REPLICATION1.XML, SOLRCONFIG-MASTER1-KEEPONEBACKUP.XML, SOLRCONFIG-MASTER.XML, SCHEMA-NUMERIC.XML, STOPTYPES-2.TXT, SOLRCONFIG-SOLR-749.XML, SOLRCONFIG-TLOG.XML, SCHEMA-MINIMAL.XML, HUNSPELL-TEST.DIC, SCHEMA-FOLDING.XML, SOLRCONFIG_PERF.XML, SOLRCONFIG-PHRASESUGGEST.XML, SOLRCONFIG-SOLCOREPROPERTIES.XML, BAD-SCHEMA-OMIT-TF-BUT-NOT-POS.XML, SOLRCONFIG-MASTER3.XML, ELEVATE.XML, SCHEMA-NOT-REQUIRED-UNIQUE-KEY.XML, SOLRCONFIG-HIGHLIGHT.XML, SCHEMA-REQUIRED-FIELDS.XML, SOLRCONFIG-NATIVELOCK.XML, OLD_SYNONYMS.TXT, STOPWORDSWRONGENCODING.TXT, BAD-SCHEMA-NONTEXT-ANALYZER.XML, SCHEMA-COLLATE.XML, SOLRCONFIG-ALTDIRECTORY.XML, SCHEMA-CHARFILTERS.XML, SCHEMA-TFIDF.XML, SCHEMA-LMDIRICHLET.XML, BAD-SCHEMA-DUP-DYNAMICFIELD.XML, SCHEMA.XML, SOLRCONFIG-DELPOLICY2.XML, PROTWORDS.TXT, SCHEMA-SIM.XML, SOLRCONFIG-ENABLEPLUGIN.XML, WDFTYPES.TXT, SOLRCONFIG-BASIC.XML, SCHEMA-REPLICATION2.XML, SOLRCONFIG-XINCLUDE.XML, COMPOUNDDICTIONARY.TXT, HYPHENATION.DTD, SCHEMA12.XML, SOLRCONFIG-NOCACHE.XML, SOLRCONFIG-TRANSFORMERS.XML, SOLRCONFIG-QUERYSENDER-NOQUERY.XML, SOLRCONFIG-REPEATER.XML]
[junit4:junit4]   2> 394 T2290 oass.SolrIndexSearcher.<init> Opening Searcher@62b29b28 main
[junit4:junit4]   2> 395 T2290 oass.SolrIndexSearcher.getIndexDir WARNING WARNING: Directory impl does not support setting indexDir: org.apache.lucene.store.MockDirectoryWrapper
[junit4:junit4]   2> 395 T2290 oasu.CommitTracker.<init> Hard AutoCommit: disabled
[junit4:junit4]   2> 395 T2290 oasu.CommitTracker.<init> Soft AutoCommit: disabled
[junit4:junit4]   2> 396 T2290 oashc.QueryElevationComponent.inform Loading QueryElevation from: /mnt/ssd/jenkins/workspace/Lucene-Solr-trunk-Linux-Java8-64/checkout/solr/build/solr-core/test-files/solr/collection1/conf/elevate.xml
[junit4:junit4]   2> 400 T2290 oashc.QueryElevationComponent.inform Loading QueryElevation from: /mnt/ssd/jenkins/workspace/Lucene-Solr-trunk-Linux-Java8-64/checkout/solr/build/solr-core/test-files/solr/collection1/conf/elevate.xml
[junit4:junit4]   2> 405 T2310 oasc.SolrCore.registerSearcher [collection1] Registered new searcher Searcher@62b29b28 main{StandardDirectoryReader(segments_1:1)}
[junit4:junit4]   2> 405 T2290 oasc.CoreContainer.register registering core: collection1
[junit4:junit4]   2> 406 T2290 oass.SolrDispatchFilter.init user.dir=/mnt/ssd/jenkins/workspace/Lucene-Solr-trunk-Linux-Java8-64/checkout/solr/build/solr-core/test/J1
[junit4:junit4]   2> 406 T2290 oass.SolrDispatchFilter.init SolrDispatchFilter.init() done
[junit4:junit4]   2> 406 T2290 oascsi.HttpClientUtil.createClient Creating new http client, config:maxConnections=128&maxConnectionsPerHost=32&followRedirects=false
[junit4:junit4]   2> 409 T2290 oejs.Server.doStart jetty-8.1.2.v20120308
[junit4:junit4]   2> 411 T2290 oejs.AbstractConnector.doStart Started SocketConnector@0.0.0.0:38554
[junit4:junit4]   2> 411 T2290 oasc.SolrResourceLoader.locateSolrHome JNDI not configured for solr (NoInitialContextEx)
[junit4:junit4]   2> 412 T2290 oasc.SolrResourceLoader.locateSolrHome using system property solr.solr.home: /mnt/ssd/jenkins/workspace/Lucene-Solr-trunk-Linux-Java8-64/checkout/solr/build/solr-core/test-files/solr
[junit4:junit4]   2> 412 T2290 oasc.SolrResourceLoader.<init> new SolrResourceLoader for deduced Solr Home: '/mnt/ssd/jenkins/workspace/Lucene-Solr-trunk-Linux-Java8-64/checkout/solr/build/solr-core/test-files/solr/'
[junit4:junit4]   2> 414 T2290 oass.SolrDispatchFilter.init SolrDispatchFilter.init()
[junit4:junit4]   2> 414 T2290 oasc.SolrResourceLoader.locateSolrHome JNDI not configured for solr (NoInitialContextEx)
[junit4:junit4]   2> 415 T2290 oasc.SolrResourceLoader.locateSolrHome using system property solr.solr.home: /mnt/ssd/jenkins/workspace/Lucene-Solr-trunk-Linux-Java8-64/checkout/solr/build/solr-core/test-files/solr
[junit4:junit4]   2> 415 T2290 oasc.CoreContainer$Initializer.initialize looking for solr.xml: /mnt/ssd/jenkins/workspace/Lucene-Solr-trunk-Linux-Java8-64/checkout/solr/build/solr-core/test-files/solr/solr.xml
[junit4:junit4]   2> 415 T2290 oasc.CoreContainer.<init> New CoreContainer 1653743860
[junit4:junit4]   2> 415 T2290 oasc.CoreContainer.load Loading CoreContainer using Solr Home: '/mnt/ssd/jenkins/workspace/Lucene-Solr-trunk-Linux-Java8-64/checkout/solr/build/solr-core/test-files/solr/'
[junit4:junit4]   2> 415 T2290 oasc.SolrResourceLoader.<init> new SolrResourceLoader for directory: '/mnt/ssd/jenkins/workspace/Lucene-Solr-trunk-Linux-Java8-64/checkout/solr/build/solr-core/test-files/solr/'
[junit4:junit4]   2> 420 T2290 oasc.CoreContainer.load Registering Log Listener
[junit4:junit4]   2> 426 T2290 oashc.HttpShardHandlerFactory.getParameter Setting socketTimeout to: 0
[junit4:junit4]   2> 426 T2290 oashc.HttpShardHandlerFactory.getParameter Setting urlScheme to: http://
[junit4:junit4]   2> 426 T2290 oashc.HttpShardHandlerFactory.getParameter Setting connTimeout to: 0
[junit4:junit4]   2> 427 T2290 oashc.HttpShardHandlerFactory.getParameter Setting maxConnectionsPerHost to: 20
[junit4:junit4]   2> 427 T2290 oashc.HttpShardHandlerFactory.getParameter Setting corePoolSize to: 0
[junit4:junit4]   2> 427 T2290 oashc.HttpShardHandlerFactory.getParameter Setting maximumPoolSize to: 2147483647
[junit4:junit4]   2> 427 T2290 oashc.HttpShardHandlerFactory.getParameter Setting maxThreadIdleTime to: 5
[junit4:junit4]   2> 427 T2290 oashc.HttpShardHandlerFactory.getParameter Setting sizeOfQueue to: -1
[junit4:junit4]   2> 427 T2290 oashc.HttpShardHandlerFactory.getParameter Setting fairnessPolicy to: false
[junit4:junit4]   2> 428 T2290 oascsi.HttpClientUtil.createClient Creating new http client, config:maxConnectionsPerHost=20&maxConnections=10000&socketTimeout=0&connTimeout=0&retry=false
[junit4:junit4]   2> 431 T2290 oasc.CoreContainer.create Creating SolrCore 'collection1' using instanceDir: /mnt/ssd/jenkins/workspace/Lucene-Solr-trunk-Linux-Java8-64/checkout/solr/build/solr-core/test-files/solr/collection1
[junit4:junit4]   2> 431 T2290 oasc.SolrResourceLoader.<init> new SolrResourceLoader for directory: '/mnt/ssd/jenkins/workspace/Lucene-Solr-trunk-Linux-Java8-64/checkout/solr/build/solr-core/test-files/solr/collection1/'
[junit4:junit4]   2> 432 T2290 oasc.SolrResourceLoader.replaceClassLoader Adding 'file:/mnt/ssd/jenkins/workspace/Lucene-Solr-trunk-Linux-Java8-64/checkout/solr/build/solr-core/test-files/solr/collection1/lib/README' to classloader
[junit4:junit4]   2> 432 T2290 oasc.SolrResourceLoader.replaceClassLoader Adding 'file:/mnt/ssd/jenkins/workspace/Lucene-Solr-trunk-Linux-Java8-64/checkout/solr/build/solr-core/test-files/solr/collection1/lib/classes/' to classloader
[junit4:junit4]   2> 443 T2290 oasc.SolrConfig.<init> Using Lucene MatchVersion: LUCENE_50
[junit4:junit4]   2> 468 T2290 oasc.SolrConfig.<init> Loaded SolrConfig: solrconfig-elevate.xml
[junit4:junit4]   2> 468 T2290 oass.IndexSchema.readSchema Reading Solr Schema
[junit4:junit4]   2> 470 T2290 oass.IndexSchema.readSchema Schema name=example
[junit4:junit4]   2> 482 T1562 oaz.ClientCnxn$SendThread.startConnect Opening socket connection to server localhost.localdomain/127.0.0.1:36449
[junit4:junit4]   2> 483 T1562 oaz.ClientCnxn$SendThread.run WARNING Session 0x138684b1f970010 for server null, unexpected error, closing socket connection and attempting reconnect java.net.ConnectException: Connection refused
[junit4:junit4]   2> 	at sun.nio.ch.SocketChannelImpl.checkConnect(Native Method)
[junit4:junit4]   2> 	at sun.nio.ch.SocketChannelImpl.finishConnect(SocketChannelImpl.java:692)
[junit4:junit4]   2> 	at org.apache.zookeeper.ClientCnxn$SendThread.run(ClientCnxn.java:1146)
[junit4:junit4]   2> 
[junit4:junit4]   2> 580 T2290 oass.IndexSchema.readSchema default search field in schema is text
[junit4:junit4]   2> 581 T2290 oass.IndexSchema.readSchema unique key field: id
[junit4:junit4]   2> 583 T2290 oasc.SolrCore.<init> [collection1] Opening new SolrCore at /mnt/ssd/jenkins/workspace/Lucene-Solr-trunk-Linux-Java8-64/checkout/solr/build/solr-core/test-files/solr/collection1/, dataDir=./org.apache.solr.handler.component.DistributedQueryElevationComponentTest-1341779699310/shard1/data/
[junit4:junit4]   2> 583 T2290 oasc.JmxMonitoredMap.<init> JMX monitoring is enabled. Adding Solr mbeans to JMX Server: com.sun.jmx.mbeanserver.JmxMBeanServer@485faba7
[junit4:junit4]   2> 584 T2290 oasc.SolrCore.getNewIndexDir WARNING New index directory detected: old=null new=./org.apache.solr.handler.component.DistributedQueryElevationComponentTest-1341779699310/shard1/data/index/
[junit4:junit4]   2> 584 T2290 oasc.SolrCore.initIndex WARNING [collection1] Solr index directory './org.apache.solr.handler.component.DistributedQueryElevationComponentTest-1341779699310/shard1/data/index' doesn't exist. Creating new index...
[junit4:junit4]   2> 585 T2290 oasc.SolrDeletionPolicy.onCommit SolrDeletionPolicy.onCommit: commits:num=1
[junit4:junit4]   2> 		commit{dir=MockDirWrapper(org.apache.lucene.store.RAMDirectory@52e9e291 lockFactory=org.apache.lucene.store.SingleInstanceLockFactory@ba12608),segFN=segments_1,generation=1,filenames=[segments_1]
[junit4:junit4]   2> 585 T2290 oasc.SolrDeletionPolicy.updateCommits newest commit = 1
[junit4:junit4]   2> 586 T2290 oasc.RequestHandlers.initHandlersFromConfig created /update: solr.UpdateRequestHandler
[junit4:junit4]   2> 587 T2290 oasc.RequestHandlers.initHandlersFromConfig created /elevate: org.apache.solr.handler.component.SearchHandler
[junit4:junit4]   2> 587 T2290 oasc.RequestHandlers.initHandlersFromConfig created /dataElevate: org.apache.solr.handler.component.SearchHandler
[junit4:junit4]   2> 588 T2290 oashl.XMLLoader.init xsltCacheLifetimeSeconds=60
[junit4:junit4]   2> 588 T2290 oasc.RequestHandlers.initHandlersFromConfig WARNING no default request handler is registered (either '/select' or 'standard')
[junit4:junit4]   2> 589 T2290 oasc.SolrCore.initDeprecatedSupport WARNING solrconfig.xml uses deprecated <admin/gettableFiles>, Please update your config to use the ShowFileRequestHandler.
[junit4:junit4]   2> 590 T2290 oasc.SolrCore.initDeprecatedSupport WARNING adding ShowFileRequestHandler with hidden files: [SOLRCONFIG-MASTER2.XML, SCHEMA-PHRASESUGGEST.XML, SOLRCONFIG-SPELLCHECKER.XML, SCHEMA-IB.XML, SOLRCONFIG-TERMINDEX.XML, BAD-SCHEMA-DUP-FIELD.XML, SCHEMA-DFR.XML, BAD-SCHEMA-UNIQUEKEY-USES-DEFAULT.XML, SOLRCONFIG-MASTER1.XML, XSLT, CURRENCY.XML, STOPWITHBOM.TXT, SCHEMA_CODEC.XML, SCHEMA-BM25.XML, SCHEMA-LUCENEMATCHVERSION.XML, SOLRCONFIG-FUNCTIONQUERY.XML, SOLRCONFIG-PROPINJECT.XML, SOLRCONFIG-SPELLCHECKCOMPONENT.XML, SOLRCONFIG-UPDATE-PROCESSOR-CHAINS.XML, SOLRCONFIG-QUERYSENDER.XML, DA_COMPOUNDDICTIONARY.TXT, SCHEMA-BINARYFIELD.XML, BAD-SCHEMA-NOT-INDEXED-BUT-NORMS.XML, STOP-2.TXT, HUNSPELL-TEST.AFF, STOP-1.TXT, MAPPING-ISOLATIN1ACCENT.TXT, SOLRCONFIG-SLAVE.XML, SYNONYMS.TXT, KEEP-2.TXT, STOP-SNOWBALL.TXT, FRENCHARTICLES.TXT, STOPWORDS.TXT, STEMDICT.TXT, SOLRCONFIG-MERGEPOLICY.XML, SCHEMA11.XML, BAD-SCHEMA-DUP-FIELDTYPE.XML, SOLRCONFIG_CODEC.XML, SOLRCONFIG-LAZYWRITER.XML, DA_UTF8.XML, BAD-MP-SOLRCONFIG.XML, SCHEMA-SPELLCHECKER.XML, SOLRCONFIG-SIMPLELOCK.XML, SOLRCONFIG-CACHING.XML, BAD-SCHEMA-UNIQUEKEY-IS-COPYFIELD-DEST.XML, BAD-SCHEMA-SIM-GLOBAL-VS-FT-MISMATCH.XML, SCHEMA-STOP-KEEP.XML, SOLRCONFIG-SLAVE1.XML, SCHEMASURROUND.XML, PHRASESUGGEST.TXT, SOLRCONFIG-PROPINJECT-INDEXDEFAULT.XML, OPEN-EXCHANGE-RATES.JSON, STOPTYPES-1.TXT, SCHEMA15.XML, KEEP-1.TXT, SOLRCONFIG-ELEVATE.XML, SCHEMA-COPYFIELD-TEST.XML, SCHEMA-REVERSED.XML, BAD_SOLRCONFIG.XML, BAD-SCHEMA-NOT-INDEXED-BUT-TF.XML, SCHEMA-TRIE.XML, SCHEMA-LMJELINEKMERCER.XML, BAD-SCHEMA-NOT-INDEXED-BUT-POS.XML, SOLRCONFIG-REQHANDLER.INCL, BAD-SCHEMA-EXTERNAL-FILEFIELD.XML, SOLRCONFIG-DELPOLICY1.XML, SCHEMA-REPLICATION1.XML, SOLRCONFIG-MASTER1-KEEPONEBACKUP.XML, SOLRCONFIG-MASTER.XML, SCHEMA-NUMERIC.XML, STOPTYPES-2.TXT, SOLRCONFIG-SOLR-749.XML, SOLRCONFIG-TLOG.XML, SCHEMA-MINIMAL.XML, HUNSPELL-TEST.DIC, SCHEMA-FOLDING.XML, SOLRCONFIG_PERF.XML, SOLRCONFIG-PHRASESUGGEST.XML, SOLRCONFIG-SOLCOREPROPERTIES.XML, BAD-SCHEMA-OMIT-TF-BUT-NOT-POS.XML, SOLRCONFIG-MASTER3.XML, ELEVATE.XML, SCHEMA-NOT-REQUIRED-UNIQUE-KEY.XML, SOLRCONFIG-HIGHLIGHT.XML, SCHEMA-REQUIRED-FIELDS.XML, SOLRCONFIG-NATIVELOCK.XML, OLD_SYNONYMS.TXT, STOPWORDSWRONGENCODING.TXT, BAD-SCHEMA-NONTEXT-ANALYZER.XML, SCHEMA-COLLATE.XML, SOLRCONFIG-ALTDIRECTORY.XML, SCHEMA-CHARFILTERS.XML, SCHEMA-TFIDF.XML, SCHEMA-LMDIRICHLET.XML, BAD-SCHEMA-DUP-DYNAMICFIELD.XML, SCHEMA.XML, SOLRCONFIG-DELPOLICY2.XML, PROTWORDS.TXT, SCHEMA-SIM.XML, SOLRCONFIG-ENABLEPLUGIN.XML, WDFTYPES.TXT, SOLRCONFIG-BASIC.XML, SCHEMA-REPLICATION2.XML, SOLRCONFIG-XINCLUDE.XML, COMPOUNDDICTIONARY.TXT, HYPHENATION.DTD, SCHEMA12.XML, SOLRCONFIG-NOCACHE.XML, SOLRCONFIG-TRANSFORMERS.XML, SOLRCONFIG-QUERYSENDER-NOQUERY.XML, SOLRCONFIG-REPEATER.XML]
[junit4:junit4]   2> 592 T2290 oass.SolrIndexSearcher.<init> Opening Searcher@36836161 main
[junit4:junit4]   2> 592 T2290 oass.SolrIndexSearcher.getIndexDir WARNING WARNING: Directory impl does not support setting indexDir: org.apache.lucene.store.MockDirectoryWrapper
[junit4:junit4]   2> 593 T2290 oasu.CommitTracker.<init> Hard AutoCommit: disabled
[junit4:junit4]   2> 593 T2290 oasu.CommitTracker.<init> Soft AutoCommit: disabled
[junit4:junit4]   2> 593 T2290 oashc.QueryElevationComponent.inform Loading QueryElevation from: /mnt/ssd/jenkins/workspace/Lucene-Solr-trunk-Linux-Java8-64/checkout/solr/build/solr-core/test-files/solr/collection1/conf/elevate.xml
[junit4:junit4]   2> 601 T2290 oashc.QueryElevationComponent.inform Loading QueryElevation from: /mnt/ssd/jenkins/workspace/Lucene-Solr-trunk-Linux-Java8-64/checkout/solr/build/solr-core/test-files/solr/collection1/conf/elevate.xml
[junit4:junit4]   2> 608 T2320 oasc.SolrCore.registerSearcher [collection1] Registered new searcher Searcher@36836161 main{StandardDirectoryReader(segments_1:1)}
[junit4:junit4]   2> 608 T2290 oasc.CoreContainer.register registering core: collection1
[junit4:junit4]   2> 609 T2290 oass.SolrDispatchFilter.init user.dir=/mnt/ssd/jenkins/workspace/Lucene-Solr-trunk-Linux-Java8-64/checkout/solr/build/solr-core/test/J1
[junit4:junit4]   2> 609 T2290 oass.SolrDispatchFilter.init SolrDispatchFilter.init() done
[junit4:junit4]   2> 609 T2290 oascsi.HttpClientUtil.createClient Creating new http client, config:maxConnections=128&maxConnectionsPerHost=32&followRedirects=false
[junit4:junit4]   2> 612 T2290 oejs.Server.doStart jetty-8.1.2.v20120308
[junit4:junit4]   2> 614 T2290 oejs.AbstractConnector.doStart Started SocketConnector@0.0.0.0:41788
[junit4:junit4]   2> 614 T2290 oasc.SolrResourceLoader.locateSolrHome JNDI not configured for solr (NoInitialContextEx)
[junit4:junit4]   2> 614 T2290 oasc.SolrResourceLoader.locateSolrHome using system property solr.solr.home: /mnt/ssd/jenkins/workspace/Lucene-Solr-trunk-Linux-Java8-64/checkout/solr/build/solr-core/test-files/solr
[junit4:junit4]   2> 615 T2290 oasc.SolrResourceLoader.<init> new SolrResourceLoader for deduced Solr Home: '/mnt/ssd/jenkins/workspace/Lucene-Solr-trunk-Linux-Java8-64/checkout/solr/build/solr-core/test-files/solr/'
[junit4:junit4]   2> 618 T2290 oass.SolrDispatchFilter.init SolrDispatchFilter.init()
[junit4:junit4]   2> 619 T2290 oasc.SolrResourceLoader.locateSolrHome JNDI not configured for solr (NoInitialContextEx)
[junit4:junit4]   2> 619 T2290 oasc.SolrResourceLoader.locateSolrHome using system property solr.solr.home: /mnt/ssd/jenkins/workspace/Lucene-Solr-trunk-Linux-Java8-64/checkout/solr/build/solr-core/test-files/solr
[junit4:junit4]   2> 619 T2290 oasc.CoreContainer$Initializer.initialize looking for solr.xml: /mnt/ssd/jenkins/workspace/Lucene-Solr-trunk-Linux-Java8-64/checkout/solr/build/solr-core/test-files/solr/solr.xml
[junit4:junit4]   2> 619 T2290 oasc.CoreContainer.<init> New CoreContainer 1635014057
[junit4:junit4]   2> 620 T2290 oasc.CoreContainer.load Loading CoreContainer using Solr Home: '/mnt/ssd/jenkins/workspace/Lucene-Solr-trunk-Linux-Java8-64/checkout/solr/build/solr-core/test-files/solr/'
[junit4:junit4]   2> 620 T2290 oasc.SolrResourceLoader.<init> new SolrResourceLoader for directory: '/mnt/ssd/jenkins/workspace/Lucene-Solr-trunk-Linux-Java8-64/checkout/solr/build/solr-core/test-files/solr/'
[junit4:junit4]   2> 626 T2290 oasc.CoreContainer.load Registering Log Listener
[junit4:junit4]   2> 633 T2290 oashc.HttpShardHandlerFactory.getParameter Setting socketTimeout to: 0
[junit4:junit4]   2> 634 T2290 oashc.HttpShardHandlerFactory.getParameter Setting urlScheme to: http://
[junit4:junit4]   2> 634 T2290 oashc.HttpShardHandlerFactory.getParameter Setting connTimeout to: 0
[junit4:junit4]   2> 634 T2290 oashc.HttpShardHandlerFactory.getParameter Setting maxConnectionsPerHost to: 20
[junit4:junit4]   2> 634 T2290 oashc.HttpShardHandlerFactory.getParameter Setting corePoolSize to: 0
[junit4:junit4]   2> 634 T2290 oashc.HttpShardHandlerFactory.getParameter Setting maximumPoolSize to: 2147483647
[junit4:junit4]   2> 634 T2290 oashc.HttpShardHandlerFactory.getParameter Setting maxThreadIdleTime to: 5
[junit4:junit4]   2> 635 T2290 oashc.HttpShardHandlerFactory.getParameter Setting sizeOfQueue to: -1
[junit4:junit4]   2> 635 T2290 oashc.HttpShardHandlerFactory.getParameter Setting fairnessPolicy to: false
[junit4:junit4]   2> 635 T2290 oascsi.HttpClientUtil.createClient Creating new http client, config:maxConnectionsPerHost=20&maxConnections=10000&socketTimeout=0&connTimeout=0&retry=false
[junit4:junit4]   2> 639 T2290 oasc.CoreContainer.create Creating SolrCore 'collection1' using instanceDir: /mnt/ssd/jenkins/workspace/Lucene-Solr-trunk-Linux-Java8-64/checkout/solr/build/solr-core/test-files/solr/collection1
[junit4:junit4]   2> 639 T2290 oasc.SolrResourceLoader.<init> new SolrResourceLoader for directory: '/mnt/ssd/jenkins/workspace/Lucene-Solr-trunk-Linux-Java8-64/checkout/solr/build/solr-core/test-files/solr/collection1/'
[junit4:junit4]   2> 639 T2290 oasc.SolrResourceLoader.replaceClassLoader Adding 'file:/mnt/ssd/jenkins/workspace/Lucene-Solr-trunk-Linux-Java8-64/checkout/solr/build/solr-core/test-files/solr/collection1/lib/README' to classloader
[junit4:junit4]   2> 639 T2290 oasc.SolrResourceLoader.replaceClassLoader Adding 'file:/mnt/ssd/jenkins/workspace/Lucene-Solr-trunk-Linux-Java8-64/checkout/solr/build/solr-core/test-files/solr/collection1/lib/classes/' to classloader
[junit4:junit4]   2> 652 T2290 oasc.SolrConfig.<init> Using Lucene MatchVersion: LUCENE_50
[junit4:junit4]   2> 689 T2290 oasc.SolrConfig.<init> Loaded SolrConfig: solrconfig-elevate.xml
[junit4:junit4]   2> 689 T2290 oass.IndexSchema.readSchema Reading Solr Schema
[junit4:junit4]   2> 692 T2290 oass.IndexSchema.readSchema Schema name=example
[junit4:junit4]   2> 809 T2290 oass.IndexSchema.readSchema default search field in schema is text
[junit4:junit4]   2> 810 T2290 oass.IndexSchema.readSchema unique key field: id
[junit4:junit4]   2> 812 T2290 oasc.SolrCore.<init> [collection1] Opening new SolrCore at /mnt/ssd/jenkins/workspace/Lucene-Solr-trunk-Linux-Java8-64/checkout/solr/build/solr-core/test-files/solr/collection1/, dataDir=./org.apache.solr.handler.component.DistributedQueryElevationComponentTest-1341779699310/shard2/data/
[junit4:junit4]   2> 812 T2290 oasc.JmxMonitoredMap.<init> JMX monitoring is enabled. Adding Solr mbeans to JMX Server: com.sun.jmx.mbeanserver.JmxMBeanServer@485faba7
[junit4:junit4]   2> 812 T2290 oasc.SolrCore.getNewIndexDir WARNING New index directory detected: old=null new=./org.apache.solr.handler.component.DistributedQueryElevationComponentTest-1341779699310/shard2/data/index/
[junit4:junit4]   2> 813 T2290 oasc.SolrCore.initIndex WARNING [collection1] Solr index directory './org.apache.solr.handler.component.DistributedQueryElevationComponentTest-1341779699310/shard2/data/index' doesn't exist. Creating new index...
[junit4:junit4]   2> 814 T2290 oasc.SolrDeletionPolicy.onCommit SolrDeletionPolicy.onCommit: commits:num=1
[junit4:junit4]   2> 		commit{dir=MockDirWrapper(org.apache.lucene.store.RAMDirectory@2393f694 lockFactory=org.apache.lucene.store.SingleInstanceLockFactory@688eb3e8),segFN=segments_1,generation=1,filenames=[segments_1]
[junit4:junit4]   2> 814 T2290 oasc.SolrDeletionPolicy.updateCommits newest commit = 1
[junit4:junit4]   2> 815 T2290 oasc.RequestHandlers.initHandlersFromConfig created /update: solr.UpdateRequestHandler
[junit4:junit4]   2> 815 T2290 oasc.RequestHandlers.initHandlersFromConfig created /elevate: org.apache.solr.handler.component.SearchHandler
[junit4:junit4]   2> 815 T2290 oasc.RequestHandlers.initHandlersFromConfig created /dataElevate: org.apache.solr.handler.component.SearchHandler
[junit4:junit4]   2> 815 T2290 oashl.XMLLoader.init xsltCacheLifetimeSeconds=60
[junit4:junit4]   2> 816 T2290 oasc.RequestHandlers.initHandlersFromConfig WARNING no default request handler is registered (either '/select' or 'standard')
[junit4:junit4]   2> 816 T2290 oasc.SolrCore.initDeprecatedSupport WARNING solrconfig.xml uses deprecated <admin/gettableFiles>, Please update your config to use the ShowFileRequestHandler.
[junit4:junit4]   2> 817 T2290 oasc.SolrCore.initDeprecatedSupport WARNING adding ShowFileRequestHandler with hidden files: [SOLRCONFIG-MASTER2.XML, SCHEMA-PHRASESUGGEST.XML, SOLRCONFIG-SPELLCHECKER.XML, SCHEMA-IB.XML, SOLRCONFIG-TERMINDEX.XML, BAD-SCHEMA-DUP-FIELD.XML, SCHEMA-DFR.XML, BAD-SCHEMA-UNIQUEKEY-USES-DEFAULT.XML, SOLRCONFIG-MASTER1.XML, XSLT, CURRENCY.XML, STOPWITHBOM.TXT, SCHEMA_CODEC.XML, SCHEMA-BM25.XML, SCHEMA-LUCENEMATCHVERSION.XML, SOLRCONFIG-FUNCTIONQUERY.XML, SOLRCONFIG-PROPINJECT.XML, SOLRCONFIG-SPELLCHECKCOMPONENT.XML, SOLRCONFIG-UPDATE-PROCESSOR-CHAINS.XML, SOLRCONFIG-QUERYSENDER.XML, DA_COMPOUNDDICTIONARY.TXT, SCHEMA-BINARYFIELD.XML, BAD-SCHEMA-NOT-INDEXED-BUT-NORMS.XML, STOP-2.TXT, HUNSPELL-TEST.AFF, STOP-1.TXT, MAPPING-ISOLATIN1ACCENT.TXT, SOLRCONFIG-SLAVE.XML, SYNONYMS.TXT, KEEP-2.TXT, STOP-SNOWBALL.TXT, FRENCHARTICLES.TXT, STOPWORDS.TXT, STEMDICT.TXT, SOLRCONFIG-MERGEPOLICY.XML, SCHEMA11.XML, BAD-SCHEMA-DUP-FIELDTYPE.XML, SOLRCONFIG_CODEC.XML, SOLRCONFIG-LAZYWRITER.XML, DA_UTF8.XML, BAD-MP-SOLRCONFIG.XML, SCHEMA-SPELLCHECKER.XML, SOLRCONFIG-SIMPLELOCK.XML, SOLRCONFIG-CACHING.XML, BAD-SCHEMA-UNIQUEKEY-IS-COPYFIELD-DEST.XML, BAD-SCHEMA-SIM-GLOBAL-VS-FT-MISMATCH.XML, SCHEMA-STOP-KEEP.XML, SOLRCONFIG-SLAVE1.XML, SCHEMASURROUND.XML, PHRASESUGGEST.TXT, SOLRCONFIG-PROPINJECT-INDEXDEFAULT.XML, OPEN-EXCHANGE-RATES.JSON, STOPTYPES-1.TXT, SCHEMA15.XML, KEEP-1.TXT, SOLRCONFIG-ELEVATE.XML, SCHEMA-COPYFIELD-TEST.XML, SCHEMA-REVERSED.XML, BAD_SOLRCONFIG.XML, BAD-SCHEMA-NOT-INDEXED-BUT-TF.XML, SCHEMA-TRIE.XML, SCHEMA-LMJELINEKMERCER.XML, BAD-SCHEMA-NOT-INDEXED-BUT-POS.XML, SOLRCONFIG-REQHANDLER.INCL, BAD-SCHEMA-EXTERNAL-FILEFIELD.XML, SOLRCONFIG-DELPOLICY1.XML, SCHEMA-REPLICATION1.XML, SOLRCONFIG-MASTER1-KEEPONEBACKUP.XML, SOLRCONFIG-MASTER.XML, SCHEMA-NUMERIC.XML, STOPTYPES-2.TXT, SOLRCONFIG-SOLR-749.XML, SOLRCONFIG-TLOG.XML, SCHEMA-MINIMAL.XML, HUNSPELL-TEST.DIC, SCHEMA-FOLDING.XML, SOLRCONFIG_PERF.XML, SOLRCONFIG-PHRASESUGGEST.XML, SOLRCONFIG-SOLCOREPROPERTIES.XML, BAD-SCHEMA-OMIT-TF-BUT-NOT-POS.XML, SOLRCONFIG-MASTER3.XML, ELEVATE.XML, SCHEMA-NOT-REQUIRED-UNIQUE-KEY.XML, SOLRCONFIG-HIGHLIGHT.XML, SCHEMA-REQUIRED-FIELDS.XML, SOLRCONFIG-NATIVELOCK.XML, OLD_SYNONYMS.TXT, STOPWORDSWRONGENCODING.TXT, BAD-SCHEMA-NONTEXT-ANALYZER.XML, SCHEMA-COLLATE.XML, SOLRCONFIG-ALTDIRECTORY.XML, SCHEMA-CHARFILTERS.XML, SCHEMA-TFIDF.XML, SCHEMA-LMDIRICHLET.XML, BAD-SCHEMA-DUP-DYNAMICFIELD.XML, SCHEMA.XML, SOLRCONFIG-DELPOLICY2.XML, PROTWORDS.TXT, SCHEMA-SIM.XML, SOLRCONFIG-ENABLEPLUGIN.XML, WDFTYPES.TXT, SOLRCONFIG-BASIC.XML, SCHEMA-REPLICATION2.XML, SOLRCONFIG-XINCLUDE.XML, COMPOUNDDICTIONARY.TXT, HYPHENATION.DTD, SCHEMA12.XML, SOLRCONFIG-NOCACHE.XML, SOLRCONFIG-TRANSFORMERS.XML, SOLRCONFIG-QUERYSENDER-NOQUERY.XML, SOLRCONFIG-REPEATER.XML]
[junit4:junit4]   2> 823 T2290 oass.SolrIndexSearcher.<init> Opening Searcher@34d4699 main
[junit4:junit4]   2> 823 T2290 oass.SolrIndexSearcher.getIndexDir WARNING WARNING: Directory impl does not support setting indexDir: org.apache.lucene.store.MockDirectoryWrapper
[junit4:junit4]   2> 824 T2290 oasu.CommitTracker.<init> Hard AutoCommit: disabled
[junit4:junit4]   2> 824 T2290 oasu.CommitTracker.<init> Soft AutoCommit: disabled
[junit4:junit4]   2> 825 T2290 oashc.QueryElevationComponent.inform Loading QueryElevation from: /mnt/ssd/jenkins/workspace/Lucene-Solr-trunk-Linux-Java8-64/checkout/solr/build/solr-core/test-files/solr/collection1/conf/elevate.xml
[junit4:junit4]   2> 829 T2290 oashc.QueryElevationComponent.inform Loading QueryElevation from: /mnt/ssd/jenkins/workspace/Lucene-Solr-trunk-Linux-Java8-64/checkout/solr/build/solr-core/test-files/solr/collection1/conf/elevate.xml
[junit4:junit4]   2> 834 T2330 oasc.SolrCore.registerSearcher [collection1] Registered new searcher Searcher@34d4699 main{StandardDirectoryReader(segments_1:1)}
[junit4:junit4]   2> 834 T2290 oasc.CoreContainer.register registering core: collection1
[junit4:junit4]   2> 835 T2290 oass.SolrDispatchFilter.init user.dir=/mnt/ssd/jenkins/workspace/Lucene-Solr-trunk-Linux-Java8-64/checkout/solr/build/solr-core/test/J1
[junit4:junit4]   2> 835 T2290 oass.SolrDispatchFilter.init SolrDispatchFilter.init() done
[junit4:junit4]   2> 835 T2290 oascsi.HttpClientUtil.createClient Creating new http client, config:maxConnections=128&maxConnectionsPerHost=32&followRedirects=false
[junit4:junit4]   2> ASYNC  NEW_CORE C119 name=collection1 org.apache.solr.core.SolrCore@372e1c32
[junit4:junit4]   2> 840 T2293 C119 oasu.DirectUpdateHandler2.deleteAll [collection1] REMOVING ALL DOCUMENTS FROM INDEX
[junit4:junit4]   2> 841 T2293 C119 oasc.SolrDeletionPolicy.onInit SolrDeletionPolicy.onInit: commits:num=1
[junit4:junit4]   2> 		commit{dir=MockDirWrapper(org.apache.lucene.store.RAMDirectory@343d32eb lockFactory=org.apache.lucene.store.SingleInstanceLockFactory@527741f7),segFN=segments_1,generation=1,filenames=[segments_1]
[junit4:junit4]   2> 841 T2293 C119 oasc.SolrDeletionPolicy.updateCommits newest commit = 1
[junit4:junit4]   2> 842 T2293 C119 UPDATE [collection1] webapp=/solr path=/update params={version=2&wt=javabin} {deleteByQuery=*:*} 0 2
[junit4:junit4]   2> ASYNC  NEW_CORE C120 name=collection1 org.apache.solr.core.SolrCore@3b20de15
[junit4:junit4]   2> 845 T2303 C120 oasu.DirectUpdateHandler2.deleteAll [collection1] REMOVING ALL DOCUMENTS FROM INDEX
[junit4:junit4]   2> 846 T2303 C120 oasc.SolrDeletionPolicy.onInit SolrDeletionPolicy.onInit: commits:num=1
[junit4:junit4]   2> 		commit{dir=MockDirWrapper(org.apache.lucene.store.RAMDirectory@6ad45306 lockFactory=org.apache.lucene.store.SingleInstanceLockFactory@1c2db33),segFN=segments_1,generation=1,filenames=[segments_1]
[junit4:junit4]   2> 846 T2303 C120 oasc.SolrDeletionPolicy.updateCommits newest commit = 1
[junit4:junit4]   2> 847 T2303 C120 UPDATE [collection1] webapp=/solr path=/update params={version=2&wt=javabin} {deleteByQuery=*:*} 0 3
[junit4:junit4]   2> ASYNC  NEW_CORE C121 name=collection1 org.apache.solr.core.SolrCore@22dcdfd0
[junit4:junit4]   2> 850 T2313 C121 oasu.DirectUpdateHandler2.deleteAll [collection1] REMOVING ALL DOCUMENTS FROM INDEX
[junit4:junit4]   2> 851 T2313 C121 oasc.SolrDeletionPolicy.onInit SolrDeletionPolicy.onInit: commits:num=1
[junit4:junit4]   2> 		commit{dir=MockDirWrapper(org.apache.lucene.store.RAMDirectory@52e9e291 lockFactory=org.apache.lucene.store.SingleInstanceLockFactory@ba12608),segFN=segments_1,generation=1,filenames=[segments_1]
[junit4:junit4]   2> 851 T2313 C121 oasc.SolrDeletionPolicy.updateCommits newest commit = 1
[junit4:junit4]   2> 851 T2313 C121 UPDATE [collection1] webapp=/solr path=/update params={version=2&wt=javabin} {deleteByQuery=*:*} 0 2
[junit4:junit4]   2> ASYNC  NEW_CORE C122 name=collection1 org.apache.solr.core.SolrCore@7849884e
[junit4:junit4]   2> 854 T2323 C122 oasu.DirectUpdateHandler2.deleteAll [collection1] REMOVING ALL DOCUMENTS FROM INDEX
[junit4:junit4]   2> 857 T2323 C122 oasc.SolrDeletionPolicy.onInit SolrDeletionPolicy.onInit: commits:num=1
[junit4:junit4]   2> 		commit{dir=MockDirWrapper(org.apache.lucene.store.RAMDirectory@2393f694 lockFactory=org.apache.lucene.store.SingleInstanceLockFactory@688eb3e8),segFN=segments_1,generation=1,filenames=[segments_1]
[junit4:junit4]   2> 857 T2323 C122 oasc.SolrDeletionPolicy.updateCommits newest commit = 1
[junit4:junit4]   2> 857 T2323 C122 UPDATE [collection1] webapp=/solr path=/update params={version=2&wt=javabin} {deleteByQuery=*:*} 0 3
[junit4:junit4]   2> 860 T2293 C119 UPDATE [collection1] webapp=/solr path=/update params={version=2&wt=javabin} {add=[1]} 0 1
[junit4:junit4]   2> 861 T2303 C120 UPDATE [collection1] webapp=/solr path=/update params={version=2&wt=javabin} {add=[1]} 0 0
[junit4:junit4]   2> 863 T2293 C119 UPDATE [collection1] webapp=/solr path=/update params={version=2&wt=javabin} {add=[2]} 0 0
[junit4:junit4]   2> 865 T2313 C121 UPDATE [collection1] webapp=/solr path=/update params={version=2&wt=javabin} {add=[2]} 0 0
[junit4:junit4]   2> 867 T2293 C119 UPDATE [collection1] webapp=/solr path=/update params={version=2&wt=javabin} {add=[3]} 0 0
[junit4:junit4]   2> 869 T2323 C122 UPDATE [collection1] webapp=/solr path=/update params={version=2&wt=javabin} {add=[3]} 0 1
[junit4:junit4]   2> 871 T2293 C119 UPDATE [collection1] webapp=/solr path=/update params={version=2&wt=javabin} {add=[4]} 0 1
[junit4:junit4]   2> 872 T2303 C120 UPDATE [collection1] webapp=/solr path=/update params={version=2&wt=javabin} {add=[4]} 0 0
[junit4:junit4]   2> 874 T2293 C119 UPDATE [collection1] webapp=/solr path=/update params={version=2&wt=javabin} {add=[5]} 0 0
[junit4:junit4]   2> 876 T2313 C121 UPDATE [collection1] webapp=/solr path=/update params={version=2&wt=javabin} {add=[5]} 0 1
[junit4:junit4]   2> 877 T2293 C119 UPDATE [collection1] webapp=/solr path=/update params={version=2&wt=javabin} {add=[6]} 0 0
[junit4:junit4]   2> 879 T2323 C122 UPDATE [collection1] webapp=/solr path=/update params={version=2&wt=javabin} {add=[6]} 0 0
[junit4:junit4]   2> 881 T2293 C119 UPDATE [collection1] webapp=/solr path=/update params={version=2&wt=javabin} {add=[7]} 0 0
[junit4:junit4]   2> 883 T2323 C122 UPDATE [collection1] webapp=/solr path=/update params={version=2&wt=javabin} {add=[7]} 0 1
[junit4:junit4]   2> 884 T2293 C119 oasu.DirectUpdateHandler2.commit start commit{flags=0,version=0,optimize=false,openSearcher=true,waitSearcher=true,expungeDeletes=false,softCommit=false}
[junit4:junit4]   2> 885 T2293 C119 oasc.SolrDeletionPolicy.onCommit SolrDeletionPolicy.onCommit: commits:num=2
[junit4:junit4]   2> 		commit{dir=MockDirWrapper(org.apache.lucene.store.RAMDirectory@343d32eb lockFactory=org.apache.lucene.store.SingleInstanceLockFactory@527741f7),segFN=segments_1,generation=1,filenames=[segments_1]
[junit4:junit4]   2> 		commit{dir=MockDirWrapper(org.apache.lucene.store.RAMDirectory@343d32eb lockFactory=org.apache.lucene.store.SingleInstanceLockFactory@527741f7),segFN=segments_2,generation=2,filenames=[_0.si, segments_2, _0_nrm.cfe, _0.fdt, _0.fnm, _0.fdx, _0_Lucene40_0.prx, _0_Lucene40_0.tip, _0_nrm.cfs, _0_Lucene40_0.frq, _0_Lucene40_0.tim]
[junit4:junit4]   2> 885 T2293 C119 oasc.SolrDeletionPolicy.updateCommits newest commit = 2
[junit4:junit4]   2> 886 T2293 C119 oass.SolrIndexSearcher.<init> Opening Searcher@1e8d9c84 main
[junit4:junit4]   2> 886 T2293 C119 oass.SolrIndexSearcher.getIndexDir WARNING WARNING: Directory impl does not support setting indexDir: org.apache.lucene.store.MockDirectoryWrapper
[junit4:junit4]   2> 886 T2293 C119 oasu.DirectUpdateHandler2.commit end_commit_flush
[junit4:junit4]   2> 886 T2300 oasc.SolrCore.registerSearcher [collection1] Registered new searcher Searcher@1e8d9c84 main{StandardDirectoryReader(segments_2:4 _0(5.0):C7)}
[junit4:junit4]   2> 886 T2293 C119 UPDATE [collection1] webapp=/solr path=/update params={softCommit=false&version=2&wt=javabin&commit=true&waitSearcher=true} {commit=} 0 2
[junit4:junit4]   2> 888 T2303 C120 oasu.DirectUpdateHandler2.commit start commit{flags=0,version=0,optimize=false,openSearcher=true,waitSearcher=true,expungeDeletes=false,softCommit=false}
[junit4:junit4]   2> 889 T2303 C120 oasc.SolrDeletionPolicy.onCommit SolrDeletionPolicy.onCommit: commits:num=2
[junit4:junit4]   2> 		commit{dir=MockDirWrapper(org.apache.lucene.store.RAMDirectory@6ad45306 lockFactory=org.apache.lucene.store.SingleInstanceLockFactory@1c2db33),segFN=segments_1,generation=1,filenames=[segments_1]
[junit4:junit4]   2> 		commit{dir=MockDirWrapper(org.apache.lucene.store.RAMDirectory@6ad45306 lockFactory=org.apache.lucene.store.SingleInstanceLockFactory@1c2db33),segFN=segments_2,generation=2,filenames=[_0.si, segments_2, _0_nrm.cfe, _0.fdt, _0.fnm, _0.fdx, _0_Lucene40_0.prx, _0_Lucene40_0.tip, _0_nrm.cfs, _0_Lucene40_0.frq, _0_Lucene40_0.tim]
[junit4:junit4]   2> 889 T2303 C120 oasc.SolrDeletionPolicy.updateCommits newest commit = 2
[junit4:junit4]   2> 889 T2303 C120 oass.SolrIndexSearcher.<init> Opening Searcher@371f0212 main
[junit4:junit4]   2> 890 T2303 C120 oass.SolrIndexSearcher.getIndexDir WARNING WARNING: Directory impl does not support setting indexDir: org.apache.lucene.store.MockDirectoryWrapper
[junit4:junit4]   2> 890 T2303 C120 oasu.DirectUpdateHandler2.commit end_commit_flush
[junit4:junit4]   2> 890 T2310 oasc.SolrCore.registerSearcher [collection1] Registered new searcher Searcher@371f0212 main{StandardDirectoryReader(segments_2:4 _0(5.0):C2)}
[junit4:junit4]   2> 890 T2303 C120 UPDATE [collection1] webapp=/solr path=/update params={softCommit=false&version=2&wt=javabin&commit=true&waitSearcher=true} {commit=} 0 2
[junit4:junit4]   2> 892 T2313 C121 oasu.DirectUpdateHandler2.commit start commit{flags=0,version=0,optimize=false,openSearcher=true,waitSearcher=true,expungeDeletes=false,softCommit=false}
[junit4:junit4]   2> 892 T2313 C121 oasc.SolrDeletionPolicy.onCommit SolrDeletionPolicy.onCommit: commits:num=2
[junit4:junit4]   2> 		commit{dir=MockDirWrapper(org.apache.lucene.store.RAMDirectory@52e9e291 lockFactory=org.apache.lucene.store.SingleInstanceLockFactory@ba12608),segFN=segments_1,generation=1,filenames=[segments_1]
[junit4:junit4]   2> 		commit{dir=MockDirWrapper(org.apache.lucene.store.RAMDirectory@52e9e291 lockFactory=org.apache.lucene.store.SingleInstanceLockFactory@ba12608),segFN=segments_2,generation=2,filenames=[_0.si, segments_2, _0_nrm.cfe, _0.fdt, _0.fnm, _0.fdx, _0_Lucene40_0.prx, _0_Lucene40_0.tip, _0_nrm.cfs, _0_Lucene40_0.frq, _0_Lucene40_0.tim]
[junit4:junit4]   2> 893 T2313 C121 oasc.SolrDeletionPolicy.updateCommits newest commit = 2
[junit4:junit4]   2> 893 T2313 C121 oass.SolrIndexSearcher.<init> Opening Searcher@4f7f7a14 main
[junit4:junit4]   2> 893 T2313 C121 oass.SolrIndexSearcher.getIndexDir WARNING WARNING: Directory impl does not support setting indexDir: org.apache.lucene.store.MockDirectoryWrapper
[junit4:junit4]   2> 894 T2313 C121 oasu.DirectUpdateHandler2.commit end_commit_flush
[junit4:junit4]   2> 894 T2320 oasc.SolrCore.registerSearcher [collection1] Registered new searcher Searcher@4f7f7a14 main{StandardDirectoryReader(segments_2:4 _0(5.0):C2)}
[junit4:junit4]   2> 894 T2313 C121 UPDATE [collection1] webapp=/solr path=/update params={softCommit=false&version=2&wt=javabin&commit=true&waitSearcher=true} {commit=} 0 2
[junit4:junit4]   2> 896 T2323 C122 oasu.DirectUpdateHandler2.commit start commit{flags=0,version=0,optimize=false,openSearcher=true,waitSearcher=true,expungeDeletes=false,softCommit=false}
[junit4:junit4]   2> 896 T2323 C122 oasc.SolrDeletionPolicy.onCommit SolrDeletionPolicy.onCommit: commits:num=2
[junit4:junit4]   2> 		commit{dir=MockDirWrapper(org.apache.lucene.store.RAMDirectory@2393f694 lockFactory=org.apache.lucene.store.SingleInstanceLockFactory@688eb3e8),segFN=segments_1,generation=1,filenames=[segments_1]
[junit4:junit4]   2> 		commit{dir=MockDirWrapper(org.apache.lucene.store.RAMDirectory@2393f694 lockFactory=org.apache.lucene.store.SingleInstanceLockFactory@688eb3e8),segFN=segments_2,generation=2,filenames=[_0.si, segments_2, _0_nrm.cfe, _0.fdt, _0.fnm, _0.fdx, _0_Lucene40_0.prx, _0_Lucene40_0.tip, _0_nrm.cfs, _0_Lucene40_0.frq, _0_Lucene40_0.tim]
[junit4:junit4]   2> 896 T2323 C122 oasc.SolrDeletionPolicy.updateCommits newest commit = 2
[junit4:junit4]   2> 897 T2323 C122 oass.SolrIndexSearcher.<init> Opening Searcher@3f1bae23 main
[junit4:junit4]   2> 897 T2323 C122 oass.SolrIndexSearcher.getIndexDir WARNING WARNING: Directory impl does not support setting indexDir: org.apache.lucene.store.MockDirectoryWrapper
[junit4:junit4]   2> 897 T2323 C122 oasu.DirectUpdateHandler2.commit end_commit_flush
[junit4:junit4]   2> 897 T2330 oasc.SolrCore.registerSearcher [collection1] Registered new searcher Searcher@3f1bae23 main{StandardDirectoryReader(segments_2:4 _0(5.0):C3)}
[junit4:junit4]   2> 898 T2323 C122 UPDATE [collection1] webapp=/solr path=/update params={softCommit=false&version=2&wt=javabin&commit=true&waitSearcher=true} {commit=} 0 3
[junit4:junit4]   2> 900 T2293 C119 REQ [collection1] webapp=/solr path=/elevate params={distrib=false&version=2&qt=/elevate&shards.qt=/elevate&rows=500&wt=javabin&sort=id+desc&fl=id,+score,+[elevated]&q=*:*} hits=7 status=0 QTime=1 
[junit4:junit4]   2> 906 T2304 C120 REQ [collection1] webapp=/solr path=/elevate params={distrib=false&qt=/elevate&isShard=true&start=0&NOW=1341779700211&version=2&shard.url=localhost:43361/solr&shards.qt=/elevate&rows=500&fsv=true&wt=javabin&fl=id,score&sort=id+desc&q=*:*} hits=2 status=0 QTime=0 
[junit4:junit4]   2> 906 T2314 C121 REQ [collection1] webapp=/solr path=/elevate params={distrib=false&qt=/elevate&isShard=true&start=0&NOW=1341779700211&version=2&shard.url=localhost:38554/solr|[::1]:33332/solr&shards.qt=/elevate&rows=500&fsv=true&wt=javabin&fl=id,score&sort=id+desc&q=*:*} hits=2 status=0 QTime=0 
[junit4:junit4]   2> 906 T2324 C122 REQ [collection1] webapp=/solr path=/elevate params={distrib=false&qt=/elevate&isShard=true&start=0&NOW=1341779700211&version=2&shard.url=[::1]:33332/solr|localhost:41788/solr&shards.qt=/elevate&rows=500&fsv=true&wt=javabin&fl=id,score&sort=id+desc&q=*:*} hits=3 status=0 QTime=1 
[junit4:junit4]   2> 910 T2304 C120 REQ [collection1] webapp=/solr path=/elevate params={distrib=false&qt=/elevate&isShard=true&NOW=1341779700211&ids=4.0,1.0&version=2&shard.url=localhost:43361/solr&shards.qt=/elevate&rows=500&wt=javabin&fl=id,+score,+[elevated]&q=*:*} status=0 QTime=0 
[junit4:junit4]   2> 911 T2314 C121 REQ [collection1] webapp=/solr path=/elevate params={distrib=false&qt=/elevate&isShard=true&NOW=1341779700211&ids=5.0,2.0&version=2&shard.url=localhost:38554/solr|[::1]:33332/solr&shards.qt=/elevate&rows=500&wt=javabin&fl=id,+score,+[elevated]&q=*:*} status=0 QTime=1 
[junit4:junit4]   2> 911 T2324 C122 REQ [collection1] webapp=/solr path=/elevate params={distrib=false&qt=/elevate&isShard=true&NOW=1341779700211&ids=6.0,7.0,3.0&version=2&shard.url=[::1]:33332/solr|localhost:41788/solr&shards.qt=/elevate&rows=500&wt=javabin&fl=id,+score,+[elevated]&q=*:*} status=0 QTime=1 
[junit4:junit4]   2> 912 T2323 C122 REQ [collection1] webapp=/solr path=/elevate params={version=2&qt=/elevate&shards.qt=/elevate&rows=500&wt=javabin&sort=id+desc&fl=id,+score,+[elevated]&q=*:*&shards=localhost:43361/solr,localhost:38554/solr|[::1]:33332/solr,[::1]:33332/solr|localhost:41788/solr} status=0 QTime=10 
[junit4:junit4]   2> 913 T2290 oasc.CoreContainer.shutdown Shutting down CoreContainer instance=1424714444
[junit4:junit4]   2> 914 T2290 oasc.SolrCore.close [collection1]  CLOSING SolrCore org.apache.solr.core.SolrCore@372e1c32
[junit4:junit4]   2> 915 T2290 oasc.SolrCore.closeSearcher [collection1] Closing main searcher on request.
[junit4:junit4]   2> 915 T2290 oasu.DirectUpdateHandler2.close closing DirectUpdateHandler2{commits=1,autocommits=0,soft autocommits=0,optimizes=0,rollbacks=0,expungeDeletes=0,docsPending=0,adds=0,deletesById=0,deletesByQuery=0,errors=0,cumulative_adds=7,cumulative_deletesById=0,cumulative_deletesByQuery=1,cumulative_errors=0}
[junit4:junit4]   2> 918 T2290 oejsh.ContextHandler.doStop stopped o.e.j.s.ServletContextHandler{/solr,null}
[junit4:junit4]   2> 971 T2290 oasc.CoreContainer.shutdown Shutting down CoreContainer instance=624422337
[junit4:junit4]   2> 977 T2290 oasc.SolrCore.close [collection1]  CLOSING SolrCore org.apache.solr.core.SolrCore@3b20de15
[junit4:junit4]   2> 977 T2290 oasc.SolrCore.closeSearcher [collection1] Closing main searcher on request.
[junit4:junit4]   2> 978 T2290 oasu.DirectUpdateHandler2.close closing DirectUpdateHandler2{commits=1,autocommits=0,soft autocommits=0,optimizes=0,rollbacks=0,expungeDeletes=0,docsPending=0,adds=0,deletesById=0,deletesByQuery=0,errors=0,cumulative_adds=2,cumulative_deletesById=0,cumulative_deletesByQuery=1,cumulative_errors=0}
[junit4:junit4]   2> 984 T2290 oejsh.ContextHandler.doStop stopped o.e.j.s.ServletContextHandler{/solr,null}
[junit4:junit4]   2> 1035 T2290 oasc.CoreContainer.shutdown Shutting down CoreContainer instance=1653743860
[junit4:junit4]   2> 1036 T2290 oasc.SolrCore.close [collection1]  CLOSING SolrCore org.apache.solr.core.SolrCore@22dcdfd0
[junit4:junit4]   2> 1037 T2290 oasc.SolrCore.closeSearcher [collection1] Closing main searcher on request.
[junit4:junit4]   2> 1037 T2290 oasu.DirectUpdateHandler2.close closing DirectUpdateHandler2{commits=1,autocommits=0,soft autocommits=0,optimizes=0,rollbacks=0,expungeDeletes=0,docsPending=0,adds=0,deletesById=0,deletesByQuery=0,errors=0,cumulative_adds=2,cumulative_deletesById=0,cumulative_deletesByQuery=1,cumulative_errors=0}
[junit4:junit4]   2> 1039 T2290 oejsh.ContextHandler.doStop stopped o.e.j.s.ServletContextHandler{/solr,null}
[junit4:junit4]   2> 1090 T2290 oasc.CoreContainer.shutdown Shutting down CoreContainer instance=1635014057
[junit4:junit4]   2> 1091 T2290 oasc.SolrCore.close [collection1]  CLOSING SolrCore org.apache.solr.core.SolrCore@7849884e
[junit4:junit4]   2> 1092 T2290 oasc.SolrCore.closeSearcher [collection1] Closing main searcher on request.
[junit4:junit4]   2> 1092 T2290 oasu.DirectUpdateHandler2.close closing DirectUpdateHandler2{commits=1,autocommits=0,soft autocommits=0,optimizes=0,rollbacks=0,expungeDeletes=0,docsPending=0,adds=0,deletesById=0,deletesByQuery=0,errors=0,cumulative_adds=3,cumulative_deletesById=0,cumulative_deletesByQuery=1,cumulative_errors=0}
[junit4:junit4]   2> 1094 T2290 oejsh.ContextHandler.doStop stopped o.e.j.s.ServletContextHandler{/solr,null}
[junit4:junit4]   2> 1147 T2290 oas.SolrTestCaseJ4.tearDown ###Ending testDistribSearch
[junit4:junit4]   2> NOTE: reproduce with: ant test  -Dtestcase=DistributedQueryElevationComponentTest -Dtests.method=testDistribSearch -Dtests.seed=89133562CE447602 -Dtests.multiplier=3 -Dtests.slow=true -Dtests.locale=vi_VN -Dtests.timezone=Pacific/Honolulu -Dtests.file.encoding=UTF-8
[junit4:junit4]   2>
[junit4:junit4]    > (@AfterClass output)
[junit4:junit4]   2> 1171 T2290 oas.SolrTestCaseJ4.deleteCore ###deleteCore
[junit4:junit4]   2> NOTE: test params are: codec=Lucene40: {}, sim=RandomSimilarityProvider(queryNorm=false,coord=true): {}, locale=vi_VN, timezone=Pacific/Honolulu
[junit4:junit4]   2> NOTE: Linux 3.2.0-26-generic amd64/Oracle Corporation 1.8.0-ea (64-bit)/cpus=8,threads=1,free=197342664,total=321323008
[junit4:junit4]   2> NOTE: All tests run in this JVM: [SpellingQueryConverterTest, TestRecovery, LeaderElectionTest, TestIndexSearcher, TestQuerySenderNoQuery, TestValueSourceCache, TestPatternReplaceFilterFactory, PeerSyncTest, TestLuceneMatchVersion, TestCJKBigramFilterFactory, TestPorterStemFilterFactory, TestConfig, SolrCoreTest, TestCoreContainer, LengthFilterTest, TestLMDirichletSimilarityFactory, ResourceLoaderTest, SuggesterFSTTest, PolyFieldTest, ZkControllerTest, TestSolrDeletionPolicy2, PrimUtilsTest, TestFastLRUCache, IndexSchemaTest, TestBeiderMorseFilterFactory, DebugComponentTest, TestJapaneseTokenizerFactory, TestRangeQuery, TestPluginEnable, TestUAX29URLEmailTokenizerFactory, TestJmxMonitoredMap, QueryParsingTest, TestGalicianMinimalStemFilterFactory, StandardRequestHandlerTest, ZkSolrClientTest, TestRealTimeGet, TestShingleFilterFactory, TestEnglishMinimalStemFilterFactory, FieldAnalysisRequestHandlerTest, CloudStateUpdateTest, TestHungarianLightStemFilterFactory, SolrPluginUtilsTest, TestPseudoReturnFields, TestCollationField, TestRemoteStreaming, CommonGramsFilterFactoryTest, OverseerTest, TestCzechStemFilterFactory, TestStressRecovery, TestGroupingSearch, TestHindiFilters, TestUtils, MBeansHandlerTest, TestMultiWordSynonyms, UniqFieldsUpdateProcessorFactoryTest, TestWriterPerf, TestReplicationHandler, NoCacheHeaderTest, TestWikipediaTokenizerFactory, UpdateParamsTest, TestKeepFilterFactory, TestSolrXMLSerializer, TestGermanNormalizationFilterFactory, BadIndexSchemaTest, TestLRUCache, TestSystemIdResolver, FullSolrCloudTest, RecoveryZkTest, TestDistributedSearch, BasicZkTest, WordBreakSolrSpellCheckerTest, DistributedTermsComponentTest, IndexBasedSpellCheckerTest, DirectUpdateHandlerTest, TestMultiCoreConfBootstrap, SimpleFacetsTest, LukeRequestHandlerTest, TestSort, DirectSolrSpellCheckerTest, FileBasedSpellCheckerTest, ConvertedLegacyTest, QueryElevationComponentTest, SortByFunctionTest, BasicFunctionalityTest, SignatureUpdateProcessorFactoryTest, TestBinaryResponseWriter, SampleTest, TestTrie, DirectSolrConnectionTest, CacheHeaderTest, QueryEqualityTest, TestWordDelimiterFilterFactory, TestCSVLoader, TestCSVResponseWriter, MoreLikeThisHandlerTest, DocumentBuilderTest, DistributedQueryElevationComponentTest]
[junit4:junit4]   2> 
[junit4:junit4] Completed on J1 in 1.18s, 1 test, 1 error <<< FAILURES!

[...truncated 323 lines...]
BUILD FAILED
/mnt/ssd/jenkins/workspace/Lucene-Solr-trunk-Linux-Java8-64/checkout/build.xml:29: The following error occurred while executing this line:
/mnt/ssd/jenkins/workspace/Lucene-Solr-trunk-Linux-Java8-64/checkout/solr/build.xml:144: The following error occurred while executing this line:
/mnt/ssd/jenkins/workspace/Lucene-Solr-trunk-Linux-Java8-64/checkout/lucene/module-build.xml:62: The following error occurred while executing this line:
/mnt/ssd/jenkins/workspace/Lucene-Solr-trunk-Linux-Java8-64/checkout/lucene/common-build.xml:1096: The following error occurred while executing this line:
/mnt/ssd/jenkins/workspace/Lucene-Solr-trunk-Linux-Java8-64/checkout/lucene/common-build.xml:793: There were test failures: 290 suites, 1026 tests, 2 errors, 5 ignored

Total time: 20 minutes 36 seconds
Build step 'Execute shell' marked build as failure
Archiving artifacts
Recording test results
Email was triggered for: Failure
Sending email for trigger: Failure




Mime
View raw message