lucene-dev mailing list archives

Site index · List index
Message view « Date » · « Thread »
Top « Date » · « Thread »
From Apache Jenkins Server <jenk...@builds.apache.org>
Subject [JENKINS] Lucene-Solr-tests-only-4.x - Build # 261 - Failure
Date Sun, 15 Jul 2012 12:45:56 GMT
Build: https://builds.apache.org/job/Lucene-Solr-tests-only-4.x/261/

1 tests failed.
REGRESSION:  org.apache.solr.update.SoftAutoCommitTest.testSoftAndHardCommitMaxTimeDelete

Error Message:
searcher529 wasn't soon enough after soft529: 1342356002248 !< 1342356002095 + 100 (fudge)

Stack Trace:
java.lang.AssertionError: searcher529 wasn't soon enough after soft529: 1342356002248 !<
1342356002095 + 100 (fudge)
	at __randomizedtesting.SeedInfo.seed([77ED467C2103815C:B0A1FEE13AAB4CEC]:0)
	at org.junit.Assert.fail(Assert.java:93)
	at org.junit.Assert.assertTrue(Assert.java:43)
	at org.apache.solr.update.SoftAutoCommitTest.testSoftAndHardCommitMaxTimeDelete(SoftAutoCommitTest.java:256)
	at sun.reflect.NativeMethodAccessorImpl.invoke0(Native Method)
	at sun.reflect.NativeMethodAccessorImpl.invoke(NativeMethodAccessorImpl.java:57)
	at sun.reflect.DelegatingMethodAccessorImpl.invoke(DelegatingMethodAccessorImpl.java:43)
	at java.lang.reflect.Method.invoke(Method.java:616)
	at com.carrotsearch.randomizedtesting.RandomizedRunner.invoke(RandomizedRunner.java:1995)
	at com.carrotsearch.randomizedtesting.RandomizedRunner.access$1100(RandomizedRunner.java:132)
	at com.carrotsearch.randomizedtesting.RandomizedRunner$6.evaluate(RandomizedRunner.java:818)
	at com.carrotsearch.randomizedtesting.RandomizedRunner$7.evaluate(RandomizedRunner.java:877)
	at com.carrotsearch.randomizedtesting.RandomizedRunner$8.evaluate(RandomizedRunner.java:891)
	at com.carrotsearch.randomizedtesting.rules.SystemPropertiesRestoreRule$1.evaluate(SystemPropertiesRestoreRule.java:53)
	at org.apache.lucene.util.TestRuleSetupTeardownChained$1.evaluate(TestRuleSetupTeardownChained.java:50)
	at org.apache.lucene.util.TestRuleFieldCacheSanity$1.evaluate(TestRuleFieldCacheSanity.java:32)
	at org.apache.lucene.util.AbstractBeforeAfterRule$1.evaluate(AbstractBeforeAfterRule.java:45)
	at com.carrotsearch.randomizedtesting.rules.SystemPropertiesInvariantRule$1.evaluate(SystemPropertiesInvariantRule.java:55)
	at org.apache.lucene.util.TestRuleReportUncaughtExceptions$1.evaluate(TestRuleReportUncaughtExceptions.java:68)
	at org.apache.lucene.util.TestRuleThreadAndTestName$1.evaluate(TestRuleThreadAndTestName.java:48)
	at org.apache.lucene.util.TestRuleIgnoreAfterMaxFailures$1.evaluate(TestRuleIgnoreAfterMaxFailures.java:70)
	at org.apache.lucene.util.TestRuleMarkFailure$1.evaluate(TestRuleMarkFailure.java:48)
	at com.carrotsearch.randomizedtesting.RandomizedRunner.runSingleTest(RandomizedRunner.java:825)
	at com.carrotsearch.randomizedtesting.RandomizedRunner.access$700(RandomizedRunner.java:132)
	at com.carrotsearch.randomizedtesting.RandomizedRunner$3$1.run(RandomizedRunner.java:671)
	at com.carrotsearch.randomizedtesting.RandomizedRunner$3.evaluate(RandomizedRunner.java:697)
	at com.carrotsearch.randomizedtesting.RandomizedRunner$4.evaluate(RandomizedRunner.java:736)
	at com.carrotsearch.randomizedtesting.RandomizedRunner$5.evaluate(RandomizedRunner.java:747)
	at com.carrotsearch.randomizedtesting.rules.SystemPropertiesRestoreRule$1.evaluate(SystemPropertiesRestoreRule.java:53)
	at org.apache.lucene.util.AbstractBeforeAfterRule$1.evaluate(AbstractBeforeAfterRule.java:45)
	at org.apache.lucene.util.TestRuleReportUncaughtExceptions$1.evaluate(TestRuleReportUncaughtExceptions.java:68)
	at org.apache.lucene.util.TestRuleStoreClassName$1.evaluate(TestRuleStoreClassName.java:38)
	at org.apache.lucene.util.TestRuleIcuHack$1.evaluate(TestRuleIcuHack.java:51)
	at com.carrotsearch.randomizedtesting.rules.SystemPropertiesInvariantRule$1.evaluate(SystemPropertiesInvariantRule.java:55)
	at org.apache.lucene.util.TestRuleNoInstanceHooksOverrides$1.evaluate(TestRuleNoInstanceHooksOverrides.java:53)
	at org.apache.lucene.util.TestRuleNoStaticHooksShadowing$1.evaluate(TestRuleNoStaticHooksShadowing.java:52)
	at org.apache.lucene.util.TestRuleAssertionsRequired$1.evaluate(TestRuleAssertionsRequired.java:36)
	at org.apache.lucene.util.TestRuleMarkFailure$1.evaluate(TestRuleMarkFailure.java:48)
	at org.apache.lucene.util.TestRuleIgnoreAfterMaxFailures$1.evaluate(TestRuleIgnoreAfterMaxFailures.java:70)
	at org.apache.lucene.util.TestRuleIgnoreTestSuites$1.evaluate(TestRuleIgnoreTestSuites.java:55)
	at com.carrotsearch.randomizedtesting.RandomizedRunner.runSuite(RandomizedRunner.java:605)
	at com.carrotsearch.randomizedtesting.RandomizedRunner.access$400(RandomizedRunner.java:132)
	at com.carrotsearch.randomizedtesting.RandomizedRunner$2.run(RandomizedRunner.java:551)




Build Log:
[...truncated 20909 lines...]
[junit4:junit4]    > 	at com.carrotsearch.randomizedtesting.rules.SystemPropertiesInvariantRule$1.evaluate(SystemPropertiesInvariantRule.java:55)
[junit4:junit4]    > 	at org.apache.lucene.util.TestRuleReportUncaughtExceptions$1.evaluate(TestRuleReportUncaughtExceptions.java:68)
[junit4:junit4]    > 	at org.apache.lucene.util.TestRuleThreadAndTestName$1.evaluate(TestRuleThreadAndTestName.java:48)
[junit4:junit4]    > 	at org.apache.lucene.util.TestRuleIgnoreAfterMaxFailures$1.evaluate(TestRuleIgnoreAfterMaxFailures.java:70)
[junit4:junit4]    > 	at org.apache.lucene.util.TestRuleMarkFailure$1.evaluate(TestRuleMarkFailure.java:48)
[junit4:junit4]    > 	at com.carrotsearch.randomizedtesting.RandomizedRunner.runSingleTest(RandomizedRunner.java:825)
[junit4:junit4]    > 	at com.carrotsearch.randomizedtesting.RandomizedRunner.access$700(RandomizedRunner.java:132)
[junit4:junit4]    > 	at com.carrotsearch.randomizedtesting.RandomizedRunner$3$1.run(RandomizedRunner.java:671)
[junit4:junit4]    > 	at com.carrotsearch.randomizedtesting.RandomizedRunner$3.evaluate(RandomizedRunner.java:697)
[junit4:junit4]    > 	at com.carrotsearch.randomizedtesting.RandomizedRunner$4.evaluate(RandomizedRunner.java:736)
[junit4:junit4]    > 	at com.carrotsearch.randomizedtesting.RandomizedRunner$5.evaluate(RandomizedRunner.java:747)
[junit4:junit4]    > 	at com.carrotsearch.randomizedtesting.rules.SystemPropertiesRestoreRule$1.evaluate(SystemPropertiesRestoreRule.java:53)
[junit4:junit4]    > 	at org.apache.lucene.util.AbstractBeforeAfterRule$1.evaluate(AbstractBeforeAfterRule.java:45)
[junit4:junit4]    > 	at org.apache.lucene.util.TestRuleReportUncaughtExceptions$1.evaluate(TestRuleReportUncaughtExceptions.java:68)
[junit4:junit4]    > 	at org.apache.lucene.util.TestRuleStoreClassName$1.evaluate(TestRuleStoreClassName.java:38)
[junit4:junit4]    > 	at org.apache.lucene.util.TestRuleIcuHack$1.evaluate(TestRuleIcuHack.java:51)
[junit4:junit4]    > 	at com.carrotsearch.randomizedtesting.rules.SystemPropertiesInvariantRule$1.evaluate(SystemPropertiesInvariantRule.java:55)
[junit4:junit4]    > 	at org.apache.lucene.util.TestRuleNoInstanceHooksOverrides$1.evaluate(TestRuleNoInstanceHooksOverrides.java:53)
[junit4:junit4]    > 	at org.apache.lucene.util.TestRuleNoStaticHooksShadowing$1.evaluate(TestRuleNoStaticHooksShadowing.java:52)
[junit4:junit4]    > 	at org.apache.lucene.util.TestRuleAssertionsRequired$1.evaluate(TestRuleAssertionsRequired.java:36)
[junit4:junit4]    > 	at org.apache.lucene.util.TestRuleMarkFailure$1.evaluate(TestRuleMarkFailure.java:48)
[junit4:junit4]    > 	at org.apache.lucene.util.TestRuleIgnoreAfterMaxFailures$1.evaluate(TestRuleIgnoreAfterMaxFailures.java:70)
[junit4:junit4]    > 	at org.apache.lucene.util.TestRuleIgnoreTestSuites$1.evaluate(TestRuleIgnoreTestSuites.java:55)
[junit4:junit4]    > 	at com.carrotsearch.randomizedtesting.RandomizedRunner.runSuite(RandomizedRunner.java:605)
[junit4:junit4]    > 	at com.carrotsearch.randomizedtesting.RandomizedRunner.access$400(RandomizedRunner.java:132)
[junit4:junit4]    > 	at com.carrotsearch.randomizedtesting.RandomizedRunner$2.run(RandomizedRunner.java:551)
[junit4:junit4]    > 
[junit4:junit4]   2> 13635 T2161 oasu.AbstractSolrTestCase.setUp ####SETUP_START testSoftAndHardCommitMaxTimeDelete
[junit4:junit4]   2> 13636 T2161 oasc.SolrResourceLoader.<init> new SolrResourceLoader
for directory: '/usr/home/hudson/hudson-slave/workspace/Lucene-Solr-tests-only-4.x/checkout/solr/build/solr-core/test-files/solr/collection1/'
[junit4:junit4]   2> 13637 T2161 oasc.SolrResourceLoader.replaceClassLoader Adding 'file:/usr/home/hudson/hudson-slave/workspace/Lucene-Solr-tests-only-4.x/checkout/solr/build/solr-core/test-files/solr/collection1/lib/classes/'
to classloader
[junit4:junit4]   2> 13637 T2161 oasc.SolrResourceLoader.replaceClassLoader Adding 'file:/usr/home/hudson/hudson-slave/workspace/Lucene-Solr-tests-only-4.x/checkout/solr/build/solr-core/test-files/solr/collection1/lib/README'
to classloader
[junit4:junit4]   2> 13662 T2161 oasc.SolrConfig.<init> Using Lucene MatchVersion:
LUCENE_40
[junit4:junit4]   2> 13713 T2161 oasc.SolrConfig.<init> Loaded SolrConfig: solrconfig.xml
[junit4:junit4]   2> 13713 T2161 oass.IndexSchema.readSchema Reading Solr Schema
[junit4:junit4]   2> 13718 T2161 oass.IndexSchema.readSchema Schema name=test
[junit4:junit4]   2> 14126 T2161 oass.OpenExchangeRatesOrgProvider.init Initialized with
rates=open-exchange-rates.json, refreshInterval=1440.
[junit4:junit4]   2> 14133 T2161 oass.IndexSchema.readSchema default search field in schema
is text
[junit4:junit4]   2> 14136 T2161 oass.IndexSchema.readSchema unique key field: id
[junit4:junit4]   2> 14142 T2161 oass.FileExchangeRateProvider.reload Reloading exchange
rates from file currency.xml
[junit4:junit4]   2> 14146 T2161 oass.FileExchangeRateProvider.reload Reloading exchange
rates from file currency.xml
[junit4:junit4]   2> 14148 T2161 oass.OpenExchangeRatesOrgProvider.reload Reloading exchange
rates from open-exchange-rates.json
[junit4:junit4]   2> 14149 T2161 oass.OpenExchangeRatesOrgProvider.reload Reloading exchange
rates from open-exchange-rates.json
[junit4:junit4]   2> 14149 T2161 oasc.SolrResourceLoader.locateSolrHome JNDI not configured
for solr (NoInitialContextEx)
[junit4:junit4]   2> 14150 T2161 oasc.SolrResourceLoader.locateSolrHome using system property
solr.solr.home: /usr/home/hudson/hudson-slave/workspace/Lucene-Solr-tests-only-4.x/checkout/solr/build/solr-core/test-files/solr
[junit4:junit4]   2> 14150 T2161 oasc.SolrResourceLoader.<init> new SolrResourceLoader
for directory: '/usr/home/hudson/hudson-slave/workspace/Lucene-Solr-tests-only-4.x/checkout/solr/build/solr-core/test-files/solr/'
[junit4:junit4]   2> 14150 T2161 oasc.CoreContainer.<init> New CoreContainer 1917566534
[junit4:junit4]   2> 14150 T2161 oasc.SolrCore.<init> [collection1] Opening new SolrCore
at /usr/home/hudson/hudson-slave/workspace/Lucene-Solr-tests-only-4.x/checkout/solr/build/solr-core/test-files/solr/collection1/,
dataDir=/usr/home/hudson/hudson-slave/workspace/Lucene-Solr-tests-only-4.x/checkout/solr/build/solr-core/test/J1/./org.apache.solr.update.SoftAutoCommitTest-1342356000934/
[junit4:junit4]   2> 14151 T2161 oasc.JmxMonitoredMap.<init> JMX monitoring is enabled.
Adding Solr mbeans to JMX Server: com.sun.jmx.mbeanserver.JmxMBeanServer@6f579a30
[junit4:junit4]   2> 14151 T2161 oasc.SolrCore.getNewIndexDir WARNING New index directory
detected: old=null new=/usr/home/hudson/hudson-slave/workspace/Lucene-Solr-tests-only-4.x/checkout/solr/build/solr-core/test/J1/./org.apache.solr.update.SoftAutoCommitTest-1342356000934/index/
[junit4:junit4]   2> 14152 T2161 oasc.SolrCore.initIndex WARNING [collection1] Solr index
directory '/usr/home/hudson/hudson-slave/workspace/Lucene-Solr-tests-only-4.x/checkout/solr/build/solr-core/test/J1/./org.apache.solr.update.SoftAutoCommitTest-1342356000934/index'
doesn't exist. Creating new index...
[junit4:junit4]   2> 14153 T2161 oasc.SolrDeletionPolicy.onCommit SolrDeletionPolicy.onCommit:
commits:num=1
[junit4:junit4]   2> 		commit{dir=MockDirWrapper(org.apache.lucene.store.RAMDirectory@3ff6bef2
lockFactory=org.apache.lucene.store.SingleInstanceLockFactory@65427bab),segFN=segments_1,generation=1,filenames=[segments_1]
[junit4:junit4]   2> 14154 T2161 oasc.SolrDeletionPolicy.updateCommits newest commit =
1
[junit4:junit4]   2> 14154 T2161 oasc.SolrCore.initWriters created xml: solr.XMLResponseWriter
[junit4:junit4]   2> 14155 T2161 oasup.UpdateRequestProcessorChain.init inserting DistributedUpdateProcessorFactory
into updateRequestProcessorChain "dedupe"
[junit4:junit4]   2> 14156 T2161 oasup.UpdateRequestProcessorChain.init inserting DistributedUpdateProcessorFactory
into updateRequestProcessorChain "dedupe-allfields"
[junit4:junit4]   2> 14156 T2161 oasup.UpdateRequestProcessorChain.init inserting DistributedUpdateProcessorFactory
into updateRequestProcessorChain "stored_sig"
[junit4:junit4]   2> 14156 T2161 oasup.UpdateRequestProcessorChain.init inserting DistributedUpdateProcessorFactory
into updateRequestProcessorChain "uniq-fields"
[junit4:junit4]   2> 14157 T2161 oasup.UpdateRequestProcessorChain.init inserting DistributedUpdateProcessorFactory
into updateRequestProcessorChain "distrib-dup-test-chain-implicit"
[junit4:junit4]   2> 14157 T2161 oasc.RequestHandlers.initHandlersFromConfig adding lazy
requestHandler: solr.ReplicationHandler
[junit4:junit4]   2> 14157 T2161 oasc.RequestHandlers.initHandlersFromConfig created /replication:
solr.ReplicationHandler
[junit4:junit4]   2> 14158 T2161 oasc.RequestHandlers.initHandlersFromConfig created standard:
solr.StandardRequestHandler
[junit4:junit4]   2> 14158 T2161 oasc.RequestHandlers.initHandlersFromConfig created /get:
solr.RealTimeGetHandler
[junit4:junit4]   2> 14159 T2161 oasc.RequestHandlers.initHandlersFromConfig created dismax:
solr.SearchHandler
[junit4:junit4]   2> 14159 T2161 oasc.RequestHandlers.initHandlersFromConfig created mock:
org.apache.solr.core.MockQuerySenderListenerReqHandler
[junit4:junit4]   2> 14159 T2161 oasc.RequestHandlers.initHandlersFromConfig created /admin/:
org.apache.solr.handler.admin.AdminHandlers
[junit4:junit4]   2> 14160 T2161 oasc.RequestHandlers.initHandlersFromConfig created defaults:
solr.StandardRequestHandler
[junit4:junit4]   2> 14160 T2161 oasc.RequestHandlers.initHandlersFromConfig adding lazy
requestHandler: solr.StandardRequestHandler
[junit4:junit4]   2> 14160 T2161 oasc.RequestHandlers.initHandlersFromConfig created lazy:
solr.StandardRequestHandler
[junit4:junit4]   2> 14160 T2161 oasc.RequestHandlers.initHandlersFromConfig created /update:
solr.UpdateRequestHandler
[junit4:junit4]   2> 14161 T2161 oasc.RequestHandlers.initHandlersFromConfig created /terms:
org.apache.solr.handler.component.SearchHandler
[junit4:junit4]   2> 14161 T2161 oasc.RequestHandlers.initHandlersFromConfig created spellCheckCompRH:
org.apache.solr.handler.component.SearchHandler
[junit4:junit4]   2> 14161 T2161 oasc.RequestHandlers.initHandlersFromConfig created spellCheckCompRH_Direct:
org.apache.solr.handler.component.SearchHandler
[junit4:junit4]   2> 14162 T2161 oasc.RequestHandlers.initHandlersFromConfig created spellCheckWithWordbreak:
org.apache.solr.handler.component.SearchHandler
[junit4:junit4]   2> 14162 T2161 oasc.RequestHandlers.initHandlersFromConfig created spellCheckWithWordbreak_Direct:
org.apache.solr.handler.component.SearchHandler
[junit4:junit4]   2> 14162 T2161 oasc.RequestHandlers.initHandlersFromConfig created spellCheckCompRH1:
org.apache.solr.handler.component.SearchHandler
[junit4:junit4]   2> 14163 T2161 oasc.RequestHandlers.initHandlersFromConfig created tvrh:
org.apache.solr.handler.component.SearchHandler
[junit4:junit4]   2> 14163 T2161 oasc.RequestHandlers.initHandlersFromConfig created /mlt:
solr.MoreLikeThisHandler
[junit4:junit4]   2> 14163 T2161 oasc.RequestHandlers.initHandlersFromConfig created /debug/dump:
solr.DumpRequestHandler
[junit4:junit4]   2> 14164 T2161 oashl.XMLLoader.init xsltCacheLifetimeSeconds=60
[junit4:junit4]   2> 14166 T2161 oasc.SolrCore.initDeprecatedSupport WARNING solrconfig.xml
uses deprecated <admin/gettableFiles>, Please update your config to use the ShowFileRequestHandler.
[junit4:junit4]   2> 14168 T2161 oasc.SolrCore.initDeprecatedSupport WARNING adding ShowFileRequestHandler
with hidden files: [THROW.ERROR.ON.ADD.UPDATEPROCESSOR.JS, SOLRCONFIG-HIGHLIGHT.XML, SCHEMA-REQUIRED-FIELDS.XML,
SCHEMA-MINIMAL.XML, BAD-SCHEMA-DUP-DYNAMICFIELD.XML, SCHEMA-REPLICATION2.XML, TRIVIAL.UPDATEPROCESSOR1.JS,
SOLRCONFIG-CACHING.XML, SOLRCONFIG-REPEATER.XML, CURRENCY.XML, BAD-SCHEMA-NONTEXT-ANALYZER.XML,
SOLRCONFIG-MERGEPOLICY.XML, SOLRCONFIG-TLOG.XML, SOLRCONFIG-MASTER.XML, SCHEMA11.XML, SOLRCONFIG-BASIC.XML,
DA_COMPOUNDDICTIONARY.TXT, MISSLEADING.EXTENSION.UPDATEPROCESSOR.JS.TXT, SCHEMA-COPYFIELD-TEST.XML,
SOLRCONFIG-SLAVE.XML, ELEVATE.XML, SOLRCONFIG-PROPINJECT-INDEXDEFAULT.XML, TRIVIAL.UPDATEPROCESSOR0.JS,
BAD-SOLRCONFIG-BOGUS-SCRIPTENGINE-NAME.XML, SCHEMA-IB.XML, SCHEMA-CHARFILTERS.XML, SOLRCONFIG-QUERYSENDER.XML,
DA_UTF8.XML, SCHEMA-REPLICATION1.XML, CONDITIONAL.UPDATEPROCESSOR.JS, MISSING.FUNCTIONS.UPDATEPROCESSOR.JS,
SOLRCONFIG-ENABLEPLUGIN.XML, HYPHENATION.DTD, SCHEMA-PHRASESUGGEST.XML, STEMDICT.TXT, HUNSPELL-TEST.AFF,
STOPTYPES-1.TXT, STOPWORDSWRONGENCODING.TXT, SCHEMA-NUMERIC.XML, SOLRCONFIG-TRANSFORMERS.XML,
SOLRCONFIG-PROPINJECT.XML, BAD-SCHEMA-NOT-INDEXED-BUT-TF.XML, SOLRCONFIG-SIMPLELOCK.XML, WDFTYPES.TXT,
STOPTYPES-2.TXT, SCHEMA-REVERSED.XML, SOLRCONFIG-SPELLCHECKCOMPONENT.XML, SOLRCONFIG-PHRASESUGGEST.XML,
SCHEMA-DFR.XML, BAD-SCHEMA-NOT-INDEXED-BUT-POS.XML, KEEP-1.TXT, OPEN-EXCHANGE-RATES.JSON,
STOPWITHBOM.TXT, SOLRCONFIG-SPELLCHECKER.XML, SCHEMA-BINARYFIELD.XML, SOLRCONFIG-UPDATE-PROCESSOR-CHAINS.XML,
BAD-SCHEMA-OMIT-TF-BUT-NOT-POS.XML, BAD-SCHEMA-DUP-FIELDTYPE.XML, SOLRCONFIG-MASTER1.XML,
SYNONYMS.TXT, SCHEMA.XML, SCHEMA_CODEC.XML, SOLRCONFIG-SOLR-749.XML, SOLRCONFIG-MASTER1-KEEPONEBACKUP.XML,
SOLRCONFIG-FUNCTIONQUERY.XML, STOP-2.TXT, SOLRCONFIG-TERMINDEX.XML, SCHEMA-LMDIRICHLET.XML,
SOLRCONFIG-ELEVATE.XML, SCHEMA-FOLDING.XML, STOPWORDS.TXT, SCHEMA-STOP-KEEP.XML, BAD-SCHEMA-NOT-INDEXED-BUT-NORMS.XML,
SOLRCONFIG-SOLCOREPROPERTIES.XML, STOP-1.TXT, SOLRCONFIG-MASTER2.XML, SCHEMA-SPELLCHECKER.XML,
SOLRCONFIG-LAZYWRITER.XML, SCHEMA-LUCENEMATCHVERSION.XML, BAD-MP-SOLRCONFIG.XML, FRENCHARTICLES.TXT,
SCHEMA15.XML, SOLRCONFIG-REQHANDLER.INCL, SCHEMASURROUND.XML, SCHEMA-COLLATEFILTER.XML, SOLRCONFIG-MASTER3.XML,
HUNSPELL-TEST.DIC, SOLRCONFIG-XINCLUDE.XML, BAD-SCHEMA-CODEC-GLOBAL-VS-FT-MISMATCH.XML, SOLRCONFIG-SLAVE1.XML,
SOLRCONFIG-DELPOLICY1.XML, SCHEMA-SIM.XML, SCHEMA-COLLATE.XML, STOP-SNOWBALL.TXT, BAD-SCHEMA-SIM-GLOBAL-VS-FT-MISMATCH.XML,
PROTWORDS.TXT, SCHEMA-TRIE.XML, SOLRCONFIG_CODEC.XML, BAD-SOLRCONFIG-INVALID-SCRIPTFILE.XML,
SCHEMA-TFIDF.XML, SOLRCONFIG-SCRIPT-UPDATEPROCESSOR.XML, SCHEMA-LMJELINEKMERCER.XML, PHRASESUGGEST.TXT,
BAD-SOLRCONFIG-MISSING-SCRIPTFILE.XML, SOLRCONFIG-BASIC-LUCENEVERSION31.XML, BAD-SCHEMA-UNIQUEKEY-USES-DEFAULT.XML,
OLD_SYNONYMS.TXT, SOLRCONFIG-DELPOLICY2.XML, SOLRCONFIG-NATIVELOCK.XML, XSLT, BAD-SCHEMA-DUP-FIELD.XML,
SOLRCONFIG-NOCACHE.XML, SCHEMA-BM25.XML, ADDFIELDS.UPDATEPROCESSOR.JS, SOLRCONFIG-QUERYSENDER-NOQUERY.XML,
SOLRCONFIG-ALTDIRECTORY.XML, COMPOUNDDICTIONARY.TXT, SOLRCONFIG_PERF.XML, SCHEMA-NOT-REQUIRED-UNIQUE-KEY.XML,
KEEP-2.TXT, BAD-SCHEMA-UNIQUEKEY-IS-COPYFIELD-DEST.XML, SCHEMA12.XML, MAPPING-ISOLATIN1ACCENT.TXT,
BAD_SOLRCONFIG.XML, BAD-SCHEMA-EXTERNAL-FILEFIELD.XML]
[junit4:junit4]   2> 14172 T2161 oass.SolrIndexSearcher.<init> Opening Searcher@3302ec55
main
[junit4:junit4]   2> 14172 T2161 oass.SolrIndexSearcher.getIndexDir WARNING WARNING: Directory
impl does not support setting indexDir: org.apache.lucene.store.MockDirectoryWrapper
[junit4:junit4]   2> 14173 T2161 oasu.CommitTracker.<init> Hard AutoCommit: disabled
[junit4:junit4]   2> 14173 T2161 oasu.CommitTracker.<init> Soft AutoCommit: disabled
[junit4:junit4]   2> 14174 T2161 oashc.SpellCheckComponent.inform Initializing spell checkers
[junit4:junit4]   2> 14209 T2161 oass.DirectSolrSpellChecker.init init: {name=direct,classname=DirectSolrSpellChecker,field=lowerfilt,minQueryLength=3}
[junit4:junit4]   2> 14256 T2161 oashc.HttpShardHandlerFactory.getParameter Setting socketTimeout
to: 0
[junit4:junit4]   2> 14256 T2161 oashc.HttpShardHandlerFactory.getParameter Setting urlScheme
to: http://
[junit4:junit4]   2> 14257 T2161 oashc.HttpShardHandlerFactory.getParameter Setting connTimeout
to: 0
[junit4:junit4]   2> 14257 T2161 oashc.HttpShardHandlerFactory.getParameter Setting maxConnectionsPerHost
to: 20
[junit4:junit4]   2> 14257 T2161 oashc.HttpShardHandlerFactory.getParameter Setting corePoolSize
to: 0
[junit4:junit4]   2> 14257 T2161 oashc.HttpShardHandlerFactory.getParameter Setting maximumPoolSize
to: 2147483647
[junit4:junit4]   2> 14257 T2161 oashc.HttpShardHandlerFactory.getParameter Setting maxThreadIdleTime
to: 5
[junit4:junit4]   2> 14258 T2161 oashc.HttpShardHandlerFactory.getParameter Setting sizeOfQueue
to: -1
[junit4:junit4]   2> 14258 T2161 oashc.HttpShardHandlerFactory.getParameter Setting fairnessPolicy
to: false
[junit4:junit4]   2> 14258 T2161 oascsi.HttpClientUtil.createClient Creating new http client,
config:maxConnectionsPerHost=20&maxConnections=10000&socketTimeout=0&connTimeout=0&retry=false
[junit4:junit4]   2> 14270 T2168 oasc.SolrCore.registerSearcher [collection1] Registered
new searcher Searcher@3302ec55 main{StandardDirectoryReader(segments_1:1)}
[junit4:junit4]   2> 14271 T2161 oasc.CoreContainer.register registering core: collection1
[junit4:junit4]   2> 14272 T2161 oasu.AbstractSolrTestCase.setUp ####SETUP_END testSoftAndHardCommitMaxTimeDelete
[junit4:junit4]   2> ASYNC  NEW_CORE C83 name=collection1 org.apache.solr.core.SolrCore@4ab92049
[junit4:junit4]   2> 14276 T2161 C83 oasc.SolrDeletionPolicy.onInit SolrDeletionPolicy.onInit:
commits:num=1
[junit4:junit4]   2> 		commit{dir=MockDirWrapper(org.apache.lucene.store.RAMDirectory@3ff6bef2
lockFactory=org.apache.lucene.store.SingleInstanceLockFactory@65427bab),segFN=segments_1,generation=1,filenames=[segments_1]
[junit4:junit4]   2> 14277 T2161 C83 oasc.SolrDeletionPolicy.updateCommits newest commit
= 1
[junit4:junit4]   2> 14278 T2161 C83 UPDATE [collection1] webapp=null path=null params={}
{add=[529]} 0 2
[junit4:junit4]   2> 14284 T2161 C83 oasu.DirectUpdateHandler2.commit start commit{flags=0,version=0,optimize=false,openSearcher=true,waitSearcher=true,expungeDeletes=false,softCommit=false}
[junit4:junit4]   2> 14286 T2161 C83 oasc.SolrDeletionPolicy.onCommit SolrDeletionPolicy.onCommit:
commits:num=2
[junit4:junit4]   2> 		commit{dir=MockDirWrapper(org.apache.lucene.store.RAMDirectory@3ff6bef2
lockFactory=org.apache.lucene.store.SingleInstanceLockFactory@65427bab),segFN=segments_1,generation=1,filenames=[segments_1]
[junit4:junit4]   2> 		commit{dir=MockDirWrapper(org.apache.lucene.store.RAMDirectory@3ff6bef2
lockFactory=org.apache.lucene.store.SingleInstanceLockFactory@65427bab),segFN=segments_2,generation=2,filenames=[_0_4.len,
_0_1.len, _0_3.len, _0_5.len, _0_6.len, _0_7.len, segments_2, _0.inf, _0.si, _0.pst, _0.fld]
[junit4:junit4]   2> 14287 T2161 C83 oasc.SolrDeletionPolicy.updateCommits newest commit
= 2
[junit4:junit4]   2> 14288 T2161 C83 oass.SolrIndexSearcher.<init> Opening Searcher@1127a428
main
[junit4:junit4]   2> 14288 T2161 C83 oass.SolrIndexSearcher.getIndexDir WARNING WARNING:
Directory impl does not support setting indexDir: org.apache.lucene.store.MockDirectoryWrapper
[junit4:junit4]   2> 14289 T2161 C83 oasu.DirectUpdateHandler2.commit end_commit_flush
[junit4:junit4]   2> 14289 T2168 oasc.SolrCore.registerSearcher [collection1] Registered
new searcher Searcher@1127a428 main{StandardDirectoryReader(segments_2:3 _0(4.0):C1)}
[junit4:junit4]   2> 14290 T2161 C83 UPDATE [collection1] webapp=null path=null params={}
{commit=} 0 6
[junit4:junit4]   2> 14295 T2161 C83 UPDATE [collection1] webapp=null path=null params={}
{delete=[529]} 0 0
[junit4:junit4]   2> 14797 T2170 oasu.DirectUpdateHandler2.commit start commit{flags=0,version=0,optimize=false,openSearcher=true,waitSearcher=true,expungeDeletes=false,softCommit=true}
[junit4:junit4]   2> 14946 T375 oaz.ClientCnxn$SendThread.startConnect Opening socket connection
to server localhost/127.0.0.1:22936
[junit4:junit4]   2> 14949 T2170 oass.SolrIndexSearcher.<init> Opening Searcher@3a8c4d78
main
[junit4:junit4]   2> 14949 T2170 oass.SolrIndexSearcher.getIndexDir WARNING WARNING: Directory
impl does not support setting indexDir: org.apache.lucene.store.MockDirectoryWrapper
[junit4:junit4]   2> 14949 T2170 oasu.DirectUpdateHandler2.commit end_commit_flush
[junit4:junit4]   2> 14950 T2168 oasc.SolrCore.registerSearcher [collection1] Registered
new searcher Searcher@3a8c4d78 main{StandardDirectoryReader(segments_2:5:nrt)}
[junit4:junit4]   2> 14954 T2161 C83 UPDATE [collection1] webapp=null path=null params={}
{add=[550]} 0 1
[junit4:junit4]   2> 15455 T2170 oasu.DirectUpdateHandler2.commit start commit{flags=0,version=0,optimize=false,openSearcher=true,waitSearcher=true,expungeDeletes=false,softCommit=true}
[junit4:junit4]   2> 15457 T2170 oass.SolrIndexSearcher.<init> Opening Searcher@399bd627
main
[junit4:junit4]   2> 15457 T2170 oass.SolrIndexSearcher.getIndexDir WARNING WARNING: Directory
impl does not support setting indexDir: org.apache.lucene.store.MockDirectoryWrapper
[junit4:junit4]   2> 15457 T2170 oasu.DirectUpdateHandler2.commit end_commit_flush
[junit4:junit4]   2> 15458 T2168 oasc.SolrCore.registerSearcher [collection1] Registered
new searcher Searcher@399bd627 main{StandardDirectoryReader(segments_2:7:nrt _1(4.0):C1)}
[junit4:junit4]   2> 15497 T2169 oasu.DirectUpdateHandler2.commit start commit{flags=0,version=0,optimize=false,openSearcher=true,waitSearcher=true,expungeDeletes=false,softCommit=false}
[junit4:junit4]   2> 15497 T2169 oasc.SolrDeletionPolicy.onCommit SolrDeletionPolicy.onCommit:
commits:num=2
[junit4:junit4]   2> 		commit{dir=MockDirWrapper(org.apache.lucene.store.RAMDirectory@3ff6bef2
lockFactory=org.apache.lucene.store.SingleInstanceLockFactory@65427bab),segFN=segments_2,generation=2,filenames=[_0_4.len,
_0_1.len, _0_3.len, _0_5.len, _0_6.len, _0_7.len, segments_2, _0.inf, _0.si, _0.pst, _0.fld]
[junit4:junit4]   2> 		commit{dir=MockDirWrapper(org.apache.lucene.store.RAMDirectory@3ff6bef2
lockFactory=org.apache.lucene.store.SingleInstanceLockFactory@65427bab),segFN=segments_3,generation=3,filenames=[_1_1.len,
_1.pst, _1.fld, _1_3.len, _1_6.len, _1.si, _1.inf, _1_7.len, _1_4.len, _1_5.len, segments_3]
[junit4:junit4]   2> 15498 T2169 oasc.SolrDeletionPolicy.updateCommits newest commit =
3
[junit4:junit4]   2> 15498 T2169 oass.SolrIndexSearcher.<init> Opening Searcher@1f60cad2
main
[junit4:junit4]   2> 15498 T2169 oass.SolrIndexSearcher.getIndexDir WARNING WARNING: Directory
impl does not support setting indexDir: org.apache.lucene.store.MockDirectoryWrapper
[junit4:junit4]   2> 15498 T2161 oasu.AbstractSolrTestCase.tearDown ####TEARDOWN_START
testSoftAndHardCommitMaxTimeDelete
[junit4:junit4]   2> 15498 T2169 oasu.DirectUpdateHandler2.commit end_commit_flush
[junit4:junit4]   2> 15498 T2161 oasc.CoreContainer.shutdown Shutting down CoreContainer
instance=1917566534
[junit4:junit4]   2> 15499 T2161 oasc.SolrCore.close [collection1]  CLOSING SolrCore org.apache.solr.core.SolrCore@4ab92049
[junit4:junit4]   2> 15499 T2168 oasc.SolrCore.registerSearcher [collection1] Registered
new searcher Searcher@1f60cad2 main{StandardDirectoryReader(segments_2:7:nrt _1(4.0):C1)}
[junit4:junit4]   2> 15501 T2161 oasc.SolrCore.closeSearcher [collection1] Closing main
searcher on request.
[junit4:junit4]   2> 15501 T2161 oasu.DirectUpdateHandler2.close closing DirectUpdateHandler2{commits=4,autocommit
maxTime=1200ms,autocommits=1,soft autocommit maxTime=500ms,soft autocommits=2,optimizes=0,rollbacks=0,expungeDeletes=0,docsPending=0,adds=0,deletesById=0,deletesByQuery=0,errors=0,cumulative_adds=2,cumulative_deletesById=1,cumulative_deletesByQuery=0,cumulative_errors=0}
[junit4:junit4]   2> NOTE: reproduce with: ant test  -Dtestcase=SoftAutoCommitTest -Dtests.method=testSoftAndHardCommitMaxTimeDelete
-Dtests.seed=77ED467C2103815C -Dtests.multiplier=3 -Dtests.slow=true -Dtests.locale=pl_PL
-Dtests.timezone=Hongkong -Dtests.file.encoding=ISO8859-1
[junit4:junit4]   2>
[junit4:junit4]    > (@AfterClass output)
[junit4:junit4]   2> NOTE: test params are: codec=SimpleText, sim=DefaultSimilarity, locale=pl_PL,
timezone=Hongkong
[junit4:junit4]   2> NOTE: FreeBSD 9.0-RELEASE amd64/Sun Microsystems Inc. 1.6.0_32 (64-bit)/cpus=16,threads=1,free=37012144,total=318570496
[junit4:junit4]   2> NOTE: All tests run in this JVM: [QueryParsingTest, TestDocSet, TestKeywordMarkerFilterFactory,
TestPatternReplaceFilterFactory, SpellCheckComponentTest, LeaderElectionTest, TestUAX29URLEmailTokenizerFactory,
TestJapaneseIterationMarkCharFilterFactory, FullSolrCloudTest, ZkCLITest, LoggingHandlerTest,
TestConfig, TestCJKBigramFilterFactory, TestCollationField, PrimUtilsTest, TestSolrXMLSerializer,
SolrPluginUtilsTest, TestNGramFilters, SortByFunctionTest, TestBinaryResponseWriter, TimeZoneUtilsTest,
TestDefaultSimilarityFactory, TestIndexSearcher, MBeansHandlerTest, TestWikipediaTokenizerFactory,
TestStressVersions, FieldMutatingUpdateProcessorTest, TestQueryTypes, CloudStateTest, UUIDFieldTest,
TestEnglishMinimalStemFilterFactory, XsltUpdateRequestHandlerTest, TestReplicationHandler,
DocumentBuilderTest, TestIndonesianStemFilterFactory, TestQuerySenderNoQuery, CircularListTest,
TestJapaneseReadingFormFilterFactory, TestPersianNormalizationFilterFactory, TestPseudoReturnFields,
SampleTest, TestOmitPositions, TestTurkishLowerCaseFilterFactory, SuggesterFSTTest, TestLMDirichletSimilarityFactory,
TestSolrDeletionPolicy1, TestGalicianMinimalStemFilterFactory, SearchHandlerTest, ResourceLoaderTest,
TestRussianLightStemFilterFactory, TestXIncludeConfig, SpellCheckCollatorTest, TestCoreContainer,
TestJapaneseTokenizerFactory, TestGroupingSearch, NotRequiredUniqueKeyTest, ZkSolrClientTest,
TestCSVResponseWriter, TestMultiWordSynonyms, IndexSchemaRuntimeFieldTest, TestRecovery, AlternateDirectoryTest,
TestCJKTokenizerFactory, TestIBSimilarityFactory, TestUtils, DistributedTermsComponentTest,
QueryEqualityTest, StatelessScriptUpdateProcessorFactoryTest, TestLRUCache, TestKeepFilterFactory,
TestPluginEnable, OverseerTest, RecoveryZkTest, TestRealTimeGet, ZkControllerTest, TestRandomFaceting,
CloudStateUpdateTest, SoftAutoCommitTest]
[junit4:junit4]   2> 
[junit4:junit4] Completed on J1 in 7.62s, 3 tests, 1 failure <<< FAILURES!
[...truncated 486 lines...]

[...truncated 21546 lines...]

[...truncated 21546 lines...]

[...truncated 7589 lines...]
check-forbidden-apis:

validate:
     [echo] Building solr...

compile-tools:

ivy-availability-check:

ivy-fail:

ivy-configure:
[ivy:configure] :: loading settings :: file = /usr/home/hudson/hudson-slave/workspace/Lucene-Solr-tests-only-4.x/checkout/lucene/ivy-settings.xml

resolve:

init:

compile-core:

resolve-example:
     [echo] Building solr-example...

ivy-availability-check:

ivy-fail:

ivy-configure:
[ivy:configure] :: loading settings :: file = /usr/home/hudson/hudson-slave/workspace/Lucene-Solr-tests-only-4.x/checkout/lucene/ivy-settings.xml

resolve:
     [echo] Building solr-example-DIH...

ivy-availability-check:

ivy-fail:

ivy-configure:
[ivy:configure] :: loading settings :: file = /usr/home/hudson/hudson-slave/workspace/Lucene-Solr-tests-only-4.x/checkout/lucene/ivy-settings.xml

resolve:

resolve:
     [echo] Building solr-core...

ivy-availability-check:

ivy-fail:

ivy-configure:
[ivy:configure] :: loading settings :: file = /usr/home/hudson/hudson-slave/workspace/Lucene-Solr-tests-only-4.x/checkout/lucene/ivy-settings.xml

resolve:
     [echo] Building solr-solrj...

ivy-availability-check:

ivy-fail:

ivy-configure:
[ivy:configure] :: loading settings :: file = /usr/home/hudson/hudson-slave/workspace/Lucene-Solr-tests-only-4.x/checkout/lucene/ivy-settings.xml

resolve:
     [echo] Building solr-test-framework...

ivy-availability-check:

ivy-fail:

ivy-configure:
[ivy:configure] :: loading settings :: file = /usr/home/hudson/hudson-slave/workspace/Lucene-Solr-tests-only-4.x/checkout/lucene/ivy-settings.xml

resolve:
     [echo] Building solr-analysis-extras...

ivy-availability-check:
[...truncated 4786 lines...]
check-forbidden-apis:

validate:

test:

test-core:

jflex-uptodate-check:

jflex-notice:

javacc-uptodate-check:

javacc-notice:

ivy-availability-check:

ivy-fail:

ivy-configure:
[ivy:configure] :: loading settings :: file = /usr/home/hudson/hudson-slave/workspace/Lucene-Solr-tests-only-4.x/checkout/lucene/ivy-settings.xml

resolve:

init:

-clover.disable:

-clover.setup:

clover:

common.compile-core:
    [javac] Compiling 1 source file to /usr/home/hudson/hudson-slave/workspace/Lucene-Solr-tests-only-4.x/checkout/lucene/build/core/classes/java

compile-core:

compile-test-framework:

ivy-availability-check:

ivy-fail:

ivy-configure:
[ivy:configure] :: loading settings :: file = /usr/home/hudson/hudson-slave/workspace/Lucene-Solr-tests-only-4.x/checkout/lucene/ivy-settings.xml

resolve:

init:

compile-lucene-core:

jflex-uptodate-check:

jflex-notice:

javacc-uptodate-check:

javacc-notice:

ivy-availability-check:

ivy-fail:

ivy-configure:
[ivy:configure] :: loading settings :: file = /usr/home/hudson/hudson-slave/workspace/Lucene-Solr-tests-only-4.x/checkout/lucene/ivy-settings.xml

resolve:

init:

-clover.disable:

-clover.setup:

[...truncated 9019 lines...]

[...truncated 21546 lines...]

[...truncated 21531 lines...]
BUILD FAILED
/usr/home/hudson/hudson-slave/workspace/Lucene-Solr-tests-only-4.x/checkout/build.xml:29:
The following error occurred while executing this line:
/usr/home/hudson/hudson-slave/workspace/Lucene-Solr-tests-only-4.x/checkout/solr/build.xml:144:
The following error occurred while executing this line:
/usr/home/hudson/hudson-slave/workspace/Lucene-Solr-tests-only-4.x/checkout/lucene/module-build.xml:62:
The following error occurred while executing this line:
/usr/home/hudson/hudson-slave/workspace/Lucene-Solr-tests-only-4.x/checkout/lucene/common-build.xml:1093:
The following error occurred while executing this line:
/usr/home/hudson/hudson-slave/workspace/Lucene-Solr-tests-only-4.x/checkout/lucene/common-build.xml:788:
There were test failures: 302 suites, 1081 tests, 1 failure, 5 ignored

Total time: 27 minutes 8 seconds
Build step 'Execute shell' marked build as failure
Archiving artifacts
Recording test results
Publishing Clover coverage report...
No Clover report will be published due to a Build Failure
Email was triggered for: Failure
Sending email for trigger: Failure



Mime
View raw message