lucene-dev mailing list archives

Site index · List index
Message view « Date » · « Thread »
Top « Date » · « Thread »
From Policeman Jenkins Server <jenk...@sd-datasolutions.de>
Subject [JENKINS] Lucene-Solr-4.x-Linux-Java8-64 - Build # 26 - Failure!
Date Fri, 27 Jul 2012 15:55:51 GMT
Build: http://jenkins.sd-datasolutions.de/job/Lucene-Solr-4.x-Linux-Java8-64/26/

1 tests failed.
REGRESSION:  org.apache.solr.handler.component.DistributedQueryElevationComponentTest.testDistribSearch

Error Message:
.responseHeader.params.size()==9,9skipped=4,5

Stack Trace:
junit.framework.AssertionFailedError: .responseHeader.params.size()==9,9skipped=4,5
	at __randomizedtesting.SeedInfo.seed([D36380F652C98628:52850EEE2596E614]:0)
	at junit.framework.Assert.fail(Assert.java:50)
	at org.apache.solr.BaseDistributedSearchTestCase.compareResponses(BaseDistributedSearchTestCase.java:670)
	at org.apache.solr.BaseDistributedSearchTestCase.query(BaseDistributedSearchTestCase.java:392)
	at org.apache.solr.handler.component.DistributedQueryElevationComponentTest.doTest(DistributedQueryElevationComponentTest.java:81)
	at org.apache.solr.BaseDistributedSearchTestCase.testDistribSearch(BaseDistributedSearchTestCase.java:679)
	at sun.reflect.NativeMethodAccessorImpl.invoke0(Native Method)
	at sun.reflect.NativeMethodAccessorImpl.invoke(NativeMethodAccessorImpl.java:57)
	at sun.reflect.DelegatingMethodAccessorImpl.invoke(DelegatingMethodAccessorImpl.java:43)
	at java.lang.reflect.Method.invoke(Method.java:474)
	at com.carrotsearch.randomizedtesting.RandomizedRunner.invoke(RandomizedRunner.java:1995)
	at com.carrotsearch.randomizedtesting.RandomizedRunner.access$1100(RandomizedRunner.java:132)
	at com.carrotsearch.randomizedtesting.RandomizedRunner$6.evaluate(RandomizedRunner.java:818)
	at com.carrotsearch.randomizedtesting.RandomizedRunner$7.evaluate(RandomizedRunner.java:877)
	at com.carrotsearch.randomizedtesting.RandomizedRunner$8.evaluate(RandomizedRunner.java:891)
	at com.carrotsearch.randomizedtesting.rules.SystemPropertiesRestoreRule$1.evaluate(SystemPropertiesRestoreRule.java:53)
	at org.apache.lucene.util.TestRuleSetupTeardownChained$1.evaluate(TestRuleSetupTeardownChained.java:50)
	at org.apache.lucene.util.TestRuleFieldCacheSanity$1.evaluate(TestRuleFieldCacheSanity.java:32)
	at org.apache.lucene.util.AbstractBeforeAfterRule$1.evaluate(AbstractBeforeAfterRule.java:45)
	at com.carrotsearch.randomizedtesting.rules.SystemPropertiesInvariantRule$1.evaluate(SystemPropertiesInvariantRule.java:55)
	at org.apache.lucene.util.TestRuleReportUncaughtExceptions$1.evaluate(TestRuleReportUncaughtExceptions.java:68)
	at org.apache.lucene.util.TestRuleThreadAndTestName$1.evaluate(TestRuleThreadAndTestName.java:48)
	at org.apache.lucene.util.TestRuleIgnoreAfterMaxFailures$1.evaluate(TestRuleIgnoreAfterMaxFailures.java:70)
	at org.apache.lucene.util.TestRuleMarkFailure$1.evaluate(TestRuleMarkFailure.java:48)
	at com.carrotsearch.randomizedtesting.RandomizedRunner.runSingleTest(RandomizedRunner.java:825)
	at com.carrotsearch.randomizedtesting.RandomizedRunner.access$700(RandomizedRunner.java:132)
	at com.carrotsearch.randomizedtesting.RandomizedRunner$3$1.run(RandomizedRunner.java:671)
	at com.carrotsearch.randomizedtesting.RandomizedRunner$3.evaluate(RandomizedRunner.java:697)
	at com.carrotsearch.randomizedtesting.RandomizedRunner$4.evaluate(RandomizedRunner.java:736)
	at com.carrotsearch.randomizedtesting.RandomizedRunner$5.evaluate(RandomizedRunner.java:747)
	at com.carrotsearch.randomizedtesting.rules.SystemPropertiesRestoreRule$1.evaluate(SystemPropertiesRestoreRule.java:53)
	at org.apache.lucene.util.AbstractBeforeAfterRule$1.evaluate(AbstractBeforeAfterRule.java:45)
	at org.apache.lucene.util.TestRuleReportUncaughtExceptions$1.evaluate(TestRuleReportUncaughtExceptions.java:68)
	at org.apache.lucene.util.TestRuleStoreClassName$1.evaluate(TestRuleStoreClassName.java:38)
	at com.carrotsearch.randomizedtesting.rules.SystemPropertiesInvariantRule$1.evaluate(SystemPropertiesInvariantRule.java:55)
	at org.apache.lucene.util.TestRuleNoInstanceHooksOverrides$1.evaluate(TestRuleNoInstanceHooksOverrides.java:53)
	at org.apache.lucene.util.TestRuleNoStaticHooksShadowing$1.evaluate(TestRuleNoStaticHooksShadowing.java:52)
	at org.apache.lucene.util.TestRuleAssertionsRequired$1.evaluate(TestRuleAssertionsRequired.java:36)
	at org.apache.lucene.util.TestRuleMarkFailure$1.evaluate(TestRuleMarkFailure.java:48)
	at org.apache.lucene.util.TestRuleIgnoreAfterMaxFailures$1.evaluate(TestRuleIgnoreAfterMaxFailures.java:70)
	at org.apache.lucene.util.TestRuleIgnoreTestSuites$1.evaluate(TestRuleIgnoreTestSuites.java:55)
	at com.carrotsearch.randomizedtesting.RandomizedRunner.runSuite(RandomizedRunner.java:605)
	at com.carrotsearch.randomizedtesting.RandomizedRunner.access$400(RandomizedRunner.java:132)
	at com.carrotsearch.randomizedtesting.RandomizedRunner$2.run(RandomizedRunner.java:551)




Build Log:
[...truncated 7484 lines...]
[junit4:junit4] Suite: org.apache.solr.handler.component.DistributedQueryElevationComponentTest
[junit4:junit4] FAILURE 1.26s J1 | DistributedQueryElevationComponentTest.testDistribSearch
[junit4:junit4]    > Throwable #1: junit.framework.AssertionFailedError: .responseHeader.params.size()==9,9skipped=4,5
[junit4:junit4]    > 	at __randomizedtesting.SeedInfo.seed([D36380F652C98628:52850EEE2596E614]:0)
[junit4:junit4]    > 	at junit.framework.Assert.fail(Assert.java:50)
[junit4:junit4]    > 	at org.apache.solr.BaseDistributedSearchTestCase.compareResponses(BaseDistributedSearchTestCase.java:670)
[junit4:junit4]    > 	at org.apache.solr.BaseDistributedSearchTestCase.query(BaseDistributedSearchTestCase.java:392)
[junit4:junit4]    > 	at org.apache.solr.handler.component.DistributedQueryElevationComponentTest.doTest(DistributedQueryElevationComponentTest.java:81)
[junit4:junit4]    > 	at org.apache.solr.BaseDistributedSearchTestCase.testDistribSearch(BaseDistributedSearchTestCase.java:679)
[junit4:junit4]    > 	at sun.reflect.NativeMethodAccessorImpl.invoke0(Native Method)
[junit4:junit4]    > 	at sun.reflect.NativeMethodAccessorImpl.invoke(NativeMethodAccessorImpl.java:57)
[junit4:junit4]    > 	at sun.reflect.DelegatingMethodAccessorImpl.invoke(DelegatingMethodAccessorImpl.java:43)
[junit4:junit4]    > 	at java.lang.reflect.Method.invoke(Method.java:474)
[junit4:junit4]    > 	at com.carrotsearch.randomizedtesting.RandomizedRunner.invoke(RandomizedRunner.java:1995)
[junit4:junit4]    > 	at com.carrotsearch.randomizedtesting.RandomizedRunner.access$1100(RandomizedRunner.java:132)
[junit4:junit4]    > 	at com.carrotsearch.randomizedtesting.RandomizedRunner$6.evaluate(RandomizedRunner.java:818)
[junit4:junit4]    > 	at com.carrotsearch.randomizedtesting.RandomizedRunner$7.evaluate(RandomizedRunner.java:877)
[junit4:junit4]    > 	at com.carrotsearch.randomizedtesting.RandomizedRunner$8.evaluate(RandomizedRunner.java:891)
[junit4:junit4]    > 	at com.carrotsearch.randomizedtesting.rules.SystemPropertiesRestoreRule$1.evaluate(SystemPropertiesRestoreRule.java:53)
[junit4:junit4]    > 	at org.apache.lucene.util.TestRuleSetupTeardownChained$1.evaluate(TestRuleSetupTeardownChained.java:50)
[junit4:junit4]    > 	at org.apache.lucene.util.TestRuleFieldCacheSanity$1.evaluate(TestRuleFieldCacheSanity.java:32)
[junit4:junit4]    > 	at org.apache.lucene.util.AbstractBeforeAfterRule$1.evaluate(AbstractBeforeAfterRule.java:45)
[junit4:junit4]    > 	at com.carrotsearch.randomizedtesting.rules.SystemPropertiesInvariantRule$1.evaluate(SystemPropertiesInvariantRule.java:55)
[junit4:junit4]    > 	at org.apache.lucene.util.TestRuleReportUncaughtExceptions$1.evaluate(TestRuleReportUncaughtExceptions.java:68)
[junit4:junit4]    > 	at org.apache.lucene.util.TestRuleThreadAndTestName$1.evaluate(TestRuleThreadAndTestName.java:48)
[junit4:junit4]    > 	at org.apache.lucene.util.TestRuleIgnoreAfterMaxFailures$1.evaluate(TestRuleIgnoreAfterMaxFailures.java:70)
[junit4:junit4]    > 	at org.apache.lucene.util.TestRuleMarkFailure$1.evaluate(TestRuleMarkFailure.java:48)
[junit4:junit4]    > 	at com.carrotsearch.randomizedtesting.RandomizedRunner.runSingleTest(RandomizedRunner.java:825)
[junit4:junit4]    > 	at com.carrotsearch.randomizedtesting.RandomizedRunner.access$700(RandomizedRunner.java:132)
[junit4:junit4]    > 	at com.carrotsearch.randomizedtesting.RandomizedRunner$3$1.run(RandomizedRunner.java:671)
[junit4:junit4]    > 	at com.carrotsearch.randomizedtesting.RandomizedRunner$3.evaluate(RandomizedRunner.java:697)
[junit4:junit4]    > 	at com.carrotsearch.randomizedtesting.RandomizedRunner$4.evaluate(RandomizedRunner.java:736)
[junit4:junit4]    > 	at com.carrotsearch.randomizedtesting.RandomizedRunner$5.evaluate(RandomizedRunner.java:747)
[junit4:junit4]    > 	at com.carrotsearch.randomizedtesting.rules.SystemPropertiesRestoreRule$1.evaluate(SystemPropertiesRestoreRule.java:53)
[junit4:junit4]    > 	at org.apache.lucene.util.AbstractBeforeAfterRule$1.evaluate(AbstractBeforeAfterRule.java:45)
[junit4:junit4]    > 	at org.apache.lucene.util.TestRuleReportUncaughtExceptions$1.evaluate(TestRuleReportUncaughtExceptions.java:68)
[junit4:junit4]    > 	at org.apache.lucene.util.TestRuleStoreClassName$1.evaluate(TestRuleStoreClassName.java:38)
[junit4:junit4]    > 	at com.carrotsearch.randomizedtesting.rules.SystemPropertiesInvariantRule$1.evaluate(SystemPropertiesInvariantRule.java:55)
[junit4:junit4]    > 	at org.apache.lucene.util.TestRuleNoInstanceHooksOverrides$1.evaluate(TestRuleNoInstanceHooksOverrides.java:53)
[junit4:junit4]    > 	at org.apache.lucene.util.TestRuleNoStaticHooksShadowing$1.evaluate(TestRuleNoStaticHooksShadowing.java:52)
[junit4:junit4]    > 	at org.apache.lucene.util.TestRuleAssertionsRequired$1.evaluate(TestRuleAssertionsRequired.java:36)
[junit4:junit4]    > 	at org.apache.lucene.util.TestRuleMarkFailure$1.evaluate(TestRuleMarkFailure.java:48)
[junit4:junit4]    > 	at org.apache.lucene.util.TestRuleIgnoreAfterMaxFailures$1.evaluate(TestRuleIgnoreAfterMaxFailures.java:70)
[junit4:junit4]    > 	at org.apache.lucene.util.TestRuleIgnoreTestSuites$1.evaluate(TestRuleIgnoreTestSuites.java:55)
[junit4:junit4]    > 	at com.carrotsearch.randomizedtesting.RandomizedRunner.runSuite(RandomizedRunner.java:605)
[junit4:junit4]    > 	at com.carrotsearch.randomizedtesting.RandomizedRunner.access$400(RandomizedRunner.java:132)
[junit4:junit4]    > 	at com.carrotsearch.randomizedtesting.RandomizedRunner$2.run(RandomizedRunner.java:551)
[junit4:junit4]    > 
[junit4:junit4]   2> 1 T1522 oas.SolrTestCaseJ4.setUp ###Starting testDistribSearch
[junit4:junit4]   2> 2 T1522 oejs.Server.doStart jetty-8.1.2.v20120308
[junit4:junit4]   2> 14 T1522 oejs.AbstractConnector.doStart Started SocketConnector@0.0.0.0:51390
[junit4:junit4]   2> 14 T1522 oasc.SolrResourceLoader.locateSolrHome JNDI not configured for solr (NoInitialContextEx)
[junit4:junit4]   2> 14 T1522 oasc.SolrResourceLoader.locateSolrHome using system property solr.solr.home: /mnt/ssd/jenkins/workspace/Lucene-Solr-4.x-Linux-Java8-64/checkout/solr/build/solr-core/test-files/solr
[junit4:junit4]   2> 15 T1522 oasc.SolrResourceLoader.<init> new SolrResourceLoader for deduced Solr Home: '/mnt/ssd/jenkins/workspace/Lucene-Solr-4.x-Linux-Java8-64/checkout/solr/build/solr-core/test-files/solr/'
[junit4:junit4]   2> 20 T1522 oass.SolrDispatchFilter.init SolrDispatchFilter.init()
[junit4:junit4]   2> 20 T1522 oasc.SolrResourceLoader.locateSolrHome JNDI not configured for solr (NoInitialContextEx)
[junit4:junit4]   2> 20 T1522 oasc.SolrResourceLoader.locateSolrHome using system property solr.solr.home: /mnt/ssd/jenkins/workspace/Lucene-Solr-4.x-Linux-Java8-64/checkout/solr/build/solr-core/test-files/solr
[junit4:junit4]   2> 21 T1522 oasc.CoreContainer$Initializer.initialize looking for solr.xml: /mnt/ssd/jenkins/workspace/Lucene-Solr-4.x-Linux-Java8-64/checkout/solr/build/solr-core/test-files/solr/solr.xml
[junit4:junit4]   2> 21 T1522 oasc.CoreContainer.<init> New CoreContainer 1397283846
[junit4:junit4]   2> 21 T1522 oasc.CoreContainer.load Loading CoreContainer using Solr Home: '/mnt/ssd/jenkins/workspace/Lucene-Solr-4.x-Linux-Java8-64/checkout/solr/build/solr-core/test-files/solr/'
[junit4:junit4]   2> 21 T1522 oasc.SolrResourceLoader.<init> new SolrResourceLoader for directory: '/mnt/ssd/jenkins/workspace/Lucene-Solr-4.x-Linux-Java8-64/checkout/solr/build/solr-core/test-files/solr/'
[junit4:junit4]   2> 29 T1522 oasc.CoreContainer.load Registering Log Listener
[junit4:junit4]   2> 37 T1522 oasc.CoreContainer.create Creating SolrCore 'collection1' using instanceDir: /mnt/ssd/jenkins/workspace/Lucene-Solr-4.x-Linux-Java8-64/checkout/solr/build/solr-core/test-files/solr/collection1
[junit4:junit4]   2> 37 T1522 oasc.SolrResourceLoader.<init> new SolrResourceLoader for directory: '/mnt/ssd/jenkins/workspace/Lucene-Solr-4.x-Linux-Java8-64/checkout/solr/build/solr-core/test-files/solr/collection1/'
[junit4:junit4]   2> 37 T1522 oasc.SolrResourceLoader.replaceClassLoader Adding 'file:/mnt/ssd/jenkins/workspace/Lucene-Solr-4.x-Linux-Java8-64/checkout/solr/build/solr-core/test-files/solr/collection1/lib/README' to classloader
[junit4:junit4]   2> 37 T1522 oasc.SolrResourceLoader.replaceClassLoader Adding 'file:/mnt/ssd/jenkins/workspace/Lucene-Solr-4.x-Linux-Java8-64/checkout/solr/build/solr-core/test-files/solr/collection1/lib/classes/' to classloader
[junit4:junit4]   2> 53 T1522 oasc.SolrConfig.<init> Using Lucene MatchVersion: LUCENE_40
[junit4:junit4]   2> 77 T1522 oasc.SolrConfig.<init> Loaded SolrConfig: solrconfig-elevate.xml
[junit4:junit4]   2> 77 T1522 oass.IndexSchema.readSchema Reading Solr Schema
[junit4:junit4]   2> 79 T1522 oass.IndexSchema.readSchema Schema name=example
[junit4:junit4]   2> 216 T1522 oass.IndexSchema.readSchema default search field in schema is text
[junit4:junit4]   2> 217 T1522 oass.IndexSchema.readSchema unique key field: id
[junit4:junit4]   2> 219 T1522 oasc.SolrCore.<init> [collection1] Opening new SolrCore at /mnt/ssd/jenkins/workspace/Lucene-Solr-4.x-Linux-Java8-64/checkout/solr/build/solr-core/test-files/solr/collection1/, dataDir=./org.apache.solr.handler.component.DistributedQueryElevationComponentTest-1343404332646/control/data/
[junit4:junit4]   2> 219 T1522 oasc.JmxMonitoredMap.<init> JMX monitoring is enabled. Adding Solr mbeans to JMX Server: com.sun.jmx.mbeanserver.JmxMBeanServer@3018fc1a
[junit4:junit4]   2> 220 T1522 oasc.SolrCore.getNewIndexDir WARNING New index directory detected: old=null new=./org.apache.solr.handler.component.DistributedQueryElevationComponentTest-1343404332646/control/data/index/
[junit4:junit4]   2> 220 T1522 oasc.SolrCore.initIndex WARNING [collection1] Solr index directory './org.apache.solr.handler.component.DistributedQueryElevationComponentTest-1343404332646/control/data/index' doesn't exist. Creating new index...
[junit4:junit4]   2> 224 T1522 oasc.SolrDeletionPolicy.onCommit SolrDeletionPolicy.onCommit: commits:num=1
[junit4:junit4]   2> 		commit{dir=MockDirWrapper(NRTCachingDirectory(org.apache.lucene.store.RAMDirectory@27166b0c lockFactory=org.apache.lucene.store.SingleInstanceLockFactory@701b91e3; maxCacheMB=0.4775390625 maxMergeSizeMB=0.7392578125)),segFN=segments_1,generation=1,filenames=[segments_1]
[junit4:junit4]   2> 225 T1522 oasc.SolrDeletionPolicy.updateCommits newest commit = 1
[junit4:junit4]   2> 225 T1522 oasc.RequestHandlers.initHandlersFromConfig created /update: solr.UpdateRequestHandler
[junit4:junit4]   2> 225 T1522 oasc.RequestHandlers.initHandlersFromConfig created /elevate: org.apache.solr.handler.component.SearchHandler
[junit4:junit4]   2> 226 T1522 oasc.RequestHandlers.initHandlersFromConfig created /dataElevate: org.apache.solr.handler.component.SearchHandler
[junit4:junit4]   2> 226 T1522 oashl.XMLLoader.init xsltCacheLifetimeSeconds=60
[junit4:junit4]   2> 226 T1522 oasc.RequestHandlers.initHandlersFromConfig WARNING no default request handler is registered (either '/select' or 'standard')
[junit4:junit4]   2> 227 T1522 oasc.SolrCore.initDeprecatedSupport WARNING solrconfig.xml uses deprecated <admin/gettableFiles>, Please update your config to use the ShowFileRequestHandler.
[junit4:junit4]   2> 228 T1522 oasc.SolrCore.initDeprecatedSupport WARNING adding ShowFileRequestHandler with hidden files: [BAD-SCHEMA-UNIQUEKEY-USES-DEFAULT.XML, FRENCHARTICLES.TXT, SOLRCONFIG-PROPINJECT-INDEXDEFAULT.XML, STOP-2.TXT, SCHEMA-TRIE.XML, MAPPING-ISOLATIN1ACCENT.TXT, OPEN-EXCHANGE-RATES.JSON, SOLRCONFIG-NATIVELOCK.XML, HUNSPELL-TEST.AFF, BAD-SCHEMA-UNIQUEKEY-IS-COPYFIELD-DEST.XML, SOLRCONFIG-REQHANDLER.INCL, SCHEMA-MINIMAL.XML, SOLRCONFIG-SIMPLELOCK.XML, STOPWORDSWRONGENCODING.TXT, SCHEMA-SIM.XML, TRIVIAL.UPDATEPROCESSOR0.JS, SOLRCONFIG-SOLR-749.XML, SCHEMA-TFIDF.XML, BAD-SCHEMA-DUP-DYNAMICFIELD.XML, SCHEMA-COLLATE.XML, KEEP-1.TXT, SCHEMA-REPLICATION2.XML, BAD-SOLRCONFIG-BOGUS-SCRIPTENGINE-NAME.XML, STOP-SNOWBALL.TXT, SOLRCONFIG-SLAVE1.XML, OLD_SYNONYMS.TXT, SCHEMA-FOLDING.XML, COMPOUNDDICTIONARY.TXT, MISSLEADING.EXTENSION.UPDATEPROCESSOR.JS.TXT, SCHEMA-LUCENEMATCHVERSION.XML, THROW.ERROR.ON.ADD.UPDATEPROCESSOR.JS, STOPWORDS.TXT, SOLRCONFIG-MASTER3.XML, SOLRCONFIG-ELEVATE.XML, SOLRCONFIG-NOCACHE.XML, STEMDICT.TXT, ADDFIELDS.UPDATEPROCESSOR.JS, SOLRCONFIG-SLAVE.XML, STOPWITHBOM.TXT, SCHEMA-DFR.XML, SCHEMA12.XML, WDFTYPES.TXT, DA_UTF8.XML, BAD-SCHEMA-DUP-FIELDTYPE.XML, SCHEMA-IB.XML, KEEP-2.TXT, SOLRCONFIG-UPDATE-PROCESSOR-CHAINS.XML, SCHEMA-LMDIRICHLET.XML, SOLRCONFIG-TRANSFORMERS.XML, TRIVIAL.UPDATEPROCESSOR1.JS, SOLRCONFIG-HIGHLIGHT.XML, SOLRCONFIG-MASTER.XML, BAD_SOLRCONFIG.XML, SOLRCONFIG_PERF.XML, BAD-SCHEMA-NOT-INDEXED-BUT-TF.XML, ELEVATE.XML, DA_COMPOUNDDICTIONARY.TXT, HUNSPELL-TEST.DIC, BAD-SCHEMA-NONTEXT-ANALYZER.XML, SCHEMA-NOT-REQUIRED-UNIQUE-KEY.XML, SOLRCONFIG-LAZYWRITER.XML, HYPHENATION.DTD, BAD-SCHEMA-SIM-GLOBAL-VS-FT-MISMATCH.XML, SCHEMA-REPLICATION1.XML, SOLRCONFIG-DELPOLICY2.XML, BAD-SOLRCONFIG-MISSING-SCRIPTFILE.XML, BAD-MP-SOLRCONFIG.XML, BAD-SCHEMA-NOT-INDEXED-BUT-POS.XML, BAD-SCHEMA-EXTERNAL-FILEFIELD.XML, CONDITIONAL.UPDATEPROCESSOR.JS, SCHEMA.XML, SOLRCONFIG-ENABLEPLUGIN.XML, PHRASESUGGEST.TXT, SOLRCONFIG-REPEATER.XML, SCHEMA-PHRASESUGGEST.XML, SOLRCONFIG-ALTDIRECTORY.XML, SCHEMA-REQUIRED-FIELDS.XML, SOLRCONFIG-MASTER1-KEEPONEBACKUP.XML, SCHEMA-REVERSED.XML, SOLRCONFIG_CODEC.XML, SCHEMA_CODEC.XML, SOLRCONFIG-XINCLUDE.XML, SOLRCONFIG-TLOG.XML, SOLRCONFIG-BASIC.XML, SOLRCONFIG-PHRASESUGGEST.XML, STOPTYPES-1.TXT, SOLRCONFIG-MASTER1.XML, SCHEMA-BINARYFIELD.XML, SCHEMA-CHARFILTERS.XML, BAD-SCHEMA-DUP-FIELD.XML, PROTWORDS.TXT, SOLRCONFIG-PROPINJECT.XML, SCHEMA15.XML, SCHEMA11.XML, SOLRCONFIG-BASIC-LUCENEVERSION31.XML, SOLRCONFIG-TERMINDEX.XML, STOP-1.TXT, MISSING.FUNCTIONS.UPDATEPROCESSOR.JS, SOLRCONFIG-QUERYSENDER.XML, XSLT, SOLRCONFIG-SCRIPT-UPDATEPROCESSOR.XML, SCHEMA-COLLATEFILTER.XML, SOLRCONFIG-MERGEPOLICY.XML, SOLRCONFIG-SOLCOREPROPERTIES.XML, SCHEMA-STOP-KEEP.XML, SYNONYMS.TXT, SOLRCONFIG-CACHING.XML, STOPTYPES-2.TXT, SOLRCONFIG-SPELLCHECKCOMPONENT.XML, SCHEMA-BM25.XML, SCHEMA-LMJELINEKMERCER.XML, BAD-SCHEMA-OMIT-TF-BUT-NOT-POS.XML, CURRENCY.XML, SCHEMASURROUND.XML, SOLRCONFIG-FUNCTIONQUERY.XML, SOLRCONFIG-MASTER2.XML, BAD-SCHEMA-NOT-INDEXED-BUT-NORMS.XML, SCHEMA-NUMERIC.XML, SOLRCONFIG-SPELLCHECKER.XML, SCHEMA-COPYFIELD-TEST.XML, SOLRCONFIG-QUERYSENDER-NOQUERY.XML, SCHEMA-SPELLCHECKER.XML, SOLRCONFIG-DELPOLICY1.XML, BAD-SOLRCONFIG-INVALID-SCRIPTFILE.XML, BAD-SCHEMA-CODEC-GLOBAL-VS-FT-MISMATCH.XML]
[junit4:junit4]   2> 229 T1522 oass.SolrIndexSearcher.<init> Opening Searcher@15eb593f main
[junit4:junit4]   2> 229 T1522 oass.SolrIndexSearcher.getIndexDir WARNING WARNING: Directory impl does not support setting indexDir: org.apache.lucene.store.MockDirectoryWrapper
[junit4:junit4]   2> 230 T1522 oasu.CommitTracker.<init> Hard AutoCommit: disabled
[junit4:junit4]   2> 230 T1522 oasu.CommitTracker.<init> Soft AutoCommit: disabled
[junit4:junit4]   2> 230 T1522 oashc.QueryElevationComponent.inform Loading QueryElevation from: /mnt/ssd/jenkins/workspace/Lucene-Solr-4.x-Linux-Java8-64/checkout/solr/build/solr-core/test-files/solr/collection1/conf/elevate.xml
[junit4:junit4]   2> 235 T1522 oashc.QueryElevationComponent.inform Loading QueryElevation from: /mnt/ssd/jenkins/workspace/Lucene-Solr-4.x-Linux-Java8-64/checkout/solr/build/solr-core/test-files/solr/collection1/conf/elevate.xml
[junit4:junit4]   2> 239 T1522 oashc.HttpShardHandlerFactory.getParameter Setting socketTimeout to: 0
[junit4:junit4]   2> 240 T1522 oashc.HttpShardHandlerFactory.getParameter Setting urlScheme to: http://
[junit4:junit4]   2> 240 T1522 oashc.HttpShardHandlerFactory.getParameter Setting connTimeout to: 0
[junit4:junit4]   2> 240 T1522 oashc.HttpShardHandlerFactory.getParameter Setting maxConnectionsPerHost to: 20
[junit4:junit4]   2> 240 T1522 oashc.HttpShardHandlerFactory.getParameter Setting corePoolSize to: 0
[junit4:junit4]   2> 240 T1522 oashc.HttpShardHandlerFactory.getParameter Setting maximumPoolSize to: 2147483647
[junit4:junit4]   2> 241 T1522 oashc.HttpShardHandlerFactory.getParameter Setting maxThreadIdleTime to: 5
[junit4:junit4]   2> 241 T1522 oashc.HttpShardHandlerFactory.getParameter Setting sizeOfQueue to: -1
[junit4:junit4]   2> 241 T1522 oashc.HttpShardHandlerFactory.getParameter Setting fairnessPolicy to: false
[junit4:junit4]   2> 241 T1522 oascsi.HttpClientUtil.createClient Creating new http client, config:maxConnectionsPerHost=20&maxConnections=10000&socketTimeout=0&connTimeout=0&retry=false
[junit4:junit4]   2> 243 T1522 oasc.CoreContainer.register registering core: collection1
[junit4:junit4]   2> 243 T1522 oass.SolrDispatchFilter.init user.dir=/mnt/ssd/jenkins/workspace/Lucene-Solr-4.x-Linux-Java8-64/checkout/solr/build/solr-core/test/J1
[junit4:junit4]   2> 244 T1522 oass.SolrDispatchFilter.init SolrDispatchFilter.init() done
[junit4:junit4]   2> 244 T1532 oasc.SolrCore.registerSearcher [collection1] Registered new searcher Searcher@15eb593f main{StandardDirectoryReader(segments_1:1)}
[junit4:junit4]   2> 244 T1522 oascsi.HttpClientUtil.createClient Creating new http client, config:maxConnections=128&maxConnectionsPerHost=32&followRedirects=false
[junit4:junit4]   2> 246 T1522 oejs.Server.doStart jetty-8.1.2.v20120308
[junit4:junit4]   2> 248 T1522 oejs.AbstractConnector.doStart Started SocketConnector@0.0.0.0:40966
[junit4:junit4]   2> 248 T1522 oasc.SolrResourceLoader.locateSolrHome JNDI not configured for solr (NoInitialContextEx)
[junit4:junit4]   2> 249 T1522 oasc.SolrResourceLoader.locateSolrHome using system property solr.solr.home: /mnt/ssd/jenkins/workspace/Lucene-Solr-4.x-Linux-Java8-64/checkout/solr/build/solr-core/test-files/solr
[junit4:junit4]   2> 249 T1522 oasc.SolrResourceLoader.<init> new SolrResourceLoader for deduced Solr Home: '/mnt/ssd/jenkins/workspace/Lucene-Solr-4.x-Linux-Java8-64/checkout/solr/build/solr-core/test-files/solr/'
[junit4:junit4]   2> 257 T1522 oass.SolrDispatchFilter.init SolrDispatchFilter.init()
[junit4:junit4]   2> 257 T1522 oasc.SolrResourceLoader.locateSolrHome JNDI not configured for solr (NoInitialContextEx)
[junit4:junit4]   2> 257 T1522 oasc.SolrResourceLoader.locateSolrHome using system property solr.solr.home: /mnt/ssd/jenkins/workspace/Lucene-Solr-4.x-Linux-Java8-64/checkout/solr/build/solr-core/test-files/solr
[junit4:junit4]   2> 258 T1522 oasc.CoreContainer$Initializer.initialize looking for solr.xml: /mnt/ssd/jenkins/workspace/Lucene-Solr-4.x-Linux-Java8-64/checkout/solr/build/solr-core/test-files/solr/solr.xml
[junit4:junit4]   2> 258 T1522 oasc.CoreContainer.<init> New CoreContainer 2052412387
[junit4:junit4]   2> 258 T1522 oasc.CoreContainer.load Loading CoreContainer using Solr Home: '/mnt/ssd/jenkins/workspace/Lucene-Solr-4.x-Linux-Java8-64/checkout/solr/build/solr-core/test-files/solr/'
[junit4:junit4]   2> 258 T1522 oasc.SolrResourceLoader.<init> new SolrResourceLoader for directory: '/mnt/ssd/jenkins/workspace/Lucene-Solr-4.x-Linux-Java8-64/checkout/solr/build/solr-core/test-files/solr/'
[junit4:junit4]   2> 269 T1522 oasc.CoreContainer.load Registering Log Listener
[junit4:junit4]   2> 278 T1522 oasc.CoreContainer.create Creating SolrCore 'collection1' using instanceDir: /mnt/ssd/jenkins/workspace/Lucene-Solr-4.x-Linux-Java8-64/checkout/solr/build/solr-core/test-files/solr/collection1
[junit4:junit4]   2> 278 T1522 oasc.SolrResourceLoader.<init> new SolrResourceLoader for directory: '/mnt/ssd/jenkins/workspace/Lucene-Solr-4.x-Linux-Java8-64/checkout/solr/build/solr-core/test-files/solr/collection1/'
[junit4:junit4]   2> 279 T1522 oasc.SolrResourceLoader.replaceClassLoader Adding 'file:/mnt/ssd/jenkins/workspace/Lucene-Solr-4.x-Linux-Java8-64/checkout/solr/build/solr-core/test-files/solr/collection1/lib/README' to classloader
[junit4:junit4]   2> 279 T1522 oasc.SolrResourceLoader.replaceClassLoader Adding 'file:/mnt/ssd/jenkins/workspace/Lucene-Solr-4.x-Linux-Java8-64/checkout/solr/build/solr-core/test-files/solr/collection1/lib/classes/' to classloader
[junit4:junit4]   2> 294 T1522 oasc.SolrConfig.<init> Using Lucene MatchVersion: LUCENE_40
[junit4:junit4]   2> 317 T1522 oasc.SolrConfig.<init> Loaded SolrConfig: solrconfig-elevate.xml
[junit4:junit4]   2> 317 T1522 oass.IndexSchema.readSchema Reading Solr Schema
[junit4:junit4]   2> 319 T1522 oass.IndexSchema.readSchema Schema name=example
[junit4:junit4]   2> 416 T1522 oass.IndexSchema.readSchema default search field in schema is text
[junit4:junit4]   2> 417 T1522 oass.IndexSchema.readSchema unique key field: id
[junit4:junit4]   2> 419 T1522 oasc.SolrCore.<init> [collection1] Opening new SolrCore at /mnt/ssd/jenkins/workspace/Lucene-Solr-4.x-Linux-Java8-64/checkout/solr/build/solr-core/test-files/solr/collection1/, dataDir=./org.apache.solr.handler.component.DistributedQueryElevationComponentTest-1343404332646/shard0/data/
[junit4:junit4]   2> 419 T1522 oasc.JmxMonitoredMap.<init> JMX monitoring is enabled. Adding Solr mbeans to JMX Server: com.sun.jmx.mbeanserver.JmxMBeanServer@3018fc1a
[junit4:junit4]   2> 419 T1522 oasc.SolrCore.getNewIndexDir WARNING New index directory detected: old=null new=./org.apache.solr.handler.component.DistributedQueryElevationComponentTest-1343404332646/shard0/data/index/
[junit4:junit4]   2> 420 T1522 oasc.SolrCore.initIndex WARNING [collection1] Solr index directory './org.apache.solr.handler.component.DistributedQueryElevationComponentTest-1343404332646/shard0/data/index' doesn't exist. Creating new index...
[junit4:junit4]   2> 421 T1522 oasc.SolrDeletionPolicy.onCommit SolrDeletionPolicy.onCommit: commits:num=1
[junit4:junit4]   2> 		commit{dir=MockDirWrapper(org.apache.lucene.store.RAMDirectory@1cf8911a lockFactory=org.apache.lucene.store.SingleInstanceLockFactory@66c0c87),segFN=segments_1,generation=1,filenames=[segments_1]
[junit4:junit4]   2> 421 T1522 oasc.SolrDeletionPolicy.updateCommits newest commit = 1
[junit4:junit4]   2> 422 T1522 oasc.RequestHandlers.initHandlersFromConfig created /update: solr.UpdateRequestHandler
[junit4:junit4]   2> 422 T1522 oasc.RequestHandlers.initHandlersFromConfig created /elevate: org.apache.solr.handler.component.SearchHandler
[junit4:junit4]   2> 422 T1522 oasc.RequestHandlers.initHandlersFromConfig created /dataElevate: org.apache.solr.handler.component.SearchHandler
[junit4:junit4]   2> 423 T1522 oashl.XMLLoader.init xsltCacheLifetimeSeconds=60
[junit4:junit4]   2> 423 T1522 oasc.RequestHandlers.initHandlersFromConfig WARNING no default request handler is registered (either '/select' or 'standard')
[junit4:junit4]   2> 424 T1522 oasc.SolrCore.initDeprecatedSupport WARNING solrconfig.xml uses deprecated <admin/gettableFiles>, Please update your config to use the ShowFileRequestHandler.
[junit4:junit4]   2> 425 T1522 oasc.SolrCore.initDeprecatedSupport WARNING adding ShowFileRequestHandler with hidden files: [BAD-SCHEMA-UNIQUEKEY-USES-DEFAULT.XML, FRENCHARTICLES.TXT, SOLRCONFIG-PROPINJECT-INDEXDEFAULT.XML, STOP-2.TXT, SCHEMA-TRIE.XML, MAPPING-ISOLATIN1ACCENT.TXT, OPEN-EXCHANGE-RATES.JSON, SOLRCONFIG-NATIVELOCK.XML, HUNSPELL-TEST.AFF, BAD-SCHEMA-UNIQUEKEY-IS-COPYFIELD-DEST.XML, SOLRCONFIG-REQHANDLER.INCL, SCHEMA-MINIMAL.XML, SOLRCONFIG-SIMPLELOCK.XML, STOPWORDSWRONGENCODING.TXT, SCHEMA-SIM.XML, TRIVIAL.UPDATEPROCESSOR0.JS, SOLRCONFIG-SOLR-749.XML, SCHEMA-TFIDF.XML, BAD-SCHEMA-DUP-DYNAMICFIELD.XML, SCHEMA-COLLATE.XML, KEEP-1.TXT, SCHEMA-REPLICATION2.XML, BAD-SOLRCONFIG-BOGUS-SCRIPTENGINE-NAME.XML, STOP-SNOWBALL.TXT, SOLRCONFIG-SLAVE1.XML, OLD_SYNONYMS.TXT, SCHEMA-FOLDING.XML, COMPOUNDDICTIONARY.TXT, MISSLEADING.EXTENSION.UPDATEPROCESSOR.JS.TXT, SCHEMA-LUCENEMATCHVERSION.XML, THROW.ERROR.ON.ADD.UPDATEPROCESSOR.JS, STOPWORDS.TXT, SOLRCONFIG-MASTER3.XML, SOLRCONFIG-ELEVATE.XML, SOLRCONFIG-NOCACHE.XML, STEMDICT.TXT, ADDFIELDS.UPDATEPROCESSOR.JS, SOLRCONFIG-SLAVE.XML, STOPWITHBOM.TXT, SCHEMA-DFR.XML, SCHEMA12.XML, WDFTYPES.TXT, DA_UTF8.XML, BAD-SCHEMA-DUP-FIELDTYPE.XML, SCHEMA-IB.XML, KEEP-2.TXT, SOLRCONFIG-UPDATE-PROCESSOR-CHAINS.XML, SCHEMA-LMDIRICHLET.XML, SOLRCONFIG-TRANSFORMERS.XML, TRIVIAL.UPDATEPROCESSOR1.JS, SOLRCONFIG-HIGHLIGHT.XML, SOLRCONFIG-MASTER.XML, BAD_SOLRCONFIG.XML, SOLRCONFIG_PERF.XML, BAD-SCHEMA-NOT-INDEXED-BUT-TF.XML, ELEVATE.XML, DA_COMPOUNDDICTIONARY.TXT, HUNSPELL-TEST.DIC, BAD-SCHEMA-NONTEXT-ANALYZER.XML, SCHEMA-NOT-REQUIRED-UNIQUE-KEY.XML, SOLRCONFIG-LAZYWRITER.XML, HYPHENATION.DTD, BAD-SCHEMA-SIM-GLOBAL-VS-FT-MISMATCH.XML, SCHEMA-REPLICATION1.XML, SOLRCONFIG-DELPOLICY2.XML, BAD-SOLRCONFIG-MISSING-SCRIPTFILE.XML, BAD-MP-SOLRCONFIG.XML, BAD-SCHEMA-NOT-INDEXED-BUT-POS.XML, BAD-SCHEMA-EXTERNAL-FILEFIELD.XML, CONDITIONAL.UPDATEPROCESSOR.JS, SCHEMA.XML, SOLRCONFIG-ENABLEPLUGIN.XML, PHRASESUGGEST.TXT, SOLRCONFIG-REPEATER.XML, SCHEMA-PHRASESUGGEST.XML, SOLRCONFIG-ALTDIRECTORY.XML, SCHEMA-REQUIRED-FIELDS.XML, SOLRCONFIG-MASTER1-KEEPONEBACKUP.XML, SCHEMA-REVERSED.XML, SOLRCONFIG_CODEC.XML, SCHEMA_CODEC.XML, SOLRCONFIG-XINCLUDE.XML, SOLRCONFIG-TLOG.XML, SOLRCONFIG-BASIC.XML, SOLRCONFIG-PHRASESUGGEST.XML, STOPTYPES-1.TXT, SOLRCONFIG-MASTER1.XML, SCHEMA-BINARYFIELD.XML, SCHEMA-CHARFILTERS.XML, BAD-SCHEMA-DUP-FIELD.XML, PROTWORDS.TXT, SOLRCONFIG-PROPINJECT.XML, SCHEMA15.XML, SCHEMA11.XML, SOLRCONFIG-BASIC-LUCENEVERSION31.XML, SOLRCONFIG-TERMINDEX.XML, STOP-1.TXT, MISSING.FUNCTIONS.UPDATEPROCESSOR.JS, SOLRCONFIG-QUERYSENDER.XML, XSLT, SOLRCONFIG-SCRIPT-UPDATEPROCESSOR.XML, SCHEMA-COLLATEFILTER.XML, SOLRCONFIG-MERGEPOLICY.XML, SOLRCONFIG-SOLCOREPROPERTIES.XML, SCHEMA-STOP-KEEP.XML, SYNONYMS.TXT, SOLRCONFIG-CACHING.XML, STOPTYPES-2.TXT, SOLRCONFIG-SPELLCHECKCOMPONENT.XML, SCHEMA-BM25.XML, SCHEMA-LMJELINEKMERCER.XML, BAD-SCHEMA-OMIT-TF-BUT-NOT-POS.XML, CURRENCY.XML, SCHEMASURROUND.XML, SOLRCONFIG-FUNCTIONQUERY.XML, SOLRCONFIG-MASTER2.XML, BAD-SCHEMA-NOT-INDEXED-BUT-NORMS.XML, SCHEMA-NUMERIC.XML, SOLRCONFIG-SPELLCHECKER.XML, SCHEMA-COPYFIELD-TEST.XML, SOLRCONFIG-QUERYSENDER-NOQUERY.XML, SCHEMA-SPELLCHECKER.XML, SOLRCONFIG-DELPOLICY1.XML, BAD-SOLRCONFIG-INVALID-SCRIPTFILE.XML, BAD-SCHEMA-CODEC-GLOBAL-VS-FT-MISMATCH.XML]
[junit4:junit4]   2> 427 T1522 oass.SolrIndexSearcher.<init> Opening Searcher@27a57324 main
[junit4:junit4]   2> 427 T1522 oass.SolrIndexSearcher.getIndexDir WARNING WARNING: Directory impl does not support setting indexDir: org.apache.lucene.store.MockDirectoryWrapper
[junit4:junit4]   2> 428 T1522 oasu.CommitTracker.<init> Hard AutoCommit: disabled
[junit4:junit4]   2> 428 T1522 oasu.CommitTracker.<init> Soft AutoCommit: disabled
[junit4:junit4]   2> 429 T1522 oashc.QueryElevationComponent.inform Loading QueryElevation from: /mnt/ssd/jenkins/workspace/Lucene-Solr-4.x-Linux-Java8-64/checkout/solr/build/solr-core/test-files/solr/collection1/conf/elevate.xml
[junit4:junit4]   2> 436 T1522 oashc.QueryElevationComponent.inform Loading QueryElevation from: /mnt/ssd/jenkins/workspace/Lucene-Solr-4.x-Linux-Java8-64/checkout/solr/build/solr-core/test-files/solr/collection1/conf/elevate.xml
[junit4:junit4]   2> 441 T1522 oashc.HttpShardHandlerFactory.getParameter Setting socketTimeout to: 0
[junit4:junit4]   2> 441 T1522 oashc.HttpShardHandlerFactory.getParameter Setting urlScheme to: http://
[junit4:junit4]   2> 442 T1522 oashc.HttpShardHandlerFactory.getParameter Setting connTimeout to: 0
[junit4:junit4]   2> 442 T1522 oashc.HttpShardHandlerFactory.getParameter Setting maxConnectionsPerHost to: 20
[junit4:junit4]   2> 442 T1522 oashc.HttpShardHandlerFactory.getParameter Setting corePoolSize to: 0
[junit4:junit4]   2> 442 T1522 oashc.HttpShardHandlerFactory.getParameter Setting maximumPoolSize to: 2147483647
[junit4:junit4]   2> 442 T1522 oashc.HttpShardHandlerFactory.getParameter Setting maxThreadIdleTime to: 5
[junit4:junit4]   2> 442 T1522 oashc.HttpShardHandlerFactory.getParameter Setting sizeOfQueue to: -1
[junit4:junit4]   2> 443 T1522 oashc.HttpShardHandlerFactory.getParameter Setting fairnessPolicy to: false
[junit4:junit4]   2> 443 T1522 oascsi.HttpClientUtil.createClient Creating new http client, config:maxConnectionsPerHost=20&maxConnections=10000&socketTimeout=0&connTimeout=0&retry=false
[junit4:junit4]   2> 445 T1542 oasc.SolrCore.registerSearcher [collection1] Registered new searcher Searcher@27a57324 main{StandardDirectoryReader(segments_1:1)}
[junit4:junit4]   2> 445 T1522 oasc.CoreContainer.register registering core: collection1
[junit4:junit4]   2> 445 T1522 oass.SolrDispatchFilter.init user.dir=/mnt/ssd/jenkins/workspace/Lucene-Solr-4.x-Linux-Java8-64/checkout/solr/build/solr-core/test/J1
[junit4:junit4]   2> 445 T1522 oass.SolrDispatchFilter.init SolrDispatchFilter.init() done
[junit4:junit4]   2> 445 T1522 oascsi.HttpClientUtil.createClient Creating new http client, config:maxConnections=128&maxConnectionsPerHost=32&followRedirects=false
[junit4:junit4]   2> 447 T1522 oejs.Server.doStart jetty-8.1.2.v20120308
[junit4:junit4]   2> 449 T1522 oejs.AbstractConnector.doStart Started SocketConnector@0.0.0.0:54061
[junit4:junit4]   2> 450 T1522 oasc.SolrResourceLoader.locateSolrHome JNDI not configured for solr (NoInitialContextEx)
[junit4:junit4]   2> 450 T1522 oasc.SolrResourceLoader.locateSolrHome using system property solr.solr.home: /mnt/ssd/jenkins/workspace/Lucene-Solr-4.x-Linux-Java8-64/checkout/solr/build/solr-core/test-files/solr
[junit4:junit4]   2> 450 T1522 oasc.SolrResourceLoader.<init> new SolrResourceLoader for deduced Solr Home: '/mnt/ssd/jenkins/workspace/Lucene-Solr-4.x-Linux-Java8-64/checkout/solr/build/solr-core/test-files/solr/'
[junit4:junit4]   2> 458 T1522 oass.SolrDispatchFilter.init SolrDispatchFilter.init()
[junit4:junit4]   2> 459 T1522 oasc.SolrResourceLoader.locateSolrHome JNDI not configured for solr (NoInitialContextEx)
[junit4:junit4]   2> 459 T1522 oasc.SolrResourceLoader.locateSolrHome using system property solr.solr.home: /mnt/ssd/jenkins/workspace/Lucene-Solr-4.x-Linux-Java8-64/checkout/solr/build/solr-core/test-files/solr
[junit4:junit4]   2> 459 T1522 oasc.CoreContainer$Initializer.initialize looking for solr.xml: /mnt/ssd/jenkins/workspace/Lucene-Solr-4.x-Linux-Java8-64/checkout/solr/build/solr-core/test-files/solr/solr.xml
[junit4:junit4]   2> 459 T1522 oasc.CoreContainer.<init> New CoreContainer 1979999073
[junit4:junit4]   2> 459 T1522 oasc.CoreContainer.load Loading CoreContainer using Solr Home: '/mnt/ssd/jenkins/workspace/Lucene-Solr-4.x-Linux-Java8-64/checkout/solr/build/solr-core/test-files/solr/'
[junit4:junit4]   2> 460 T1522 oasc.SolrResourceLoader.<init> new SolrResourceLoader for directory: '/mnt/ssd/jenkins/workspace/Lucene-Solr-4.x-Linux-Java8-64/checkout/solr/build/solr-core/test-files/solr/'
[junit4:junit4]   2> 470 T1522 oasc.CoreContainer.load Registering Log Listener
[junit4:junit4]   2> 480 T1522 oasc.CoreContainer.create Creating SolrCore 'collection1' using instanceDir: /mnt/ssd/jenkins/workspace/Lucene-Solr-4.x-Linux-Java8-64/checkout/solr/build/solr-core/test-files/solr/collection1
[junit4:junit4]   2> 480 T1522 oasc.SolrResourceLoader.<init> new SolrResourceLoader for directory: '/mnt/ssd/jenkins/workspace/Lucene-Solr-4.x-Linux-Java8-64/checkout/solr/build/solr-core/test-files/solr/collection1/'
[junit4:junit4]   2> 480 T1522 oasc.SolrResourceLoader.replaceClassLoader Adding 'file:/mnt/ssd/jenkins/workspace/Lucene-Solr-4.x-Linux-Java8-64/checkout/solr/build/solr-core/test-files/solr/collection1/lib/README' to classloader
[junit4:junit4]   2> 480 T1522 oasc.SolrResourceLoader.replaceClassLoader Adding 'file:/mnt/ssd/jenkins/workspace/Lucene-Solr-4.x-Linux-Java8-64/checkout/solr/build/solr-core/test-files/solr/collection1/lib/classes/' to classloader
[junit4:junit4]   2> 495 T1522 oasc.SolrConfig.<init> Using Lucene MatchVersion: LUCENE_40
[junit4:junit4]   2> 518 T1522 oasc.SolrConfig.<init> Loaded SolrConfig: solrconfig-elevate.xml
[junit4:junit4]   2> 518 T1522 oass.IndexSchema.readSchema Reading Solr Schema
[junit4:junit4]   2> 520 T1522 oass.IndexSchema.readSchema Schema name=example
[junit4:junit4]   2> 624 T1522 oass.IndexSchema.readSchema default search field in schema is text
[junit4:junit4]   2> 627 T1522 oass.IndexSchema.readSchema unique key field: id
[junit4:junit4]   2> 629 T1522 oasc.SolrCore.<init> [collection1] Opening new SolrCore at /mnt/ssd/jenkins/workspace/Lucene-Solr-4.x-Linux-Java8-64/checkout/solr/build/solr-core/test-files/solr/collection1/, dataDir=./org.apache.solr.handler.component.DistributedQueryElevationComponentTest-1343404332646/shard1/data/
[junit4:junit4]   2> 630 T1522 oasc.JmxMonitoredMap.<init> JMX monitoring is enabled. Adding Solr mbeans to JMX Server: com.sun.jmx.mbeanserver.JmxMBeanServer@3018fc1a
[junit4:junit4]   2> 630 T1522 oasc.SolrCore.getNewIndexDir WARNING New index directory detected: old=null new=./org.apache.solr.handler.component.DistributedQueryElevationComponentTest-1343404332646/shard1/data/index/
[junit4:junit4]   2> 630 T1522 oasc.SolrCore.initIndex WARNING [collection1] Solr index directory './org.apache.solr.handler.component.DistributedQueryElevationComponentTest-1343404332646/shard1/data/index' doesn't exist. Creating new index...
[junit4:junit4]   2> 632 T1522 oasc.SolrDeletionPolicy.onCommit SolrDeletionPolicy.onCommit: commits:num=1
[junit4:junit4]   2> 		commit{dir=MockDirWrapper(org.apache.lucene.store.RAMDirectory@2f13d0ba lockFactory=org.apache.lucene.store.SingleInstanceLockFactory@709ee7ff),segFN=segments_1,generation=1,filenames=[segments_1]
[junit4:junit4]   2> 632 T1522 oasc.SolrDeletionPolicy.updateCommits newest commit = 1
[junit4:junit4]   2> 633 T1522 oasc.RequestHandlers.initHandlersFromConfig created /update: solr.UpdateRequestHandler
[junit4:junit4]   2> 633 T1522 oasc.RequestHandlers.initHandlersFromConfig created /elevate: org.apache.solr.handler.component.SearchHandler
[junit4:junit4]   2> 634 T1522 oasc.RequestHandlers.initHandlersFromConfig created /dataElevate: org.apache.solr.handler.component.SearchHandler
[junit4:junit4]   2> 634 T1522 oashl.XMLLoader.init xsltCacheLifetimeSeconds=60
[junit4:junit4]   2> 635 T1522 oasc.RequestHandlers.initHandlersFromConfig WARNING no default request handler is registered (either '/select' or 'standard')
[junit4:junit4]   2> 636 T1522 oasc.SolrCore.initDeprecatedSupport WARNING solrconfig.xml uses deprecated <admin/gettableFiles>, Please update your config to use the ShowFileRequestHandler.
[junit4:junit4]   2> 637 T1522 oasc.SolrCore.initDeprecatedSupport WARNING adding ShowFileRequestHandler with hidden files: [BAD-SCHEMA-UNIQUEKEY-USES-DEFAULT.XML, FRENCHARTICLES.TXT, SOLRCONFIG-PROPINJECT-INDEXDEFAULT.XML, STOP-2.TXT, SCHEMA-TRIE.XML, MAPPING-ISOLATIN1ACCENT.TXT, OPEN-EXCHANGE-RATES.JSON, SOLRCONFIG-NATIVELOCK.XML, HUNSPELL-TEST.AFF, BAD-SCHEMA-UNIQUEKEY-IS-COPYFIELD-DEST.XML, SOLRCONFIG-REQHANDLER.INCL, SCHEMA-MINIMAL.XML, SOLRCONFIG-SIMPLELOCK.XML, STOPWORDSWRONGENCODING.TXT, SCHEMA-SIM.XML, TRIVIAL.UPDATEPROCESSOR0.JS, SOLRCONFIG-SOLR-749.XML, SCHEMA-TFIDF.XML, BAD-SCHEMA-DUP-DYNAMICFIELD.XML, SCHEMA-COLLATE.XML, KEEP-1.TXT, SCHEMA-REPLICATION2.XML, BAD-SOLRCONFIG-BOGUS-SCRIPTENGINE-NAME.XML, STOP-SNOWBALL.TXT, SOLRCONFIG-SLAVE1.XML, OLD_SYNONYMS.TXT, SCHEMA-FOLDING.XML, COMPOUNDDICTIONARY.TXT, MISSLEADING.EXTENSION.UPDATEPROCESSOR.JS.TXT, SCHEMA-LUCENEMATCHVERSION.XML, THROW.ERROR.ON.ADD.UPDATEPROCESSOR.JS, STOPWORDS.TXT, SOLRCONFIG-MASTER3.XML, SOLRCONFIG-ELEVATE.XML, SOLRCONFIG-NOCACHE.XML, STEMDICT.TXT, ADDFIELDS.UPDATEPROCESSOR.JS, SOLRCONFIG-SLAVE.XML, STOPWITHBOM.TXT, SCHEMA-DFR.XML, SCHEMA12.XML, WDFTYPES.TXT, DA_UTF8.XML, BAD-SCHEMA-DUP-FIELDTYPE.XML, SCHEMA-IB.XML, KEEP-2.TXT, SOLRCONFIG-UPDATE-PROCESSOR-CHAINS.XML, SCHEMA-LMDIRICHLET.XML, SOLRCONFIG-TRANSFORMERS.XML, TRIVIAL.UPDATEPROCESSOR1.JS, SOLRCONFIG-HIGHLIGHT.XML, SOLRCONFIG-MASTER.XML, BAD_SOLRCONFIG.XML, SOLRCONFIG_PERF.XML, BAD-SCHEMA-NOT-INDEXED-BUT-TF.XML, ELEVATE.XML, DA_COMPOUNDDICTIONARY.TXT, HUNSPELL-TEST.DIC, BAD-SCHEMA-NONTEXT-ANALYZER.XML, SCHEMA-NOT-REQUIRED-UNIQUE-KEY.XML, SOLRCONFIG-LAZYWRITER.XML, HYPHENATION.DTD, BAD-SCHEMA-SIM-GLOBAL-VS-FT-MISMATCH.XML, SCHEMA-REPLICATION1.XML, SOLRCONFIG-DELPOLICY2.XML, BAD-SOLRCONFIG-MISSING-SCRIPTFILE.XML, BAD-MP-SOLRCONFIG.XML, BAD-SCHEMA-NOT-INDEXED-BUT-POS.XML, BAD-SCHEMA-EXTERNAL-FILEFIELD.XML, CONDITIONAL.UPDATEPROCESSOR.JS, SCHEMA.XML, SOLRCONFIG-ENABLEPLUGIN.XML, PHRASESUGGEST.TXT, SOLRCONFIG-REPEATER.XML, SCHEMA-PHRASESUGGEST.XML, SOLRCONFIG-ALTDIRECTORY.XML, SCHEMA-REQUIRED-FIELDS.XML, SOLRCONFIG-MASTER1-KEEPONEBACKUP.XML, SCHEMA-REVERSED.XML, SOLRCONFIG_CODEC.XML, SCHEMA_CODEC.XML, SOLRCONFIG-XINCLUDE.XML, SOLRCONFIG-TLOG.XML, SOLRCONFIG-BASIC.XML, SOLRCONFIG-PHRASESUGGEST.XML, STOPTYPES-1.TXT, SOLRCONFIG-MASTER1.XML, SCHEMA-BINARYFIELD.XML, SCHEMA-CHARFILTERS.XML, BAD-SCHEMA-DUP-FIELD.XML, PROTWORDS.TXT, SOLRCONFIG-PROPINJECT.XML, SCHEMA15.XML, SCHEMA11.XML, SOLRCONFIG-BASIC-LUCENEVERSION31.XML, SOLRCONFIG-TERMINDEX.XML, STOP-1.TXT, MISSING.FUNCTIONS.UPDATEPROCESSOR.JS, SOLRCONFIG-QUERYSENDER.XML, XSLT, SOLRCONFIG-SCRIPT-UPDATEPROCESSOR.XML, SCHEMA-COLLATEFILTER.XML, SOLRCONFIG-MERGEPOLICY.XML, SOLRCONFIG-SOLCOREPROPERTIES.XML, SCHEMA-STOP-KEEP.XML, SYNONYMS.TXT, SOLRCONFIG-CACHING.XML, STOPTYPES-2.TXT, SOLRCONFIG-SPELLCHECKCOMPONENT.XML, SCHEMA-BM25.XML, SCHEMA-LMJELINEKMERCER.XML, BAD-SCHEMA-OMIT-TF-BUT-NOT-POS.XML, CURRENCY.XML, SCHEMASURROUND.XML, SOLRCONFIG-FUNCTIONQUERY.XML, SOLRCONFIG-MASTER2.XML, BAD-SCHEMA-NOT-INDEXED-BUT-NORMS.XML, SCHEMA-NUMERIC.XML, SOLRCONFIG-SPELLCHECKER.XML, SCHEMA-COPYFIELD-TEST.XML, SOLRCONFIG-QUERYSENDER-NOQUERY.XML, SCHEMA-SPELLCHECKER.XML, SOLRCONFIG-DELPOLICY1.XML, BAD-SOLRCONFIG-INVALID-SCRIPTFILE.XML, BAD-SCHEMA-CODEC-GLOBAL-VS-FT-MISMATCH.XML]
[junit4:junit4]   2> 639 T1522 oass.SolrIndexSearcher.<init> Opening Searcher@2e69bc3b main
[junit4:junit4]   2> 639 T1522 oass.SolrIndexSearcher.getIndexDir WARNING WARNING: Directory impl does not support setting indexDir: org.apache.lucene.store.MockDirectoryWrapper
[junit4:junit4]   2> 640 T1522 oasu.CommitTracker.<init> Hard AutoCommit: disabled
[junit4:junit4]   2> 640 T1522 oasu.CommitTracker.<init> Soft AutoCommit: disabled
[junit4:junit4]   2> 640 T1522 oashc.QueryElevationComponent.inform Loading QueryElevation from: /mnt/ssd/jenkins/workspace/Lucene-Solr-4.x-Linux-Java8-64/checkout/solr/build/solr-core/test-files/solr/collection1/conf/elevate.xml
[junit4:junit4]   2> 645 T1522 oashc.QueryElevationComponent.inform Loading QueryElevation from: /mnt/ssd/jenkins/workspace/Lucene-Solr-4.x-Linux-Java8-64/checkout/solr/build/solr-core/test-files/solr/collection1/conf/elevate.xml
[junit4:junit4]   2> 650 T1522 oashc.HttpShardHandlerFactory.getParameter Setting socketTimeout to: 0
[junit4:junit4]   2> 650 T1522 oashc.HttpShardHandlerFactory.getParameter Setting urlScheme to: http://
[junit4:junit4]   2> 650 T1522 oashc.HttpShardHandlerFactory.getParameter Setting connTimeout to: 0
[junit4:junit4]   2> 650 T1522 oashc.HttpShardHandlerFactory.getParameter Setting maxConnectionsPerHost to: 20
[junit4:junit4]   2> 651 T1522 oashc.HttpShardHandlerFactory.getParameter Setting corePoolSize to: 0
[junit4:junit4]   2> 651 T1522 oashc.HttpShardHandlerFactory.getParameter Setting maximumPoolSize to: 2147483647
[junit4:junit4]   2> 651 T1522 oashc.HttpShardHandlerFactory.getParameter Setting maxThreadIdleTime to: 5
[junit4:junit4]   2> 651 T1522 oashc.HttpShardHandlerFactory.getParameter Setting sizeOfQueue to: -1
[junit4:junit4]   2> 651 T1522 oashc.HttpShardHandlerFactory.getParameter Setting fairnessPolicy to: false
[junit4:junit4]   2> 651 T1522 oascsi.HttpClientUtil.createClient Creating new http client, config:maxConnectionsPerHost=20&maxConnections=10000&socketTimeout=0&connTimeout=0&retry=false
[junit4:junit4]   2> 653 T1552 oasc.SolrCore.registerSearcher [collection1] Registered new searcher Searcher@2e69bc3b main{StandardDirectoryReader(segments_1:1)}
[junit4:junit4]   2> 653 T1522 oasc.CoreContainer.register registering core: collection1
[junit4:junit4]   2> 653 T1522 oass.SolrDispatchFilter.init user.dir=/mnt/ssd/jenkins/workspace/Lucene-Solr-4.x-Linux-Java8-64/checkout/solr/build/solr-core/test/J1
[junit4:junit4]   2> 654 T1522 oass.SolrDispatchFilter.init SolrDispatchFilter.init() done
[junit4:junit4]   2> 654 T1522 oascsi.HttpClientUtil.createClient Creating new http client, config:maxConnections=128&maxConnectionsPerHost=32&followRedirects=false
[junit4:junit4]   2> 655 T1522 oejs.Server.doStart jetty-8.1.2.v20120308
[junit4:junit4]   2> 657 T1522 oejs.AbstractConnector.doStart Started SocketConnector@0.0.0.0:49985
[junit4:junit4]   2> 657 T1522 oasc.SolrResourceLoader.locateSolrHome JNDI not configured for solr (NoInitialContextEx)
[junit4:junit4]   2> 658 T1522 oasc.SolrResourceLoader.locateSolrHome using system property solr.solr.home: /mnt/ssd/jenkins/workspace/Lucene-Solr-4.x-Linux-Java8-64/checkout/solr/build/solr-core/test-files/solr
[junit4:junit4]   2> 658 T1522 oasc.SolrResourceLoader.<init> new SolrResourceLoader for deduced Solr Home: '/mnt/ssd/jenkins/workspace/Lucene-Solr-4.x-Linux-Java8-64/checkout/solr/build/solr-core/test-files/solr/'
[junit4:junit4]   2> 663 T1522 oass.SolrDispatchFilter.init SolrDispatchFilter.init()
[junit4:junit4]   2> 663 T1522 oasc.SolrResourceLoader.locateSolrHome JNDI not configured for solr (NoInitialContextEx)
[junit4:junit4]   2> 664 T1522 oasc.SolrResourceLoader.locateSolrHome using system property solr.solr.home: /mnt/ssd/jenkins/workspace/Lucene-Solr-4.x-Linux-Java8-64/checkout/solr/build/solr-core/test-files/solr
[junit4:junit4]   2> 664 T1522 oasc.CoreContainer$Initializer.initialize looking for solr.xml: /mnt/ssd/jenkins/workspace/Lucene-Solr-4.x-Linux-Java8-64/checkout/solr/build/solr-core/test-files/solr/solr.xml
[junit4:junit4]   2> 664 T1522 oasc.CoreContainer.<init> New CoreContainer 1650259921
[junit4:junit4]   2> 664 T1522 oasc.CoreContainer.load Loading CoreContainer using Solr Home: '/mnt/ssd/jenkins/workspace/Lucene-Solr-4.x-Linux-Java8-64/checkout/solr/build/solr-core/test-files/solr/'
[junit4:junit4]   2> 664 T1522 oasc.SolrResourceLoader.<init> new SolrResourceLoader for directory: '/mnt/ssd/jenkins/workspace/Lucene-Solr-4.x-Linux-Java8-64/checkout/solr/build/solr-core/test-files/solr/'
[junit4:junit4]   2> 671 T1522 oasc.CoreContainer.load Registering Log Listener
[junit4:junit4]   2> 679 T1522 oasc.CoreContainer.create Creating SolrCore 'collection1' using instanceDir: /mnt/ssd/jenkins/workspace/Lucene-Solr-4.x-Linux-Java8-64/checkout/solr/build/solr-core/test-files/solr/collection1
[junit4:junit4]   2> 680 T1522 oasc.SolrResourceLoader.<init> new SolrResourceLoader for directory: '/mnt/ssd/jenkins/workspace/Lucene-Solr-4.x-Linux-Java8-64/checkout/solr/build/solr-core/test-files/solr/collection1/'
[junit4:junit4]   2> 680 T1522 oasc.SolrResourceLoader.replaceClassLoader Adding 'file:/mnt/ssd/jenkins/workspace/Lucene-Solr-4.x-Linux-Java8-64/checkout/solr/build/solr-core/test-files/solr/collection1/lib/README' to classloader
[junit4:junit4]   2> 680 T1522 oasc.SolrResourceLoader.replaceClassLoader Adding 'file:/mnt/ssd/jenkins/workspace/Lucene-Solr-4.x-Linux-Java8-64/checkout/solr/build/solr-core/test-files/solr/collection1/lib/classes/' to classloader
[junit4:junit4]   2> 698 T1522 oasc.SolrConfig.<init> Using Lucene MatchVersion: LUCENE_40
[junit4:junit4]   2> 722 T1522 oasc.SolrConfig.<init> Loaded SolrConfig: solrconfig-elevate.xml
[junit4:junit4]   2> 722 T1522 oass.IndexSchema.readSchema Reading Solr Schema
[junit4:junit4]   2> 724 T1522 oass.IndexSchema.readSchema Schema name=example
[junit4:junit4]   2> 840 T1522 oass.IndexSchema.readSchema default search field in schema is text
[junit4:junit4]   2> 842 T1522 oass.IndexSchema.readSchema unique key field: id
[junit4:junit4]   2> 845 T1522 oasc.SolrCore.<init> [collection1] Opening new SolrCore at /mnt/ssd/jenkins/workspace/Lucene-Solr-4.x-Linux-Java8-64/checkout/solr/build/solr-core/test-files/solr/collection1/, dataDir=./org.apache.solr.handler.component.DistributedQueryElevationComponentTest-1343404332646/shard2/data/
[junit4:junit4]   2> 845 T1522 oasc.JmxMonitoredMap.<init> JMX monitoring is enabled. Adding Solr mbeans to JMX Server: com.sun.jmx.mbeanserver.JmxMBeanServer@3018fc1a
[junit4:junit4]   2> 845 T1522 oasc.SolrCore.getNewIndexDir WARNING New index directory detected: old=null new=./org.apache.solr.handler.component.DistributedQueryElevationComponentTest-1343404332646/shard2/data/index/
[junit4:junit4]   2> 846 T1522 oasc.SolrCore.initIndex WARNING [collection1] Solr index directory './org.apache.solr.handler.component.DistributedQueryElevationComponentTest-1343404332646/shard2/data/index' doesn't exist. Creating new index...
[junit4:junit4]   2> 847 T1522 oasc.SolrDeletionPolicy.onCommit SolrDeletionPolicy.onCommit: commits:num=1
[junit4:junit4]   2> 		commit{dir=MockDirWrapper(org.apache.lucene.store.RAMDirectory@521cb373 lockFactory=org.apache.lucene.store.SingleInstanceLockFactory@a9c017d),segFN=segments_1,generation=1,filenames=[segments_1]
[junit4:junit4]   2> 847 T1522 oasc.SolrDeletionPolicy.updateCommits newest commit = 1
[junit4:junit4]   2> 848 T1522 oasc.RequestHandlers.initHandlersFromConfig created /update: solr.UpdateRequestHandler
[junit4:junit4]   2> 849 T1522 oasc.RequestHandlers.initHandlersFromConfig created /elevate: org.apache.solr.handler.component.SearchHandler
[junit4:junit4]   2> 849 T1522 oasc.RequestHandlers.initHandlersFromConfig created /dataElevate: org.apache.solr.handler.component.SearchHandler
[junit4:junit4]   2> 849 T1522 oashl.XMLLoader.init xsltCacheLifetimeSeconds=60
[junit4:junit4]   2> 849 T1522 oasc.RequestHandlers.initHandlersFromConfig WARNING no default request handler is registered (either '/select' or 'standard')
[junit4:junit4]   2> 850 T1522 oasc.SolrCore.initDeprecatedSupport WARNING solrconfig.xml uses deprecated <admin/gettableFiles>, Please update your config to use the ShowFileRequestHandler.
[junit4:junit4]   2> 851 T1522 oasc.SolrCore.initDeprecatedSupport WARNING adding ShowFileRequestHandler with hidden files: [BAD-SCHEMA-UNIQUEKEY-USES-DEFAULT.XML, FRENCHARTICLES.TXT, SOLRCONFIG-PROPINJECT-INDEXDEFAULT.XML, STOP-2.TXT, SCHEMA-TRIE.XML, MAPPING-ISOLATIN1ACCENT.TXT, OPEN-EXCHANGE-RATES.JSON, SOLRCONFIG-NATIVELOCK.XML, HUNSPELL-TEST.AFF, BAD-SCHEMA-UNIQUEKEY-IS-COPYFIELD-DEST.XML, SOLRCONFIG-REQHANDLER.INCL, SCHEMA-MINIMAL.XML, SOLRCONFIG-SIMPLELOCK.XML, STOPWORDSWRONGENCODING.TXT, SCHEMA-SIM.XML, TRIVIAL.UPDATEPROCESSOR0.JS, SOLRCONFIG-SOLR-749.XML, SCHEMA-TFIDF.XML, BAD-SCHEMA-DUP-DYNAMICFIELD.XML, SCHEMA-COLLATE.XML, KEEP-1.TXT, SCHEMA-REPLICATION2.XML, BAD-SOLRCONFIG-BOGUS-SCRIPTENGINE-NAME.XML, STOP-SNOWBALL.TXT, SOLRCONFIG-SLAVE1.XML, OLD_SYNONYMS.TXT, SCHEMA-FOLDING.XML, COMPOUNDDICTIONARY.TXT, MISSLEADING.EXTENSION.UPDATEPROCESSOR.JS.TXT, SCHEMA-LUCENEMATCHVERSION.XML, THROW.ERROR.ON.ADD.UPDATEPROCESSOR.JS, STOPWORDS.TXT, SOLRCONFIG-MASTER3.XML, SOLRCONFIG-ELEVATE.XML, SOLRCONFIG-NOCACHE.XML, STEMDICT.TXT, ADDFIELDS.UPDATEPROCESSOR.JS, SOLRCONFIG-SLAVE.XML, STOPWITHBOM.TXT, SCHEMA-DFR.XML, SCHEMA12.XML, WDFTYPES.TXT, DA_UTF8.XML, BAD-SCHEMA-DUP-FIELDTYPE.XML, SCHEMA-IB.XML, KEEP-2.TXT, SOLRCONFIG-UPDATE-PROCESSOR-CHAINS.XML, SCHEMA-LMDIRICHLET.XML, SOLRCONFIG-TRANSFORMERS.XML, TRIVIAL.UPDATEPROCESSOR1.JS, SOLRCONFIG-HIGHLIGHT.XML, SOLRCONFIG-MASTER.XML, BAD_SOLRCONFIG.XML, SOLRCONFIG_PERF.XML, BAD-SCHEMA-NOT-INDEXED-BUT-TF.XML, ELEVATE.XML, DA_COMPOUNDDICTIONARY.TXT, HUNSPELL-TEST.DIC, BAD-SCHEMA-NONTEXT-ANALYZER.XML, SCHEMA-NOT-REQUIRED-UNIQUE-KEY.XML, SOLRCONFIG-LAZYWRITER.XML, HYPHENATION.DTD, BAD-SCHEMA-SIM-GLOBAL-VS-FT-MISMATCH.XML, SCHEMA-REPLICATION1.XML, SOLRCONFIG-DELPOLICY2.XML, BAD-SOLRCONFIG-MISSING-SCRIPTFILE.XML, BAD-MP-SOLRCONFIG.XML, BAD-SCHEMA-NOT-INDEXED-BUT-POS.XML, BAD-SCHEMA-EXTERNAL-FILEFIELD.XML, CONDITIONAL.UPDATEPROCESSOR.JS, SCHEMA.XML, SOLRCONFIG-ENABLEPLUGIN.XML, PHRASESUGGEST.TXT, SOLRCONFIG-REPEATER.XML, SCHEMA-PHRASESUGGEST.XML, SOLRCONFIG-ALTDIRECTORY.XML, SCHEMA-REQUIRED-FIELDS.XML, SOLRCONFIG-MASTER1-KEEPONEBACKUP.XML, SCHEMA-REVERSED.XML, SOLRCONFIG_CODEC.XML, SCHEMA_CODEC.XML, SOLRCONFIG-XINCLUDE.XML, SOLRCONFIG-TLOG.XML, SOLRCONFIG-BASIC.XML, SOLRCONFIG-PHRASESUGGEST.XML, STOPTYPES-1.TXT, SOLRCONFIG-MASTER1.XML, SCHEMA-BINARYFIELD.XML, SCHEMA-CHARFILTERS.XML, BAD-SCHEMA-DUP-FIELD.XML, PROTWORDS.TXT, SOLRCONFIG-PROPINJECT.XML, SCHEMA15.XML, SCHEMA11.XML, SOLRCONFIG-BASIC-LUCENEVERSION31.XML, SOLRCONFIG-TERMINDEX.XML, STOP-1.TXT, MISSING.FUNCTIONS.UPDATEPROCESSOR.JS, SOLRCONFIG-QUERYSENDER.XML, XSLT, SOLRCONFIG-SCRIPT-UPDATEPROCESSOR.XML, SCHEMA-COLLATEFILTER.XML, SOLRCONFIG-MERGEPOLICY.XML, SOLRCONFIG-SOLCOREPROPERTIES.XML, SCHEMA-STOP-KEEP.XML, SYNONYMS.TXT, SOLRCONFIG-CACHING.XML, STOPTYPES-2.TXT, SOLRCONFIG-SPELLCHECKCOMPONENT.XML, SCHEMA-BM25.XML, SCHEMA-LMJELINEKMERCER.XML, BAD-SCHEMA-OMIT-TF-BUT-NOT-POS.XML, CURRENCY.XML, SCHEMASURROUND.XML, SOLRCONFIG-FUNCTIONQUERY.XML, SOLRCONFIG-MASTER2.XML, BAD-SCHEMA-NOT-INDEXED-BUT-NORMS.XML, SCHEMA-NUMERIC.XML, SOLRCONFIG-SPELLCHECKER.XML, SCHEMA-COPYFIELD-TEST.XML, SOLRCONFIG-QUERYSENDER-NOQUERY.XML, SCHEMA-SPELLCHECKER.XML, SOLRCONFIG-DELPOLICY1.XML, BAD-SOLRCONFIG-INVALID-SCRIPTFILE.XML, BAD-SCHEMA-CODEC-GLOBAL-VS-FT-MISMATCH.XML]
[junit4:junit4]   2> 853 T1522 oass.SolrIndexSearcher.<init> Opening Searcher@4adcc224 main
[junit4:junit4]   2> 853 T1522 oass.SolrIndexSearcher.getIndexDir WARNING WARNING: Directory impl does not support setting indexDir: org.apache.lucene.store.MockDirectoryWrapper
[junit4:junit4]   2> 853 T1522 oasu.CommitTracker.<init> Hard AutoCommit: disabled
[junit4:junit4]   2> 854 T1522 oasu.CommitTracker.<init> Soft AutoCommit: disabled
[junit4:junit4]   2> 854 T1522 oashc.QueryElevationComponent.inform Loading QueryElevation from: /mnt/ssd/jenkins/workspace/Lucene-Solr-4.x-Linux-Java8-64/checkout/solr/build/solr-core/test-files/solr/collection1/conf/elevate.xml
[junit4:junit4]   2> 861 T1522 oashc.QueryElevationComponent.inform Loading QueryElevation from: /mnt/ssd/jenkins/workspace/Lucene-Solr-4.x-Linux-Java8-64/checkout/solr/build/solr-core/test-files/solr/collection1/conf/elevate.xml
[junit4:junit4]   2> 869 T1522 oashc.HttpShardHandlerFactory.getParameter Setting socketTimeout to: 0
[junit4:junit4]   2> 869 T1522 oashc.HttpShardHandlerFactory.getParameter Setting urlScheme to: http://
[junit4:junit4]   2> 869 T1522 oashc.HttpShardHandlerFactory.getParameter Setting connTimeout to: 0
[junit4:junit4]   2> 870 T1522 oashc.HttpShardHandlerFactory.getParameter Setting maxConnectionsPerHost to: 20
[junit4:junit4]   2> 870 T1522 oashc.HttpShardHandlerFactory.getParameter Setting corePoolSize to: 0
[junit4:junit4]   2> 870 T1522 oashc.HttpShardHandlerFactory.getParameter Setting maximumPoolSize to: 2147483647
[junit4:junit4]   2> 870 T1522 oashc.HttpShardHandlerFactory.getParameter Setting maxThreadIdleTime to: 5
[junit4:junit4]   2> 871 T1522 oashc.HttpShardHandlerFactory.getParameter Setting sizeOfQueue to: -1
[junit4:junit4]   2> 871 T1522 oashc.HttpShardHandlerFactory.getParameter Setting fairnessPolicy to: false
[junit4:junit4]   2> 871 T1522 oascsi.HttpClientUtil.createClient Creating new http client, config:maxConnectionsPerHost=20&maxConnections=10000&socketTimeout=0&connTimeout=0&retry=false
[junit4:junit4]   2> 874 T1522 oasc.CoreContainer.register registering core: collection1
[junit4:junit4]   2> 874 T1522 oass.SolrDispatchFilter.init user.dir=/mnt/ssd/jenkins/workspace/Lucene-Solr-4.x-Linux-Java8-64/checkout/solr/build/solr-core/test/J1
[junit4:junit4]   2> 874 T1562 oasc.SolrCore.registerSearcher [collection1] Registered new searcher Searcher@4adcc224 main{StandardDirectoryReader(segments_1:1)}
[junit4:junit4]   2> 874 T1522 oass.SolrDispatchFilter.init SolrDispatchFilter.init() done
[junit4:junit4]   2> 875 T1522 oascsi.HttpClientUtil.createClient Creating new http client, config:maxConnections=128&maxConnectionsPerHost=32&followRedirects=false
[junit4:junit4]   2> ASYNC  NEW_CORE C51 name=collection1 org.apache.solr.core.SolrCore@f6caa25
[junit4:junit4]   2> 881 T1525 C51 oasu.DirectUpdateHandler2.deleteAll [collection1] REMOVING ALL DOCUMENTS FROM INDEX
[junit4:junit4]   2> 883 T1525 C51 oasc.SolrDeletionPolicy.onInit SolrDeletionPolicy.onInit: commits:num=1
[junit4:junit4]   2> 		commit{dir=MockDirWrapper(NRTCachingDirectory(org.apache.lucene.store.RAMDirectory@27166b0c lockFactory=org.apache.lucene.store.SingleInstanceLockFactory@701b91e3; maxCacheMB=0.4775390625 maxMergeSizeMB=0.7392578125)),segFN=segments_1,generation=1,filenames=[segments_1]
[junit4:junit4]   2> 883 T1525 C51 oasc.SolrDeletionPolicy.updateCommits newest commit = 1
[junit4:junit4]   2> 884 T1525 C51 UPDATE [collection1] webapp=/solr path=/update params={wt=javabin&version=2} {deleteByQuery=*:*} 0 3
[junit4:junit4]   2> ASYNC  NEW_CORE C52 name=collection1 org.apache.solr.core.SolrCore@45f9f3da
[junit4:junit4]   2> 888 T1535 C52 oasu.DirectUpdateHandler2.deleteAll [collection1] REMOVING ALL DOCUMENTS FROM INDEX
[junit4:junit4]   2> 889 T1535 C52 oasc.SolrDeletionPolicy.onInit SolrDeletionPolicy.onInit: commits:num=1
[junit4:junit4]   2> 		commit{dir=MockDirWrapper(org.apache.lucene.store.RAMDirectory@1cf8911a lockFactory=org.apache.lucene.store.SingleInstanceLockFactory@66c0c87),segFN=segments_1,generation=1,filenames=[segments_1]
[junit4:junit4]   2> 889 T1535 C52 oasc.SolrDeletionPolicy.updateCommits newest commit = 1
[junit4:junit4]   2> 890 T1535 C52 UPDATE [collection1] webapp=/solr path=/update params={wt=javabin&version=2} {deleteByQuery=*:*} 0 2
[junit4:junit4]   2> ASYNC  NEW_CORE C53 name=collection1 org.apache.solr.core.SolrCore@55378173
[junit4:junit4]   2> 893 T1545 C53 oasu.DirectUpdateHandler2.deleteAll [collection1] REMOVING ALL DOCUMENTS FROM INDEX
[junit4:junit4]   2> 894 T1545 C53 oasc.SolrDeletionPolicy.onInit SolrDeletionPolicy.onInit: commits:num=1
[junit4:junit4]   2> 		commit{dir=MockDirWrapper(org.apache.lucene.store.RAMDirectory@2f13d0ba lockFactory=org.apache.lucene.store.SingleInstanceLockFactory@709ee7ff),segFN=segments_1,generation=1,filenames=[segments_1]
[junit4:junit4]   2> 894 T1545 C53 oasc.SolrDeletionPolicy.updateCommits newest commit = 1
[junit4:junit4]   2> 894 T1545 C53 UPDATE [collection1] webapp=/solr path=/update params={wt=javabin&version=2} {deleteByQuery=*:*} 0 2
[junit4:junit4]   2> ASYNC  NEW_CORE C54 name=collection1 org.apache.solr.core.SolrCore@4b93c3d0
[junit4:junit4]   2> 898 T1555 C54 oasu.DirectUpdateHandler2.deleteAll [collection1] REMOVING ALL DOCUMENTS FROM INDEX
[junit4:junit4]   2> 899 T1555 C54 oasc.SolrDeletionPolicy.onInit SolrDeletionPolicy.onInit: commits:num=1
[junit4:junit4]   2> 		commit{dir=MockDirWrapper(org.apache.lucene.store.RAMDirectory@521cb373 lockFactory=org.apache.lucene.store.SingleInstanceLockFactory@a9c017d),segFN=segments_1,generation=1,filenames=[segments_1]
[junit4:junit4]   2> 900 T1555 C54 oasc.SolrDeletionPolicy.updateCommits newest commit = 1
[junit4:junit4]   2> 901 T1555 C54 UPDATE [collection1] webapp=/solr path=/update params={wt=javabin&version=2} {deleteByQuery=*:*} 0 3
[junit4:junit4]   2> 903 T1525 C51 UPDATE [collection1] webapp=/solr path=/update params={wt=javabin&version=2} {add=[1]} 0 0
[junit4:junit4]   2> 906 T1535 C52 UPDATE [collection1] webapp=/solr path=/update params={wt=javabin&version=2} {add=[1]} 0 1
[junit4:junit4]   2> 908 T1525 C51 UPDATE [collection1] webapp=/solr path=/update params={wt=javabin&version=2} {add=[2]} 0 1
[junit4:junit4]   2> 910 T1545 C53 UPDATE [collection1] webapp=/solr path=/update params={wt=javabin&version=2} {add=[2]} 0 1
[junit4:junit4]   2> 912 T1525 C51 UPDATE [collection1] webapp=/solr path=/update params={wt=javabin&version=2} {add=[3]} 0 1
[junit4:junit4]   2> 913 T1555 C54 UPDATE [collection1] webapp=/solr path=/update params={wt=javabin&version=2} {add=[3]} 0 0
[junit4:junit4]   2> 915 T1525 C51 UPDATE [collection1] webapp=/solr path=/update params={wt=javabin&version=2} {add=[4]} 0 0
[junit4:junit4]   2> 917 T1535 C52 UPDATE [collection1] webapp=/solr path=/update params={wt=javabin&version=2} {add=[4]} 0 0
[junit4:junit4]   2> 919 T1525 C51 UPDATE [collection1] webapp=/solr path=/update params={wt=javabin&version=2} {add=[5]} 0 0
[junit4:junit4]   2> 920 T1545 C53 UPDATE [collection1] webapp=/solr path=/update params={wt=javabin&version=2} {add=[5]} 0 0
[junit4:junit4]   2> 922 T1525 C51 UPDATE [collection1] webapp=/solr path=/update params={wt=javabin&version=2} {add=[6]} 0 0
[junit4:junit4]   2> 924 T1555 C54 UPDATE [collection1] webapp=/solr path=/update params={wt=javabin&version=2} {add=[6]} 0 0
[junit4:junit4]   2> 926 T1525 C51 UPDATE [collection1] webapp=/solr path=/update params={wt=javabin&version=2} {add=[7]} 0 0
[junit4:junit4]   2> 928 T1555 C54 UPDATE [collection1] webapp=/solr path=/update params={wt=javabin&version=2} {add=[7]} 0 1
[junit4:junit4]   2> 929 T1525 C51 oasu.DirectUpdateHandler2.commit start commit{flags=0,_version_=0,optimize=false,openSearcher=true,waitSearcher=true,expungeDeletes=false,softCommit=false}
[junit4:junit4]   2> 931 T1525 C51 oasc.SolrDeletionPolicy.onCommit SolrDeletionPolicy.onCommit: commits:num=2
[junit4:junit4]   2> 		commit{dir=MockDirWrapper(NRTCachingDirectory(org.apache.lucene.store.RAMDirectory@27166b0c lockFactory=org.apache.lucene.store.SingleInstanceLockFactory@701b91e3; maxCacheMB=0.4775390625 maxMergeSizeMB=0.7392578125)),segFN=segments_1,generation=1,filenames=[segments_1]
[junit4:junit4]   2> 		commit{dir=MockDirWrapper(NRTCachingDirectory(org.apache.lucene.store.RAMDirectory@27166b0c lockFactory=org.apache.lucene.store.SingleInstanceLockFactory@701b91e3; maxCacheMB=0.4775390625 maxMergeSizeMB=0.7392578125)),segFN=segments_2,generation=2,filenames=[_0.fnm, _0.si, segments_2, _0_Lucene40WithOrds_0.tii, _0.fdt, _0_nrm.cfs, _0_Lucene40_0.tim, _0_Lucene40_0.tip, _0.fdx, _0_Lucene40WithOrds_0.frq, _0_nrm.cfe, _0_Lucene40WithOrds_0.prx, _0_Lucene40_0.frq, _0_Lucene40_0.prx, _0_Lucene40WithOrds_0.tib]
[junit4:junit4]   2> 931 T1525 C51 oasc.SolrDeletionPolicy.updateCommits newest commit = 2
[junit4:junit4]   2> 932 T1525 C51 oass.SolrIndexSearcher.<init> Opening Searcher@516eed6b main
[junit4:junit4]   2> 932 T1525 C51 oass.SolrIndexSearcher.getIndexDir WARNING WARNING: Directory impl does not support setting indexDir: org.apache.lucene.store.MockDirectoryWrapper
[junit4:junit4]   2> 933 T1525 C51 oasu.DirectUpdateHandler2.commit end_commit_flush
[junit4:junit4]   2> 933 T1532 oasc.SolrCore.registerSearcher [collection1] Registered new searcher Searcher@516eed6b main{StandardDirectoryReader(segments_2:4 _0(4.0.0.1):C7)}
[junit4:junit4]   2> 933 T1525 C51 UPDATE [collection1] webapp=/solr path=/update params={wt=javabin&version=2&commit=true&waitSearcher=true&softCommit=false} {commit=} 0 4
[junit4:junit4]   2> 935 T1535 C52 oasu.DirectUpdateHandler2.commit start commit{flags=0,_version_=0,optimize=false,openSearcher=true,waitSearcher=true,expungeDeletes=false,softCommit=false}
[junit4:junit4]   2> 937 T1535 C52 oasc.SolrDeletionPolicy.onCommit SolrDeletionPolicy.onCommit: commits:num=2
[junit4:junit4]   2> 		commit{dir=MockDirWrapper(org.apache.lucene.store.RAMDirectory@1cf8911a lockFactory=org.apache.lucene.store.SingleInstanceLockFactory@66c0c87),segFN=segments_1,generation=1,filenames=[segments_1]
[junit4:junit4]   2> 		commit{dir=MockDirWrapper(org.apache.lucene.store.RAMDirectory@1cf8911a lockFactory=org.apache.lucene.store.SingleInstanceLockFactory@66c0c87),segFN=segments_2,generation=2,filenames=[_0.fnm, _0.si, segments_2, _0_Lucene40WithOrds_0.tii, _0.fdt, _0_nrm.cfs, _0_Lucene40_0.tim, _0_Lucene40_0.tip, _0.fdx, _0_Lucene40WithOrds_0.frq, _0_nrm.cfe, _0_Lucene40WithOrds_0.prx, _0_Lucene40_0.frq, _0_Lucene40_0.prx, _0_Lucene40WithOrds_0.tib]
[junit4:junit4]   2> 937 T1535 C52 oasc.SolrDeletionPolicy.updateCommits newest commit = 2
[junit4:junit4]   2> 938 T1535 C52 oass.SolrIndexSearcher.<init> Opening Searcher@5c11280b main
[junit4:junit4]   2> 938 T1535 C52 oass.SolrIndexSearcher.getIndexDir WARNING WARNING: Directory impl does not support setting indexDir: org.apache.lucene.store.MockDirectoryWrapper
[junit4:junit4]   2> 938 T1535 C52 oasu.DirectUpdateHandler2.commit end_commit_flush
[junit4:junit4]   2> 938 T1542 oasc.SolrCore.registerSearcher [collection1] Registered new searcher Searcher@5c11280b main{StandardDirectoryReader(segments_2:4 _0(4.0.0.1):C2)}
[junit4:junit4]   2> 939 T1535 C52 UPDATE [collection1] webapp=/solr path=/update params={wt=javabin&version=2&commit=true&waitSearcher=true&softCommit=false} {commit=} 0 4
[junit4:junit4]   2> 941 T1545 C53 oasu.DirectUpdateHandler2.commit start commit{flags=0,_version_=0,optimize=false,openSearcher=true,waitSearcher=true,expungeDeletes=false,softCommit=false}
[junit4:junit4]   2> 942 T1545 C53 oasc.SolrDeletionPolicy.onCommit SolrDeletionPolicy.onCommit: commits:num=2
[junit4:junit4]   2> 		commit{dir=MockDirWrapper(org.apache.lucene.store.RAMDirectory@2f13d0ba lockFactory=org.apache.lucene.store.SingleInstanceLockFactory@709ee7ff),segFN=segments_1,generation=1,filenames=[segments_1]
[junit4:junit4]   2> 		commit{dir=MockDirWrapper(org.apache.lucene.store.RAMDirectory@2f13d0ba lockFactory=org.apache.lucene.store.SingleInstanceLockFactory@709ee7ff),segFN=segments_2,generation=2,filenames=[_0.fnm, _0.si, segments_2, _0_Lucene40WithOrds_0.tii, _0.fdt, _0_nrm.cfs, _0_Lucene40_0.tim, _0_Lucene40_0.tip, _0.fdx, _0_Lucene40WithOrds_0.frq, _0_nrm.cfe, _0_Lucene40WithOrds_0.prx, _0_Lucene40_0.frq, _0_Lucene40_0.prx, _0_Lucene40WithOrds_0.tib]
[junit4:junit4]   2> 942 T1545 C53 oasc.SolrDeletionPolicy.updateCommits newest commit = 2
[junit4:junit4]   2> 943 T1545 C53 oass.SolrIndexSearcher.<init> Opening Searcher@509f9e50 main
[junit4:junit4]   2> 943 T1545 C53 oass.SolrIndexSearcher.getIndexDir WARNING WARNING: Directory impl does not support setting indexDir: org.apache.lucene.store.MockDirectoryWrapper
[junit4:junit4]   2> 943 T1545 C53 oasu.DirectUpdateHandler2.commit end_commit_flush
[junit4:junit4]   2> 943 T1552 oasc.SolrCore.registerSearcher [collection1] Registered new searcher Searcher@509f9e50 main{StandardDirectoryReader(segments_2:4 _0(4.0.0.1):C2)}
[junit4:junit4]   2> 944 T1545 C53 UPDATE [collection1] webapp=/solr path=/update params={wt=javabin&version=2&commit=true&waitSearcher=true&softCommit=false} {commit=} 0 3
[junit4:junit4]   2> 946 T1555 C54 oasu.DirectUpdateHandler2.commit start commit{flags=0,_version_=0,optimize=false,openSearcher=true,waitSearcher=true,expungeDeletes=false,softCommit=false}
[junit4:junit4]   2> 948 T1555 C54 oasc.SolrDeletionPolicy.onCommit SolrDeletionPolicy.onCommit: commits:num=2
[junit4:junit4]   2> 		commit{dir=MockDirWrapper(org.apache.lucene.store.RAMDirectory@521cb373 lockFactory=org.apache.lucene.store.SingleInstanceLockFactory@a9c017d),segFN=segments_1,generation=1,filenames=[segments_1]
[junit4:junit4]   2> 		commit{dir=MockDirWrapper(org.apache.lucene.store.RAMDirectory@521cb373 lockFactory=org.apache.lucene.store.SingleInstanceLockFactory@a9c017d),segFN=segments_2,generation=2,filenames=[_0.fnm, _0.si, segments_2, _0_Lucene40WithOrds_0.tii, _0.fdt, _0_nrm.cfs, _0_Lucene40_0.tim, _0_Lucene40_0.tip, _0.fdx, _0_Lucene40WithOrds_0.frq, _0_nrm.cfe, _0_Lucene40WithOrds_0.prx, _0_Lucene40_0.frq, _0_Lucene40_0.prx, _0_Lucene40WithOrds_0.tib]
[junit4:junit4]   2> 948 T1555 C54 oasc.SolrDeletionPolicy.updateCommits newest commit = 2
[junit4:junit4]   2> 949 T1555 C54 oass.SolrIndexSearcher.<init> Opening Searcher@4889ed6 main
[junit4:junit4]   2> 949 T1555 C54 oass.SolrIndexSearcher.getIndexDir WARNING WARNING: Directory impl does not support setting indexDir: org.apache.lucene.store.MockDirectoryWrapper
[junit4:junit4]   2> 949 T1555 C54 oasu.DirectUpdateHandler2.commit end_commit_flush
[junit4:junit4]   2> 950 T1562 oasc.SolrCore.registerSearcher [collection1] Registered new searcher Searcher@4889ed6 main{StandardDirectoryReader(segments_2:4 _0(4.0.0.1):C3)}
[junit4:junit4]   2> 950 T1555 C54 UPDATE [collection1] webapp=/solr path=/update params={wt=javabin&version=2&commit=true&waitSearcher=true&softCommit=false} {commit=} 0 4
[junit4:junit4]   2> 956 T1525 C51 REQ [collection1] webapp=/solr path=/elevate params={sort=id+desc&shards.qt=/elevate&distrib=false&fl=id,+score,+[elevated]&q=*:*&rows=500&wt=javabin&qt=/elevate&version=2} hits=7 status=0 QTime=4 
[junit4:junit4]   2> 974 T1546 C53 REQ [collection1] webapp=/solr path=/elevate params={NOW=1343404333603&fsv=true&distrib=false&shards.qt=/elevate&fl=id,score&q=*:*&start=0&isShard=true&sort=id+desc&shard.url=localhost:54061/solr&rows=500&wt=javabin&qt=/elevate&version=2} hits=2 status=0 QTime=1 
[junit4:junit4]   2> 974 T1536 C52 REQ [collection1] webapp=/solr path=/elevate params={NOW=1343404333603&fsv=true&distrib=false&shards.qt=/elevate&fl=id,score&q=*:*&start=0&isShard=true&sort=id+desc&shard.url=localhost:40966/solr&rows=500&wt=javabin&qt=/elevate&version=2} hits=2 status=0 QTime=0 
[junit4:junit4]   2> 975 T1556 C54 REQ [collection1] webapp=/solr path=/elevate params={NOW=1343404333603&fsv=true&distrib=false&shards.qt=/elevate&fl=id,score&q=*:*&start=0&isShard=true&sort=id+desc&shard.url=[::1]:33332/solr|localhost:49985/solr&rows=500&wt=javabin&qt=/elevate&version=2} hits=3 status=0 QTime=1 
[junit4:junit4]   2> 977 T1546 C53 REQ [collection1] webapp=/solr path=/elevate params={NOW=1343404333603&shards.qt=/elevate&distrib=false&fl=id,+score,+[elevated]&q=*:*&isShard=true&shard.url=localhost:54061/solr&ids=5.0,2.0&rows=500&wt=javabin&qt=/elevate&version=2} status=0 QTime=0 
[junit4:junit4]   2> 977 T1556 C54 REQ [collection1] webapp=/solr path=/elevate params={NOW=1343404333603&shards.qt=/elevate&distrib=false&fl=id,+score,+[elevated]&q=*:*&isShard=true&shard.url=[::1]:33332/solr|localhost:49985/solr&ids=7.0,3.0,6.0&rows=500&wt=javabin&qt=/elevate&version=2} status=0 QTime=0 
[junit4:junit4]   2> 978 T1536 C52 REQ [collection1] webapp=/solr path=/elevate params={NOW=1343404333603&shards.qt=/elevate&distrib=false&fl=id,+score,+[elevated]&q=*:*&isShard=true&shard.url=localhost:40966/solr&ids=4.0,1.0&rows=500&wt=javabin&qt=/elevate&version=2} status=0 QTime=0 
[junit4:junit4]   2> 978 T1555 C54 REQ [collection1] webapp=/solr path=/elevate params={sort=id+desc&shards.qt=/elevate&fl=id,+score,+[elevated]&q=*:*&rows=500&wt=javabin&qt=/elevate&version=2&shards=localhost:40966/solr,localhost:54061/solr,[::1]:33332/solr|localhost:49985/solr} status=0 QTime=19 
[junit4:junit4]   2> 979 T1522 oas.BaseDistributedSearchTestCase.compareResponses SEVERE Mismatched responses:
[junit4:junit4]   2> 	{responseHeader={status=0,QTime=19,params={sort=id desc,shards.qt=/elevate,fl=id, score, [elevated],q=*:*,rows=500,wt=javabin,qt=/elevate,version=2,shards=localhost:40966/solr,localhost:54061/solr,[::1]:33332/solr|localhost:49985/solr}},response={numFound=7,start=0,maxScore=1.0,docs=[SolrDocument{id=7.0, [elevated]=false, score=1.0}, SolrDocument{id=6.0, [elevated]=false, score=1.0}, SolrDocument{id=5.0, [elevated]=false, score=1.0}, SolrDocument{id=4.0, [elevated]=false, score=1.0}, SolrDocument{id=3.0, [elevated]=false, score=1.0}, SolrDocument{id=2.0, [elevated]=false, score=1.0}, SolrDocument{id=1.0, [elevated]=false, score=1.0}]}}
[junit4:junit4]   2> 	{responseHeader={status=0,QTime=4,params={sort=id desc,shards.qt=/elevate,distrib=false,fl=id, score, [elevated],q=*:*,rows=500,wt=javabin,qt=/elevate,version=2}},response={numFound=7,start=0,maxScore=1.0,docs=[SolrDocument{id=7.0, score=1.0, [elevated]=false}, SolrDocument{id=6.0, score=1.0, [elevated]=false}, SolrDocument{id=5.0, score=1.0, [elevated]=false}, SolrDocument{id=4.0, score=1.0, [elevated]=false}, SolrDocument{id=3.0, score=1.0, [elevated]=false}, SolrDocument{id=2.0, score=1.0, [elevated]=false}, SolrDocument{id=1.0, score=1.0, [elevated]=false}]}}
[junit4:junit4]   2> 980 T1522 oasc.CoreContainer.shutdown Shutting down CoreContainer instance=1397283846
[junit4:junit4]   2> 980 T1522 oasc.SolrCore.close [collection1]  CLOSING SolrCore org.apache.solr.core.SolrCore@f6caa25
[junit4:junit4]   2> 983 T1522 oasc.SolrCore.closeSearcher [collection1] Closing main searcher on request.
[junit4:junit4]   2> 983 T1522 oasu.DirectUpdateHandler2.close closing DirectUpdateHandler2{commits=1,autocommits=0,soft autocommits=0,optimizes=0,rollbacks=0,expungeDeletes=0,docsPending=0,adds=0,deletesById=0,deletesByQuery=0,errors=0,cumulative_adds=7,cumulative_deletesById=0,cumulative_deletesByQuery=1,cumulative_errors=0}
[junit4:junit4]   2> 987 T1522 oejsh.ContextHandler.doStop stopped o.e.j.s.ServletContextHandler{/solr,null}
[junit4:junit4]   2> 1039 T1522 oasc.CoreContainer.shutdown Shutting down CoreContainer instance=2052412387
[junit4:junit4]   2> 1039 T1522 oasc.SolrCore.close [collection1]  CLOSING SolrCore org.apache.solr.core.SolrCore@45f9f3da
[junit4:junit4]   2> 1040 T1522 oasc.SolrCore.closeSearcher [collection1] Closing main searcher on request.
[junit4:junit4]   2> 1040 T1522 oasu.DirectUpdateHandler2.close closing DirectUpdateHandler2{commits=1,autocommits=0,soft autocommits=0,optimizes=0,rollbacks=0,expungeDeletes=0,docsPending=0,adds=0,deletesById=0,deletesByQuery=0,errors=0,cumulative_adds=2,cumulative_deletesById=0,cumulative_deletesByQuery=1,cumulative_errors=0}
[junit4:junit4]   2> 1043 T1522 oejsh.ContextHandler.doStop stopped o.e.j.s.ServletContextHandler{/solr,null}
[junit4:junit4]   2> 1100 T1522 oasc.CoreContainer.shutdown Shutting down CoreContainer instance=1979999073
[junit4:junit4]   2> 1101 T1522 oasc.SolrCore.close [collection1]  CLOSING SolrCore org.apache.solr.core.SolrCore@55378173
[junit4:junit4]   2> 1101 T1522 oasc.SolrCore.closeSearcher [collection1] Closing main searcher on request.
[junit4:junit4]   2> 1101 T1522 oasu.DirectUpdateHandler2.close closing DirectUpdateHandler2{commits=1,autocommits=0,soft autocommits=0,optimizes=0,rollbacks=0,expungeDeletes=0,docsPending=0,adds=0,deletesById=0,deletesByQuery=0,errors=0,cumulative_adds=2,cumulative_deletesById=0,cumulative_deletesByQuery=1,cumulative_errors=0}
[junit4:junit4]   2> 1108 T1522 oejsh.ContextHandler.doStop stopped o.e.j.s.ServletContextHandler{/solr,null}
[junit4:junit4]   2> 1159 T1522 oasc.CoreContainer.shutdown Shutting down CoreContainer instance=1650259921
[junit4:junit4]   2> 1160 T1522 oasc.SolrCore.close [collection1]  CLOSING SolrCore org.apache.solr.core.SolrCore@4b93c3d0
[junit4:junit4]   2> 1161 T1522 oasc.SolrCore.closeSearcher [collection1] Closing main searcher on request.
[junit4:junit4]   2> 1161 T1522 oasu.DirectUpdateHandler2.close closing DirectUpdateHandler2{commits=1,autocommits=0,soft autocommits=0,optimizes=0,rollbacks=0,expungeDeletes=0,docsPending=0,adds=0,deletesById=0,deletesByQuery=0,errors=0,cumulative_adds=3,cumulative_deletesById=0,cumulative_deletesByQuery=1,cumulative_errors=0}
[junit4:junit4]   2> 1166 T1522 oejsh.ContextHandler.doStop stopped o.e.j.s.ServletContextHandler{/solr,null}
[junit4:junit4]   2> 1218 T1522 oas.SolrTestCaseJ4.tearDown ###Ending testDistribSearch
[junit4:junit4]   2> NOTE: reproduce with: ant test  -Dtestcase=DistributedQueryElevationComponentTest -Dtests.method=testDistribSearch -Dtests.seed=D36380F652C98628 -Dtests.multiplier=3 -Dtests.slow=true -Dtests.locale=sq_AL -Dtests.timezone=Australia/Victoria -Dtests.file.encoding=UTF-8
[junit4:junit4]   2>
[junit4:junit4]    > (@AfterClass output)
[junit4:junit4]   2> 1255 T1522 oas.SolrTestCaseJ4.deleteCore ###deleteCore
[junit4:junit4]   2> NOTE: test params are: codec=Lucene40: {int_i=PostingsFormat(name=Lucene40WithOrds), field_t=Lucene40(minBlockSize=21 maxBlockSize=76), plow_t=PostingsFormat(name=Lucene40WithOrds), text=PostingsFormat(name=Lucene40WithOrds), id=Lucene40(minBlockSize=21 maxBlockSize=76)}, sim=DefaultSimilarity, locale=sq_AL, timezone=Australia/Victoria
[junit4:junit4]   2> NOTE: Linux 3.2.0-26-generic amd64/Oracle Corporation 1.8.0-ea (64-bit)/cpus=8,threads=1,free=144974424,total=278200320
[junit4:junit4]   2> NOTE: All tests run in this JVM: [HighlighterTest, SimpleFacetsTest, TestSolrCoreProperties, TestQueryUtils, SolrIndexConfigTest, TestFunctionQuery, FileUtilsTest, SolrInfoMBeanTest, TestJoin, TestDocSet, CircularListTest, SuggesterWFSTTest, IndexBasedSpellCheckerTest, TestReplicationHandler, TestLRUCache, TestArbitraryIndexDir, TestSolrDeletionPolicy2, TestPropInject, TestBinaryResponseWriter, BadIndexSchemaTest, TestCSVResponseWriter, CloudStateUpdateTest, FullSolrCloudTest, TestCodecSupport, TestPropInjectDefaults, DebugComponentTest, SpellCheckCollatorTest, JsonLoaderTest, EchoParamsTest, TestBM25SimilarityFactory, SpellingQueryConverterTest, ZkNodePropsTest, TestRemoteStreaming, SystemInfoHandlerTest, TestSolrXMLSerializer, TestPluginEnable, XsltUpdateRequestHandlerTest, ShowFileRequestHandlerTest, SampleTest, BasicFunctionalityTest, OverseerTest, LukeRequestHandlerTest, DistributedQueryElevationComponentTest]
[junit4:junit4]   2> 
[junit4:junit4] Completed on J1 in 1.26s, 1 test, 1 failure <<< FAILURES!

[...truncated 481 lines...]
BUILD FAILED
/mnt/ssd/jenkins/workspace/Lucene-Solr-4.x-Linux-Java8-64/checkout/build.xml:29: The following error occurred while executing this line:
/mnt/ssd/jenkins/workspace/Lucene-Solr-4.x-Linux-Java8-64/checkout/solr/build.xml:144: The following error occurred while executing this line:
/mnt/ssd/jenkins/workspace/Lucene-Solr-4.x-Linux-Java8-64/checkout/lucene/module-build.xml:62: The following error occurred while executing this line:
/mnt/ssd/jenkins/workspace/Lucene-Solr-4.x-Linux-Java8-64/checkout/lucene/common-build.xml:1094: The following error occurred while executing this line:
/mnt/ssd/jenkins/workspace/Lucene-Solr-4.x-Linux-Java8-64/checkout/lucene/common-build.xml:789: There were test failures: 223 suites, 901 tests, 1 failure, 5 ignored

Total time: 20 minutes 9 seconds
Build step 'Execute shell' marked build as failure
Archiving artifacts
Recording test results
Email was triggered for: Failure
Sending email for trigger: Failure




Mime
View raw message