lucene-dev mailing list archives

Site index · List index
Message view « Date » · « Thread »
Top « Date » · « Thread »
From Apache Jenkins Server <jenk...@builds.apache.org>
Subject [JENKINS] Lucene-Solr-tests-only-trunk-java7 - Build # 2994 - Failure
Date Mon, 30 Jul 2012 18:35:22 GMT
Build: https://builds.apache.org/job/Lucene-Solr-tests-only-trunk-java7/2994/

1 tests failed.
REGRESSION:  org.apache.solr.schema.BadIndexSchemaTest.testSevereErrorsForUnexpectedAnalyzer

Error Message:
Unexpected error, expected error matching: bad_type

Stack Trace:
org.apache.solr.common.SolrException: Unexpected error, expected error matching: bad_type
	at __randomizedtesting.SeedInfo.seed([A42954D3B8280F08:384E1C192D9054DB]:0)
	at org.apache.solr.core.AbstractBadConfigTestBase.assertConfigs(AbstractBadConfigTestBase.java:56)
	at org.apache.solr.schema.BadIndexSchemaTest.doTest(BadIndexSchemaTest.java:28)
	at org.apache.solr.schema.BadIndexSchemaTest.testSevereErrorsForUnexpectedAnalyzer(BadIndexSchemaTest.java:52)
	at sun.reflect.NativeMethodAccessorImpl.invoke0(Native Method)
	at sun.reflect.NativeMethodAccessorImpl.invoke(NativeMethodAccessorImpl.java:57)
	at sun.reflect.DelegatingMethodAccessorImpl.invoke(DelegatingMethodAccessorImpl.java:43)
	at java.lang.reflect.Method.invoke(Method.java:601)
	at com.carrotsearch.randomizedtesting.RandomizedRunner.invoke(RandomizedRunner.java:1995)
	at com.carrotsearch.randomizedtesting.RandomizedRunner.access$1100(RandomizedRunner.java:132)
	at com.carrotsearch.randomizedtesting.RandomizedRunner$6.evaluate(RandomizedRunner.java:818)
	at com.carrotsearch.randomizedtesting.RandomizedRunner$7.evaluate(RandomizedRunner.java:877)
	at com.carrotsearch.randomizedtesting.RandomizedRunner$8.evaluate(RandomizedRunner.java:891)
	at com.carrotsearch.randomizedtesting.rules.SystemPropertiesRestoreRule$1.evaluate(SystemPropertiesRestoreRule.java:53)
	at org.apache.lucene.util.TestRuleSetupTeardownChained$1.evaluate(TestRuleSetupTeardownChained.java:50)
	at org.apache.lucene.util.TestRuleFieldCacheSanity$1.evaluate(TestRuleFieldCacheSanity.java:32)
	at org.apache.lucene.util.AbstractBeforeAfterRule$1.evaluate(AbstractBeforeAfterRule.java:45)
	at com.carrotsearch.randomizedtesting.rules.SystemPropertiesInvariantRule$1.evaluate(SystemPropertiesInvariantRule.java:55)
	at org.apache.lucene.util.TestRuleReportUncaughtExceptions$1.evaluate(TestRuleReportUncaughtExceptions.java:68)
	at org.apache.lucene.util.TestRuleThreadAndTestName$1.evaluate(TestRuleThreadAndTestName.java:48)
	at org.apache.lucene.util.TestRuleIgnoreAfterMaxFailures$1.evaluate(TestRuleIgnoreAfterMaxFailures.java:70)
	at org.apache.lucene.util.TestRuleMarkFailure$1.evaluate(TestRuleMarkFailure.java:48)
	at com.carrotsearch.randomizedtesting.RandomizedRunner.runSingleTest(RandomizedRunner.java:825)
	at com.carrotsearch.randomizedtesting.RandomizedRunner.access$700(RandomizedRunner.java:132)
	at com.carrotsearch.randomizedtesting.RandomizedRunner$3$1.run(RandomizedRunner.java:671)
	at com.carrotsearch.randomizedtesting.RandomizedRunner$3.evaluate(RandomizedRunner.java:697)
	at com.carrotsearch.randomizedtesting.RandomizedRunner$4.evaluate(RandomizedRunner.java:736)
	at com.carrotsearch.randomizedtesting.RandomizedRunner$5.evaluate(RandomizedRunner.java:747)
	at com.carrotsearch.randomizedtesting.rules.SystemPropertiesRestoreRule$1.evaluate(SystemPropertiesRestoreRule.java:53)
	at org.apache.lucene.util.AbstractBeforeAfterRule$1.evaluate(AbstractBeforeAfterRule.java:45)
	at org.apache.lucene.util.TestRuleReportUncaughtExceptions$1.evaluate(TestRuleReportUncaughtExceptions.java:68)
	at org.apache.lucene.util.TestRuleStoreClassName$1.evaluate(TestRuleStoreClassName.java:38)
	at com.carrotsearch.randomizedtesting.rules.SystemPropertiesInvariantRule$1.evaluate(SystemPropertiesInvariantRule.java:55)
	at org.apache.lucene.util.TestRuleNoInstanceHooksOverrides$1.evaluate(TestRuleNoInstanceHooksOverrides.java:53)
	at org.apache.lucene.util.TestRuleNoStaticHooksShadowing$1.evaluate(TestRuleNoStaticHooksShadowing.java:52)
	at org.apache.lucene.util.TestRuleAssertionsRequired$1.evaluate(TestRuleAssertionsRequired.java:36)
	at org.apache.lucene.util.TestRuleMarkFailure$1.evaluate(TestRuleMarkFailure.java:48)
	at org.apache.lucene.util.TestRuleIgnoreAfterMaxFailures$1.evaluate(TestRuleIgnoreAfterMaxFailures.java:70)
	at org.apache.lucene.util.TestRuleIgnoreTestSuites$1.evaluate(TestRuleIgnoreTestSuites.java:55)
	at com.carrotsearch.randomizedtesting.RandomizedRunner.runSuite(RandomizedRunner.java:605)
	at com.carrotsearch.randomizedtesting.RandomizedRunner.access$400(RandomizedRunner.java:132)
	at com.carrotsearch.randomizedtesting.RandomizedRunner$2.run(RandomizedRunner.java:551)
Caused by: java.lang.RuntimeException: java.io.IOException: Can't find resource 'bad-schema-analyzer-class-and-nested.xml'
in classpath or '/usr/home/hudson/hudson-slave/workspace/Lucene-Solr-tests-only-trunk-java7/checkout/solr/build/solr-core/test-files/solr/collection1/conf/',
cwd=/usr/home/hudson/hudson-slave/workspace/Lucene-Solr-tests-only-trunk-java7/checkout/solr/build/solr-core/test/J1
	at org.apache.solr.schema.IndexSchema.<init>(IndexSchema.java:116)
	at org.apache.solr.util.TestHarness.<init>(TestHarness.java:99)
	at org.apache.solr.SolrTestCaseJ4.createCore(SolrTestCaseJ4.java:355)
	at org.apache.solr.SolrTestCaseJ4.initCore(SolrTestCaseJ4.java:348)
	at org.apache.solr.SolrTestCaseJ4.initCore(SolrTestCaseJ4.java:171)
	at org.apache.solr.SolrTestCaseJ4.initCore(SolrTestCaseJ4.java:159)
	at org.apache.solr.core.AbstractBadConfigTestBase.assertConfigs(AbstractBadConfigTestBase.java:44)
	... 40 more
Caused by: java.io.IOException: Can't find resource 'bad-schema-analyzer-class-and-nested.xml'
in classpath or '/usr/home/hudson/hudson-slave/workspace/Lucene-Solr-tests-only-trunk-java7/checkout/solr/build/solr-core/test-files/solr/collection1/conf/',
cwd=/usr/home/hudson/hudson-slave/workspace/Lucene-Solr-tests-only-trunk-java7/checkout/solr/build/solr-core/test/J1
	at org.apache.solr.core.SolrResourceLoader.openResource(SolrResourceLoader.java:314)
	at org.apache.solr.core.SolrResourceLoader.openSchema(SolrResourceLoader.java:272)
	at org.apache.solr.schema.IndexSchema.<init>(IndexSchema.java:110)
	... 46 more




Build Log:
[...truncated 7526 lines...]
[junit4:junit4] Suite: org.apache.solr.schema.BadIndexSchemaTest
[junit4:junit4] ERROR   0.24s J1 | BadIndexSchemaTest.testSevereErrorsForUnexpectedAnalyzer
[junit4:junit4]    > Throwable #1: org.apache.solr.common.SolrException: Unexpected error,
expected error matching: bad_type
[junit4:junit4]    > 	at __randomizedtesting.SeedInfo.seed([A42954D3B8280F08:384E1C192D9054DB]:0)
[junit4:junit4]    > 	at org.apache.solr.core.AbstractBadConfigTestBase.assertConfigs(AbstractBadConfigTestBase.java:56)
[junit4:junit4]    > 	at org.apache.solr.schema.BadIndexSchemaTest.doTest(BadIndexSchemaTest.java:28)
[junit4:junit4]    > 	at org.apache.solr.schema.BadIndexSchemaTest.testSevereErrorsForUnexpectedAnalyzer(BadIndexSchemaTest.java:52)
[junit4:junit4]    > 	at sun.reflect.NativeMethodAccessorImpl.invoke0(Native Method)
[junit4:junit4]    > 	at sun.reflect.NativeMethodAccessorImpl.invoke(NativeMethodAccessorImpl.java:57)
[junit4:junit4]    > 	at sun.reflect.DelegatingMethodAccessorImpl.invoke(DelegatingMethodAccessorImpl.java:43)
[junit4:junit4]    > 	at java.lang.reflect.Method.invoke(Method.java:601)
[junit4:junit4]    > 	at com.carrotsearch.randomizedtesting.RandomizedRunner.invoke(RandomizedRunner.java:1995)
[junit4:junit4]    > 	at com.carrotsearch.randomizedtesting.RandomizedRunner.access$1100(RandomizedRunner.java:132)
[junit4:junit4]    > 	at com.carrotsearch.randomizedtesting.RandomizedRunner$6.evaluate(RandomizedRunner.java:818)
[junit4:junit4]    > 	at com.carrotsearch.randomizedtesting.RandomizedRunner$7.evaluate(RandomizedRunner.java:877)
[junit4:junit4]    > 	at com.carrotsearch.randomizedtesting.RandomizedRunner$8.evaluate(RandomizedRunner.java:891)
[junit4:junit4]    > 	at com.carrotsearch.randomizedtesting.rules.SystemPropertiesRestoreRule$1.evaluate(SystemPropertiesRestoreRule.java:53)
[junit4:junit4]    > 	at org.apache.lucene.util.TestRuleSetupTeardownChained$1.evaluate(TestRuleSetupTeardownChained.java:50)
[junit4:junit4]    > 	at org.apache.lucene.util.TestRuleFieldCacheSanity$1.evaluate(TestRuleFieldCacheSanity.java:32)
[junit4:junit4]    > 	at org.apache.lucene.util.AbstractBeforeAfterRule$1.evaluate(AbstractBeforeAfterRule.java:45)
[junit4:junit4]    > 	at com.carrotsearch.randomizedtesting.rules.SystemPropertiesInvariantRule$1.evaluate(SystemPropertiesInvariantRule.java:55)
[junit4:junit4]    > 	at org.apache.lucene.util.TestRuleReportUncaughtExceptions$1.evaluate(TestRuleReportUncaughtExceptions.java:68)
[junit4:junit4]    > 	at org.apache.lucene.util.TestRuleThreadAndTestName$1.evaluate(TestRuleThreadAndTestName.java:48)
[junit4:junit4]    > 	at org.apache.lucene.util.TestRuleIgnoreAfterMaxFailures$1.evaluate(TestRuleIgnoreAfterMaxFailures.java:70)
[junit4:junit4]    > 	at org.apache.lucene.util.TestRuleMarkFailure$1.evaluate(TestRuleMarkFailure.java:48)
[junit4:junit4]    > 	at com.carrotsearch.randomizedtesting.RandomizedRunner.runSingleTest(RandomizedRunner.java:825)
[junit4:junit4]    > 	at com.carrotsearch.randomizedtesting.RandomizedRunner.access$700(RandomizedRunner.java:132)
[junit4:junit4]    > 	at com.carrotsearch.randomizedtesting.RandomizedRunner$3$1.run(RandomizedRunner.java:671)
[junit4:junit4]    > 	at com.carrotsearch.randomizedtesting.RandomizedRunner$3.evaluate(RandomizedRunner.java:697)
[junit4:junit4]    > 	at com.carrotsearch.randomizedtesting.RandomizedRunner$4.evaluate(RandomizedRunner.java:736)
[junit4:junit4]    > 	at com.carrotsearch.randomizedtesting.RandomizedRunner$5.evaluate(RandomizedRunner.java:747)
[junit4:junit4]    > 	at com.carrotsearch.randomizedtesting.rules.SystemPropertiesRestoreRule$1.evaluate(SystemPropertiesRestoreRule.java:53)
[junit4:junit4]    > 	at org.apache.lucene.util.AbstractBeforeAfterRule$1.evaluate(AbstractBeforeAfterRule.java:45)
[junit4:junit4]    > 	at org.apache.lucene.util.TestRuleReportUncaughtExceptions$1.evaluate(TestRuleReportUncaughtExceptions.java:68)
[junit4:junit4]    > 	at org.apache.lucene.util.TestRuleStoreClassName$1.evaluate(TestRuleStoreClassName.java:38)
[junit4:junit4]    > 	at com.carrotsearch.randomizedtesting.rules.SystemPropertiesInvariantRule$1.evaluate(SystemPropertiesInvariantRule.java:55)
[junit4:junit4]    > 	at org.apache.lucene.util.TestRuleNoInstanceHooksOverrides$1.evaluate(TestRuleNoInstanceHooksOverrides.java:53)
[junit4:junit4]    > 	at org.apache.lucene.util.TestRuleNoStaticHooksShadowing$1.evaluate(TestRuleNoStaticHooksShadowing.java:52)
[junit4:junit4]    > 	at org.apache.lucene.util.TestRuleAssertionsRequired$1.evaluate(TestRuleAssertionsRequired.java:36)
[junit4:junit4]    > 	at org.apache.lucene.util.TestRuleMarkFailure$1.evaluate(TestRuleMarkFailure.java:48)
[junit4:junit4]    > 	at org.apache.lucene.util.TestRuleIgnoreAfterMaxFailures$1.evaluate(TestRuleIgnoreAfterMaxFailures.java:70)
[junit4:junit4]    > 	at org.apache.lucene.util.TestRuleIgnoreTestSuites$1.evaluate(TestRuleIgnoreTestSuites.java:55)
[junit4:junit4]    > 	at com.carrotsearch.randomizedtesting.RandomizedRunner.runSuite(RandomizedRunner.java:605)
[junit4:junit4]    > 	at com.carrotsearch.randomizedtesting.RandomizedRunner.access$400(RandomizedRunner.java:132)
[junit4:junit4]    > 	at com.carrotsearch.randomizedtesting.RandomizedRunner$2.run(RandomizedRunner.java:551)
[junit4:junit4]    > Caused by: java.lang.RuntimeException: java.io.IOException: Can't
find resource 'bad-schema-analyzer-class-and-nested.xml' in classpath or '/usr/home/hudson/hudson-slave/workspace/Lucene-Solr-tests-only-trunk-java7/checkout/solr/build/solr-core/test-files/solr/collection1/conf/',
cwd=/usr/home/hudson/hudson-slave/workspace/Lucene-Solr-tests-only-trunk-java7/checkout/solr/build/solr-core/test/J1
[junit4:junit4]    > 	at org.apache.solr.schema.IndexSchema.<init>(IndexSchema.java:116)
[junit4:junit4]    > 	at org.apache.solr.util.TestHarness.<init>(TestHarness.java:99)
[junit4:junit4]    > 	at org.apache.solr.SolrTestCaseJ4.createCore(SolrTestCaseJ4.java:355)
[junit4:junit4]    > 	at org.apache.solr.SolrTestCaseJ4.initCore(SolrTestCaseJ4.java:348)
[junit4:junit4]    > 	at org.apache.solr.SolrTestCaseJ4.initCore(SolrTestCaseJ4.java:171)
[junit4:junit4]    > 	at org.apache.solr.SolrTestCaseJ4.initCore(SolrTestCaseJ4.java:159)
[junit4:junit4]    > 	at org.apache.solr.core.AbstractBadConfigTestBase.assertConfigs(AbstractBadConfigTestBase.java:44)
[junit4:junit4]    > 	... 40 more
[junit4:junit4]    > Caused by: java.io.IOException: Can't find resource 'bad-schema-analyzer-class-and-nested.xml'
in classpath or '/usr/home/hudson/hudson-slave/workspace/Lucene-Solr-tests-only-trunk-java7/checkout/solr/build/solr-core/test-files/solr/collection1/conf/',
cwd=/usr/home/hudson/hudson-slave/workspace/Lucene-Solr-tests-only-trunk-java7/checkout/solr/build/solr-core/test/J1
[junit4:junit4]    > 	at org.apache.solr.core.SolrResourceLoader.openResource(SolrResourceLoader.java:314)
[junit4:junit4]    > 	at org.apache.solr.core.SolrResourceLoader.openSchema(SolrResourceLoader.java:272)
[junit4:junit4]    > 	at org.apache.solr.schema.IndexSchema.<init>(IndexSchema.java:110)
[junit4:junit4]    > 	... 46 more
[junit4:junit4]    > 
[junit4:junit4]   2> 297 T1384 oas.SolrTestCaseJ4.setUp ###Starting testSevereErrorsForUnexpectedAnalyzer
[junit4:junit4]   2> 297 T1384 oas.SolrTestCaseJ4.initCore ####initCore
[junit4:junit4]   2> Creating dataDir: /usr/home/hudson/hudson-slave/workspace/Lucene-Solr-tests-only-trunk-java7/checkout/solr/build/solr-core/test/J1/./solrtest-BadIndexSchemaTest-1343672573755
[junit4:junit4]   2> 298 T1384 oasc.SolrResourceLoader.<init> new SolrResourceLoader
for directory: '/usr/home/hudson/hudson-slave/workspace/Lucene-Solr-tests-only-trunk-java7/checkout/solr/build/solr-core/test-files/solr/collection1/'
[junit4:junit4]   2> 298 T1384 oasc.SolrResourceLoader.replaceClassLoader Adding 'file:/usr/home/hudson/hudson-slave/workspace/Lucene-Solr-tests-only-trunk-java7/checkout/solr/build/solr-core/test-files/solr/collection1/lib/README'
to classloader
[junit4:junit4]   2> 298 T1384 oasc.SolrResourceLoader.replaceClassLoader Adding 'file:/usr/home/hudson/hudson-slave/workspace/Lucene-Solr-tests-only-trunk-java7/checkout/solr/build/solr-core/test-files/solr/collection1/lib/classes/'
to classloader
[junit4:junit4]   2> 331 T1384 oasc.SolrConfig.<init> Using Lucene MatchVersion:
LUCENE_50
[junit4:junit4]   2> 384 T1384 oasc.SolrConfig.<init> Loaded SolrConfig: solrconfig.xml
[junit4:junit4]   2> 384 T1384 oass.IndexSchema.readSchema Reading Solr Schema
[junit4:junit4]   2> 387 T1384 oass.IndexSchema.readSchema Schema name=bad-schema-nontext-analyzer
[junit4:junit4]   2> 396 T1384 oas.SolrTestCaseJ4.deleteCore ###deleteCore
[junit4:junit4]   2> 397 T1384 oas.SolrTestCaseJ4.initCore ####initCore
[junit4:junit4]   2> Creating dataDir: /usr/home/hudson/hudson-slave/workspace/Lucene-Solr-tests-only-trunk-java7/checkout/solr/build/solr-core/test/J1/./solrtest-BadIndexSchemaTest-1343672573854
[junit4:junit4]   2> 397 T1384 oasc.SolrResourceLoader.<init> new SolrResourceLoader
for directory: '/usr/home/hudson/hudson-slave/workspace/Lucene-Solr-tests-only-trunk-java7/checkout/solr/build/solr-core/test-files/solr/collection1/'
[junit4:junit4]   2> 398 T1384 oasc.SolrResourceLoader.replaceClassLoader Adding 'file:/usr/home/hudson/hudson-slave/workspace/Lucene-Solr-tests-only-trunk-java7/checkout/solr/build/solr-core/test-files/solr/collection1/lib/README'
to classloader
[junit4:junit4]   2> 398 T1384 oasc.SolrResourceLoader.replaceClassLoader Adding 'file:/usr/home/hudson/hudson-slave/workspace/Lucene-Solr-tests-only-trunk-java7/checkout/solr/build/solr-core/test-files/solr/collection1/lib/classes/'
to classloader
[junit4:junit4]   2> 430 T1384 oasc.SolrConfig.<init> Using Lucene MatchVersion:
LUCENE_50
[junit4:junit4]   2> 484 T1384 oasc.SolrConfig.<init> Loaded SolrConfig: solrconfig.xml
[junit4:junit4]   2> 485 T1384 oas.SolrTestCaseJ4.deleteCore ###deleteCore
[junit4:junit4]   2> 485 T1384 oas.SolrTestCaseJ4.tearDown ###Ending testSevereErrorsForUnexpectedAnalyzer
[junit4:junit4]   2> NOTE: reproduce with: ant test  -Dtestcase=BadIndexSchemaTest -Dtests.method=testSevereErrorsForUnexpectedAnalyzer
-Dtests.seed=A42954D3B8280F08 -Dtests.multiplier=3 -Dtests.slow=true -Dtests.locale=hr_HR
-Dtests.timezone=Mideast/Riyadh87 -Dtests.file.encoding=UTF-8
[junit4:junit4]   2>
[junit4:junit4]    > (@AfterClass output)
[junit4:junit4]   2> 1579 T1384 oas.SolrTestCaseJ4.deleteCore ###deleteCore
[junit4:junit4]   2> NOTE: test params are: codec=Lucene40: {}, sim=RandomSimilarityProvider(queryNorm=false,coord=false):
{}, locale=hr_HR, timezone=Mideast/Riyadh87
[junit4:junit4]   2> NOTE: FreeBSD 9.0-RELEASE amd64/Oracle Corporation 1.7.0_04 (64-bit)/cpus=16,threads=1,free=332432576,total=509607936
[junit4:junit4]   2> NOTE: All tests run in this JVM: [ZkControllerTest, HighlighterTest,
OverseerTest, FileUtilsTest, QueryParsingTest, TestJoin, FieldMutatingUpdateProcessorTest,
TestFiltering, TestQueryTypes, TestLRUCache, ZkCLITest, TestCSVResponseWriter, RequiredFieldsTest,
BasicFunctionalityTest, EchoParamsTest, TestCharFilters, FullSolrCloudTest, SpellingQueryConverterTest,
TestBinaryResponseWriter, TestCSVLoader, SuggesterWFSTTest, SuggesterTSTTest, TestSolrDeletionPolicy2,
BasicZkTest, JsonLoaderTest, TestPHPSerializedResponseWriter, TestBinaryField, TestSolrQueryParser,
SimpleFacetsTest, UUIDFieldTest, StatsComponentTest, MultiTermTest, TestFunctionQuery, FieldAnalysisRequestHandlerTest,
TestStressRecovery, DistributedQueryElevationComponentTest, DisMaxRequestHandlerTest, TestArbitraryIndexDir,
ShowFileRequestHandlerTest, IndexReaderFactoryTest, TestFaceting, CircularListTest, TestSolrXMLSerializer,
TestSolrJ, DirectUpdateHandlerOptimizeTest, DocumentBuilderTest, TestMergePolicyConfig, BadIndexSchemaTest]
[junit4:junit4]   2> 
[junit4:junit4] Completed on J1 in 1.59s, 9 tests, 1 error <<< FAILURES!

[...truncated 354 lines...]
BUILD FAILED
/usr/home/hudson/hudson-slave/workspace/Lucene-Solr-tests-only-trunk-java7/checkout/build.xml:29:
The following error occurred while executing this line:
/usr/home/hudson/hudson-slave/workspace/Lucene-Solr-tests-only-trunk-java7/checkout/solr/build.xml:144:
The following error occurred while executing this line:
/usr/home/hudson/hudson-slave/workspace/Lucene-Solr-tests-only-trunk-java7/checkout/lucene/module-build.xml:62:
The following error occurred while executing this line:
/usr/home/hudson/hudson-slave/workspace/Lucene-Solr-tests-only-trunk-java7/checkout/lucene/common-build.xml:1095:
The following error occurred while executing this line:
/usr/home/hudson/hudson-slave/workspace/Lucene-Solr-tests-only-trunk-java7/checkout/lucene/common-build.xml:790:
There were test failures: 223 suites, 899 tests, 1 error, 5 ignored

Total time: 32 minutes 49 seconds
Build step 'Execute shell' marked build as failure
Archiving artifacts
Recording test results
Email was triggered for: Failure
Sending email for trigger: Failure



Mime
View raw message