lucene-dev mailing list archives

Site index · List index
Message view « Date » · « Thread »
Top « Date » · « Thread »
From "Uwe Schindler" <...@thetaphi.de>
Subject RE: [JENKINS] Lucene-Solr-trunk-Linux-Java7-64 - Build # 737 - Failure!
Date Sat, 28 Jul 2012 20:01:56 GMT
Sorry, fixed this. The problem in test was that path was not absolute in this configuration.

-----
Uwe Schindler
H.-H.-Meier-Allee 63, D-28213 Bremen
http://www.thetaphi.de
eMail: uwe@thetaphi.de


> -----Original Message-----
> From: Policeman Jenkins Server [mailto:jenkins@sd-datasolutions.de]
> Sent: Saturday, July 28, 2012 9:56 PM
> To: dev@lucene.apache.org; uwe@thetaphi.de
> Subject: [JENKINS] Lucene-Solr-trunk-Linux-Java7-64 - Build # 737 - Failure!
> 
> Build: http://jenkins.sd-datasolutions.de/job/Lucene-Solr-trunk-Linux-Java7-
> 64/737/
> 
> 1 tests failed.
> FAILED:
> org.apache.lucene.analysis.util.TestFilesystemResourceLoader.testBaseDir
> 
> Error Message:
> Resource not found: ./fsResourceLoaderBase4682246822tmp/template.txt
> 
> Stack Trace:
> java.io.IOException: Resource not found:
> ./fsResourceLoaderBase4682246822tmp/template.txt
> 	at
> __randomizedtesting.SeedInfo.seed([AD5802E6257518AC:9771B46C53531694]:
> 0)
> 	at
> org.apache.lucene.analysis.util.ClasspathResourceLoader.openResource(Classp
> athResourceLoader.java:67)
> 	at
> org.apache.lucene.analysis.util.FilesystemResourceLoader.openResource(Filesy
> stemResourceLoader.java:86)
> 	at
> org.apache.lucene.analysis.util.TestFilesystemResourceLoader.testBaseDir(Test
> FilesystemResourceLoader.java:77)
> 	at sun.reflect.NativeMethodAccessorImpl.invoke0(Native Method)
> 	at
> sun.reflect.NativeMethodAccessorImpl.invoke(NativeMethodAccessorImpl.java:
> 57)
> 	at
> sun.reflect.DelegatingMethodAccessorImpl.invoke(DelegatingMethodAccessorI
> mpl.java:43)
> 	at java.lang.reflect.Method.invoke(Method.java:601)
> 	at
> com.carrotsearch.randomizedtesting.RandomizedRunner.invoke(RandomizedRu
> nner.java:1995)
> 	at
> com.carrotsearch.randomizedtesting.RandomizedRunner.access$1100(Random
> izedRunner.java:132)
> 	at
> com.carrotsearch.randomizedtesting.RandomizedRunner$6.evaluate(Randomiz
> edRunner.java:818)
> 	at
> com.carrotsearch.randomizedtesting.RandomizedRunner$7.evaluate(Randomiz
> edRunner.java:877)
> 	at
> com.carrotsearch.randomizedtesting.RandomizedRunner$8.evaluate(Randomiz
> edRunner.java:891)
> 	at
> org.apache.lucene.util.TestRuleSetupTeardownChained$1.evaluate(TestRuleSet
> upTeardownChained.java:50)
> 	at
> org.apache.lucene.util.TestRuleFieldCacheSanity$1.evaluate(TestRuleFieldCach
> eSanity.java:32)
> 	at
> org.apache.lucene.util.AbstractBeforeAfterRule$1.evaluate(AbstractBeforeAfte
> rRule.java:45)
> 	at
> com.carrotsearch.randomizedtesting.rules.SystemPropertiesInvariantRule$1.ev
> aluate(SystemPropertiesInvariantRule.java:55)
> 	at
> org.apache.lucene.util.TestRuleReportUncaughtExceptions$1.evaluate(TestRule
> ReportUncaughtExceptions.java:68)
> 	at
> org.apache.lucene.util.TestRuleThreadAndTestName$1.evaluate(TestRuleThrea
> dAndTestName.java:48)
> 	at
> org.apache.lucene.util.TestRuleIgnoreAfterMaxFailures$1.evaluate(TestRuleIgn
> oreAfterMaxFailures.java:70)
> 	at
> org.apache.lucene.util.TestRuleMarkFailure$1.evaluate(TestRuleMarkFailure.ja
> va:48)
> 	at
> com.carrotsearch.randomizedtesting.RandomizedRunner.runSingleTest(Rando
> mizedRunner.java:825)
> 	at
> com.carrotsearch.randomizedtesting.RandomizedRunner.access$700(Randomiz
> edRunner.java:132)
> 	at
> com.carrotsearch.randomizedtesting.RandomizedRunner$3$1.run(Randomized
> Runner.java:671)
> 	at
> com.carrotsearch.randomizedtesting.RandomizedRunner$3.evaluate(Randomiz
> edRunner.java:697)
> 	at
> com.carrotsearch.randomizedtesting.RandomizedRunner$4.evaluate(Randomiz
> edRunner.java:736)
> 	at
> com.carrotsearch.randomizedtesting.RandomizedRunner$5.evaluate(Randomiz
> edRunner.java:747)
> 	at
> org.apache.lucene.util.AbstractBeforeAfterRule$1.evaluate(AbstractBeforeAfte
> rRule.java:45)
> 	at
> org.apache.lucene.util.TestRuleReportUncaughtExceptions$1.evaluate(TestRule
> ReportUncaughtExceptions.java:68)
> 	at
> org.apache.lucene.util.TestRuleStoreClassName$1.evaluate(TestRuleStoreClass
> Name.java:38)
> 	at
> com.carrotsearch.randomizedtesting.rules.SystemPropertiesInvariantRule$1.ev
> aluate(SystemPropertiesInvariantRule.java:55)
> 	at
> org.apache.lucene.util.TestRuleNoInstanceHooksOverrides$1.evaluate(TestRule
> NoInstanceHooksOverrides.java:53)
> 	at
> org.apache.lucene.util.TestRuleNoStaticHooksShadowing$1.evaluate(TestRuleN
> oStaticHooksShadowing.java:52)
> 	at
> org.apache.lucene.util.TestRuleAssertionsRequired$1.evaluate(TestRuleAssertio
> nsRequired.java:36)
> 	at
> org.apache.lucene.util.TestRuleMarkFailure$1.evaluate(TestRuleMarkFailure.ja
> va:48)
> 	at
> org.apache.lucene.util.TestRuleIgnoreAfterMaxFailures$1.evaluate(TestRuleIgn
> oreAfterMaxFailures.java:70)
> 	at
> org.apache.lucene.util.TestRuleIgnoreTestSuites$1.evaluate(TestRuleIgnoreTest
> Suites.java:55)
> 	at
> com.carrotsearch.randomizedtesting.RandomizedRunner.runSuite(Randomized
> Runner.java:605)
> 	at
> com.carrotsearch.randomizedtesting.RandomizedRunner.access$400(Randomiz
> edRunner.java:132)
> 	at
> com.carrotsearch.randomizedtesting.RandomizedRunner$2.run(RandomizedRu
> nner.java:551)
> 
> 
> 
> 
> Build Log:
> [...truncated 3701 lines...]
> [junit4:junit4] Suite:
> org.apache.lucene.analysis.util.TestFilesystemResourceLoader
> [junit4:junit4] ERROR   0.08s J1 | TestFilesystemResourceLoader.testBaseDir
> [junit4:junit4]    > Throwable #1: java.io.IOException: Resource not found:
> ./fsResourceLoaderBase4682246822tmp/template.txt
> [junit4:junit4]    > 	at
> __randomizedtesting.SeedInfo.seed([AD5802E6257518AC:9771B46C53531694]:
> 0)
> [junit4:junit4]    > 	at
> org.apache.lucene.analysis.util.ClasspathResourceLoader.openResource(Classp
> athResourceLoader.java:67)
> [junit4:junit4]    > 	at
> org.apache.lucene.analysis.util.FilesystemResourceLoader.openResource(Filesy
> stemResourceLoader.java:86)
> [junit4:junit4]    > 	at
> org.apache.lucene.analysis.util.TestFilesystemResourceLoader.testBaseDir(Test
> FilesystemResourceLoader.java:77)
> [junit4:junit4]    > 	at
> sun.reflect.NativeMethodAccessorImpl.invoke0(Native Method)
> [junit4:junit4]    > 	at
> sun.reflect.NativeMethodAccessorImpl.invoke(NativeMethodAccessorImpl.java:
> 57)
> [junit4:junit4]    > 	at
> sun.reflect.DelegatingMethodAccessorImpl.invoke(DelegatingMethodAccessorI
> mpl.java:43)
> [junit4:junit4]    > 	at java.lang.reflect.Method.invoke(Method.java:601)
> [junit4:junit4]    > 	at
> com.carrotsearch.randomizedtesting.RandomizedRunner.invoke(RandomizedRu
> nner.java:1995)
> [junit4:junit4]    > 	at
> com.carrotsearch.randomizedtesting.RandomizedRunner.access$1100(Random
> izedRunner.java:132)
> [junit4:junit4]    > 	at
> com.carrotsearch.randomizedtesting.RandomizedRunner$6.evaluate(Randomiz
> edRunner.java:818)
> [junit4:junit4]    > 	at
> com.carrotsearch.randomizedtesting.RandomizedRunner$7.evaluate(Randomiz
> edRunner.java:877)
> [junit4:junit4]    > 	at
> com.carrotsearch.randomizedtesting.RandomizedRunner$8.evaluate(Randomiz
> edRunner.java:891)
> [junit4:junit4]    > 	at
> org.apache.lucene.util.TestRuleSetupTeardownChained$1.evaluate(TestRuleSet
> upTeardownChained.java:50)
> [junit4:junit4]    > 	at
> org.apache.lucene.util.TestRuleFieldCacheSanity$1.evaluate(TestRuleFieldCach
> eSanity.java:32)
> [junit4:junit4]    > 	at
> org.apache.lucene.util.AbstractBeforeAfterRule$1.evaluate(AbstractBeforeAfte
> rRule.java:45)
> [junit4:junit4]    > 	at
> com.carrotsearch.randomizedtesting.rules.SystemPropertiesInvariantRule$1.ev
> aluate(SystemPropertiesInvariantRule.java:55)
> [junit4:junit4]    > 	at
> org.apache.lucene.util.TestRuleReportUncaughtExceptions$1.evaluate(TestRule
> ReportUncaughtExceptions.java:68)
> [junit4:junit4]    > 	at
> org.apache.lucene.util.TestRuleThreadAndTestName$1.evaluate(TestRuleThrea
> dAndTestName.java:48)
> [junit4:junit4]    > 	at
> org.apache.lucene.util.TestRuleIgnoreAfterMaxFailures$1.evaluate(TestRuleIgn
> oreAfterMaxFailures.java:70)
> [junit4:junit4]    > 	at
> org.apache.lucene.util.TestRuleMarkFailure$1.evaluate(TestRuleMarkFailure.ja
> va:48)
> [junit4:junit4]    > 	at
> com.carrotsearch.randomizedtesting.RandomizedRunner.runSingleTest(Rando
> mizedRunner.java:825)
> [junit4:junit4]    > 	at
> com.carrotsearch.randomizedtesting.RandomizedRunner.access$700(Randomiz
> edRunner.java:132)
> [junit4:junit4]    > 	at
> com.carrotsearch.randomizedtesting.RandomizedRunner$3$1.run(Randomized
> Runner.java:671)
> [junit4:junit4]    > 	at
> com.carrotsearch.randomizedtesting.RandomizedRunner$3.evaluate(Randomiz
> edRunner.java:697)
> [junit4:junit4]    > 	at
> com.carrotsearch.randomizedtesting.RandomizedRunner$4.evaluate(Randomiz
> edRunner.java:736)
> [junit4:junit4]    > 	at
> com.carrotsearch.randomizedtesting.RandomizedRunner$5.evaluate(Randomiz
> edRunner.java:747)
> [junit4:junit4]    > 	at
> org.apache.lucene.util.AbstractBeforeAfterRule$1.evaluate(AbstractBeforeAfte
> rRule.java:45)
> [junit4:junit4]    > 	at
> org.apache.lucene.util.TestRuleReportUncaughtExceptions$1.evaluate(TestRule
> ReportUncaughtExceptions.java:68)
> [junit4:junit4]    > 	at
> org.apache.lucene.util.TestRuleStoreClassName$1.evaluate(TestRuleStoreClass
> Name.java:38)
> [junit4:junit4]    > 	at
> com.carrotsearch.randomizedtesting.rules.SystemPropertiesInvariantRule$1.ev
> aluate(SystemPropertiesInvariantRule.java:55)
> [junit4:junit4]    > 	at
> org.apache.lucene.util.TestRuleNoInstanceHooksOverrides$1.evaluate(TestRule
> NoInstanceHooksOverrides.java:53)
> [junit4:junit4]    > 	at
> org.apache.lucene.util.TestRuleNoStaticHooksShadowing$1.evaluate(TestRuleN
> oStaticHooksShadowing.java:52)
> [junit4:junit4]    > 	at
> org.apache.lucene.util.TestRuleAssertionsRequired$1.evaluate(TestRuleAssertio
> nsRequired.java:36)
> [junit4:junit4]    > 	at
> org.apache.lucene.util.TestRuleMarkFailure$1.evaluate(TestRuleMarkFailure.ja
> va:48)
> [junit4:junit4]    > 	at
> org.apache.lucene.util.TestRuleIgnoreAfterMaxFailures$1.evaluate(TestRuleIgn
> oreAfterMaxFailures.java:70)
> [junit4:junit4]    > 	at
> org.apache.lucene.util.TestRuleIgnoreTestSuites$1.evaluate(TestRuleIgnoreTest
> Suites.java:55)
> [junit4:junit4]    > 	at
> com.carrotsearch.randomizedtesting.RandomizedRunner.runSuite(Randomized
> Runner.java:605)
> [junit4:junit4]    > 	at
> com.carrotsearch.randomizedtesting.RandomizedRunner.access$400(Randomiz
> edRunner.java:132)
> [junit4:junit4]    > 	at
> com.carrotsearch.randomizedtesting.RandomizedRunner$2.run(RandomizedRu
> nner.java:551)
> [junit4:junit4]    >
> [junit4:junit4]   2> NOTE: reproduce with: ant test  -
> Dtestcase=TestFilesystemResourceLoader -Dtests.method=testBaseDir -
> Dtests.seed=AD5802E6257518AC -Dtests.multiplier=3 -Dtests.slow=true -
> Dtests.locale=ga_IE -Dtests.timezone=America/Cayenne -
> Dtests.file.encoding=ISO-8859-1
> [junit4:junit4]   2>
> [junit4:junit4]    > (@AfterClass output)
> [junit4:junit4]   2> NOTE: test params are: codec=SimpleText,
> sim=DefaultSimilarity, locale=ga_IE, timezone=America/Cayenne
> [junit4:junit4]   2> NOTE: Linux 3.2.0-26-generic amd64/Oracle Corporation
> 1.7.0_05 (64-bit)/cpus=8,threads=1,free=115682024,total=131072000
> [junit4:junit4]   2> NOTE: All tests run in this JVM:
> [TestCapitalizationFilterFactory, TestReverseStringFilter,
> TestTurkishLowerCaseFilterFactory, TestFilesystemResourceLoader]
> [junit4:junit4]   2>
> [junit4:junit4] Completed on J1 in 0.10s, 2 tests, 1 error <<< FAILURES!
> 
> [...truncated 619 lines...]
> BUILD FAILED
> /mnt/ssd/jenkins/workspace/Lucene-Solr-trunk-Linux-Java7-
> 64/checkout/build.xml:29: The following error occurred while executing this
> line:
> /mnt/ssd/jenkins/workspace/Lucene-Solr-trunk-Linux-Java7-
> 64/checkout/lucene/build.xml:503: The following error occurred while
> executing this line:
> /mnt/ssd/jenkins/workspace/Lucene-Solr-trunk-Linux-Java7-
> 64/checkout/lucene/common-build.xml:1497: The following error occurred
> while executing this line:
> /mnt/ssd/jenkins/workspace/Lucene-Solr-trunk-Linux-Java7-
> 64/checkout/lucene/analysis/build.xml:101: The following error occurred while
> executing this line:
> /mnt/ssd/jenkins/workspace/Lucene-Solr-trunk-Linux-Java7-
> 64/checkout/lucene/analysis/build.xml:38: The following error occurred while
> executing this line:
> /mnt/ssd/jenkins/workspace/Lucene-Solr-trunk-Linux-Java7-
> 64/checkout/lucene/module-build.xml:62: The following error occurred while
> executing this line:
> /mnt/ssd/jenkins/workspace/Lucene-Solr-trunk-Linux-Java7-
> 64/checkout/lucene/common-build.xml:1095: The following error occurred
> while executing this line:
> /mnt/ssd/jenkins/workspace/Lucene-Solr-trunk-Linux-Java7-
> 64/checkout/lucene/common-build.xml:790: There were test failures: 210
> suites, 1062 tests, 1 error, 1 ignored
> 
> Total time: 7 minutes 43 seconds
> Build step 'Execute shell' marked build as failure Archiving artifacts Recording
> test results Email was triggered for: Failure Sending email for trigger: Failure
> 
> 



---------------------------------------------------------------------
To unsubscribe, e-mail: dev-unsubscribe@lucene.apache.org
For additional commands, e-mail: dev-help@lucene.apache.org


Mime
View raw message