lucene-dev mailing list archives

Site index · List index
Message view « Date » · « Thread »
Top « Date » · « Thread »
From "Uwe Schindler" <...@thetaphi.de>
Subject RE: [JENKINS] Lucene-Solr-trunk-Linux-Java8-64 - Build # 1 - Failure!
Date Sun, 01 Jul 2012 17:24:14 GMT
Hi all,

on my Jenkins box I installed the Java 8 preview (b45 from end of June). This time we found no hotpot bugs, and I can say, Lucene seems to work fine with Java 8.

Some Solr tests failed as always. One of them seems to rely on the order of HashSet/HashMap, which is a test bug.

The test run with LuSolr trunk, Java 8 will run once per day. Please look at the failing tests and fix those broken tests! I will do the same for 4.x, too.

Uwe

-----
Uwe Schindler
H.-H.-Meier-Allee 63, D-28213 Bremen
http://www.thetaphi.de
eMail: uwe@thetaphi.de


> -----Original Message-----
> From: Policeman Jenkins Server [mailto:jenkins@sd-datasolutions.de]
> Sent: Sunday, July 01, 2012 7:16 PM
> To: dev@lucene.apache.org
> Subject: [JENKINS] Lucene-Solr-trunk-Linux-Java8-64 - Build # 1 - Failure!
> 
> Build: http://jenkins.sd-datasolutions.de/job/Lucene-Solr-trunk-Linux-Java8-
> 64/1/
> 
> 3 tests failed.
> FAILED:
> org.apache.solr.handler.component.DistributedQueryElevationComponentTest.t
> estDistribSearch
> 
> Error Message:
> Index: 18, Size: 18
> 
> Stack Trace:
> java.lang.IndexOutOfBoundsException: Index: 18, Size: 18
> 	at
> __randomizedtesting.SeedInfo.seed([CE81EF7A000D6B19:4F67616277520B25]:
> 0)
> 	at java.util.ArrayList.rangeCheck(ArrayList.java:603)
> 	at java.util.ArrayList.get(ArrayList.java:381)
> 	at
> org.apache.solr.common.util.NamedList.getName(NamedList.java:127)
> 	at
> org.apache.solr.BaseDistributedSearchTestCase.compare(BaseDistributedSearc
> hTestCase.java:467)
> 	at
> org.apache.solr.BaseDistributedSearchTestCase.compare(BaseDistributedSearc
> hTestCase.java:613)
> 	at
> org.apache.solr.BaseDistributedSearchTestCase.compare(BaseDistributedSearc
> hTestCase.java:501)
> 	at
> org.apache.solr.BaseDistributedSearchTestCase.compare(BaseDistributedSearc
> hTestCase.java:613)
> 	at
> org.apache.solr.BaseDistributedSearchTestCase.compare(BaseDistributedSearc
> hTestCase.java:501)
> 	at
> org.apache.solr.BaseDistributedSearchTestCase.compareResponses(BaseDistrib
> utedSearchTestCase.java:668)
> 	at
> org.apache.solr.BaseDistributedSearchTestCase.query(BaseDistributedSearchTe
> stCase.java:393)
> 	at
> org.apache.solr.handler.component.DistributedQueryElevationComponentTest.
> doTest(DistributedQueryElevationComponentTest.java:81)
> 	at
> org.apache.solr.BaseDistributedSearchTestCase.testDistribSearch(BaseDistribut
> edSearchTestCase.java:680)
> 	at sun.reflect.NativeMethodAccessorImpl.invoke0(Native Method)
> 	at
> sun.reflect.NativeMethodAccessorImpl.invoke(NativeMethodAccessorImpl.java:
> 57)
> 	at
> sun.reflect.DelegatingMethodAccessorImpl.invoke(DelegatingMethodAccessorI
> mpl.java:43)
> 	at java.lang.reflect.Method.invoke(Method.java:474)
> 	at
> com.carrotsearch.randomizedtesting.RandomizedRunner.invoke(RandomizedRu
> nner.java:1969)
> 	at
> com.carrotsearch.randomizedtesting.RandomizedRunner.access$1100(Random
> izedRunner.java:132)
> 	at
> com.carrotsearch.randomizedtesting.RandomizedRunner$6.evaluate(Randomiz
> edRunner.java:814)
> 	at
> com.carrotsearch.randomizedtesting.RandomizedRunner$7.evaluate(Randomiz
> edRunner.java:875)
> 	at
> com.carrotsearch.randomizedtesting.RandomizedRunner$8.evaluate(Randomiz
> edRunner.java:889)
> 	at
> com.carrotsearch.randomizedtesting.rules.SystemPropertiesRestoreRule$1.eval
> uate(SystemPropertiesRestoreRule.java:53)
> 	at
> org.apache.lucene.util.TestRuleSetupTeardownChained$1.evaluate(TestRuleSet
> upTeardownChained.java:50)
> 	at
> org.apache.lucene.util.TestRuleFieldCacheSanity$1.evaluate(TestRuleFieldCach
> eSanity.java:32)
> 	at
> org.apache.lucene.util.AbstractBeforeAfterRule$1.evaluate(AbstractBeforeAfte
> rRule.java:45)
> 	at
> com.carrotsearch.randomizedtesting.rules.SystemPropertiesInvariantRule$1.ev
> aluate(SystemPropertiesInvariantRule.java:55)
> 	at
> org.apache.lucene.util.TestRuleReportUncaughtExceptions$1.evaluate(TestRule
> ReportUncaughtExceptions.java:68)
> 	at
> org.apache.lucene.util.TestRuleThreadAndTestName$1.evaluate(TestRuleThrea
> dAndTestName.java:48)
> 	at
> org.apache.lucene.util.TestRuleIgnoreAfterMaxFailures$1.evaluate(TestRuleIgn
> oreAfterMaxFailures.java:70)
> 	at
> org.apache.lucene.util.TestRuleMarkFailure$1.evaluate(TestRuleMarkFailure.ja
> va:48)
> 	at
> com.carrotsearch.randomizedtesting.RandomizedRunner.runSingleTest(Rando
> mizedRunner.java:821)
> 	at
> com.carrotsearch.randomizedtesting.RandomizedRunner.access$700(Randomiz
> edRunner.java:132)
> 	at
> com.carrotsearch.randomizedtesting.RandomizedRunner$3$1.run(Randomized
> Runner.java:669)
> 	at
> com.carrotsearch.randomizedtesting.RandomizedRunner$3.evaluate(Randomiz
> edRunner.java:695)
> 	at
> com.carrotsearch.randomizedtesting.RandomizedRunner$4.evaluate(Randomiz
> edRunner.java:734)
> 	at
> com.carrotsearch.randomizedtesting.RandomizedRunner$5.evaluate(Randomiz
> edRunner.java:745)
> 	at
> com.carrotsearch.randomizedtesting.rules.SystemPropertiesRestoreRule$1.eval
> uate(SystemPropertiesRestoreRule.java:53)
> 	at
> org.apache.lucene.util.AbstractBeforeAfterRule$1.evaluate(AbstractBeforeAfte
> rRule.java:45)
> 	at
> org.apache.lucene.util.TestRuleReportUncaughtExceptions$1.evaluate(TestRule
> ReportUncaughtExceptions.java:68)
> 	at
> org.apache.lucene.util.TestRuleStoreClassName$1.evaluate(TestRuleStoreClass
> Name.java:38)
> 	at
> org.apache.lucene.util.TestRuleIcuHack$1.evaluate(TestRuleIcuHack.java:51)
> 	at
> com.carrotsearch.randomizedtesting.rules.SystemPropertiesInvariantRule$1.ev
> aluate(SystemPropertiesInvariantRule.java:55)
> 	at
> org.apache.lucene.util.TestRuleNoInstanceHooksOverrides$1.evaluate(TestRule
> NoInstanceHooksOverrides.java:53)
> 	at
> org.apache.lucene.util.TestRuleNoStaticHooksShadowing$1.evaluate(TestRuleN
> oStaticHooksShadowing.java:52)
> 	at
> org.apache.lucene.util.TestRuleAssertionsRequired$1.evaluate(TestRuleAssertio
> nsRequired.java:36)
> 	at
> org.apache.lucene.util.TestRuleMarkFailure$1.evaluate(TestRuleMarkFailure.ja
> va:48)
> 	at
> org.apache.lucene.util.TestRuleIgnoreAfterMaxFailures$1.evaluate(TestRuleIgn
> oreAfterMaxFailures.java:70)
> 	at
> org.apache.lucene.util.TestRuleIgnoreTestSuites$1.evaluate(TestRuleIgnoreTest
> Suites.java:55)
> 	at
> com.carrotsearch.randomizedtesting.RandomizedRunner.runSuite(Randomized
> Runner.java:605)
> 	at
> com.carrotsearch.randomizedtesting.RandomizedRunner.access$400(Randomiz
> edRunner.java:132)
> 	at
> com.carrotsearch.randomizedtesting.RandomizedRunner$2.run(RandomizedRu
> nner.java:551)
> 
> 
> FAILED:
> org.apache.solr.handler.component.SpellCheckComponentTest.testPerDictionar
> y
> 
> Error Message:
> mismatch: '0'!='2' @ spellcheck/suggestions/bar/startOffset
> 
> Stack Trace:
> java.lang.RuntimeException: mismatch: '0'!='2' @
> spellcheck/suggestions/bar/startOffset
> 	at
> __randomizedtesting.SeedInfo.seed([CE81EF7A000D6B19:98F1BD208617E51]:0
> )
> 	at org.apache.solr.SolrTestCaseJ4.assertJQ(SolrTestCaseJ4.java:547)
> 	at org.apache.solr.SolrTestCaseJ4.assertJQ(SolrTestCaseJ4.java:495)
> 	at
> org.apache.solr.handler.component.SpellCheckComponentTest.testPerDictionar
> y(SpellCheckComponentTest.java:102)
> 	at sun.reflect.NativeMethodAccessorImpl.invoke0(Native Method)
> 	at
> sun.reflect.NativeMethodAccessorImpl.invoke(NativeMethodAccessorImpl.java:
> 57)
> 	at
> sun.reflect.DelegatingMethodAccessorImpl.invoke(DelegatingMethodAccessorI
> mpl.java:43)
> 	at java.lang.reflect.Method.invoke(Method.java:474)
> 	at
> com.carrotsearch.randomizedtesting.RandomizedRunner.invoke(RandomizedRu
> nner.java:1969)
> 	at
> com.carrotsearch.randomizedtesting.RandomizedRunner.access$1100(Random
> izedRunner.java:132)
> 	at
> com.carrotsearch.randomizedtesting.RandomizedRunner$6.evaluate(Randomiz
> edRunner.java:814)
> 	at
> com.carrotsearch.randomizedtesting.RandomizedRunner$7.evaluate(Randomiz
> edRunner.java:875)
> 	at
> com.carrotsearch.randomizedtesting.RandomizedRunner$8.evaluate(Randomiz
> edRunner.java:889)
> 	at
> com.carrotsearch.randomizedtesting.rules.SystemPropertiesRestoreRule$1.eval
> uate(SystemPropertiesRestoreRule.java:53)
> 	at
> org.apache.lucene.util.TestRuleSetupTeardownChained$1.evaluate(TestRuleSet
> upTeardownChained.java:50)
> 	at
> org.apache.lucene.util.TestRuleFieldCacheSanity$1.evaluate(TestRuleFieldCach
> eSanity.java:32)
> 	at
> org.apache.lucene.util.AbstractBeforeAfterRule$1.evaluate(AbstractBeforeAfte
> rRule.java:45)
> 	at
> com.carrotsearch.randomizedtesting.rules.SystemPropertiesInvariantRule$1.ev
> aluate(SystemPropertiesInvariantRule.java:55)
> 	at
> org.apache.lucene.util.TestRuleReportUncaughtExceptions$1.evaluate(TestRule
> ReportUncaughtExceptions.java:68)
> 	at
> org.apache.lucene.util.TestRuleThreadAndTestName$1.evaluate(TestRuleThrea
> dAndTestName.java:48)
> 	at
> org.apache.lucene.util.TestRuleIgnoreAfterMaxFailures$1.evaluate(TestRuleIgn
> oreAfterMaxFailures.java:70)
> 	at
> org.apache.lucene.util.TestRuleMarkFailure$1.evaluate(TestRuleMarkFailure.ja
> va:48)
> 	at
> com.carrotsearch.randomizedtesting.RandomizedRunner.runSingleTest(Rando
> mizedRunner.java:821)
> 	at
> com.carrotsearch.randomizedtesting.RandomizedRunner.access$700(Randomiz
> edRunner.java:132)
> 	at
> com.carrotsearch.randomizedtesting.RandomizedRunner$3$1.run(Randomized
> Runner.java:669)
> 	at
> com.carrotsearch.randomizedtesting.RandomizedRunner$3.evaluate(Randomiz
> edRunner.java:695)
> 	at
> com.carrotsearch.randomizedtesting.RandomizedRunner$4.evaluate(Randomiz
> edRunner.java:734)
> 	at
> com.carrotsearch.randomizedtesting.RandomizedRunner$5.evaluate(Randomiz
> edRunner.java:745)
> 	at
> com.carrotsearch.randomizedtesting.rules.SystemPropertiesRestoreRule$1.eval
> uate(SystemPropertiesRestoreRule.java:53)
> 	at
> org.apache.lucene.util.AbstractBeforeAfterRule$1.evaluate(AbstractBeforeAfte
> rRule.java:45)
> 	at
> org.apache.lucene.util.TestRuleReportUncaughtExceptions$1.evaluate(TestRule
> ReportUncaughtExceptions.java:68)
> 	at
> org.apache.lucene.util.TestRuleStoreClassName$1.evaluate(TestRuleStoreClass
> Name.java:38)
> 	at
> org.apache.lucene.util.TestRuleIcuHack$1.evaluate(TestRuleIcuHack.java:51)
> 	at
> com.carrotsearch.randomizedtesting.rules.SystemPropertiesInvariantRule$1.ev
> aluate(SystemPropertiesInvariantRule.java:55)
> 	at
> org.apache.lucene.util.TestRuleNoInstanceHooksOverrides$1.evaluate(TestRule
> NoInstanceHooksOverrides.java:53)
> 	at
> org.apache.lucene.util.TestRuleNoStaticHooksShadowing$1.evaluate(TestRuleN
> oStaticHooksShadowing.java:52)
> 	at
> org.apache.lucene.util.TestRuleAssertionsRequired$1.evaluate(TestRuleAssertio
> nsRequired.java:36)
> 	at
> org.apache.lucene.util.TestRuleMarkFailure$1.evaluate(TestRuleMarkFailure.ja
> va:48)
> 	at
> org.apache.lucene.util.TestRuleIgnoreAfterMaxFailures$1.evaluate(TestRuleIgn
> oreAfterMaxFailures.java:70)
> 	at
> org.apache.lucene.util.TestRuleIgnoreTestSuites$1.evaluate(TestRuleIgnoreTest
> Suites.java:55)
> 	at
> com.carrotsearch.randomizedtesting.RandomizedRunner.runSuite(Randomized
> Runner.java:605)
> 	at
> com.carrotsearch.randomizedtesting.RandomizedRunner.access$400(Randomiz
> edRunner.java:132)
> 	at
> com.carrotsearch.randomizedtesting.RandomizedRunner$2.run(RandomizedRu
> nner.java:551)
> 
> 
> FAILED:  org.apache.solr.schema.PreAnalyzedFieldTest.testParsers
> 
> Error Message:
> expected:<{"[v":"1","str":"test
> ąćęłńóśźż","tokens":[{"e":128,"i":22,"p":"DQ4KDQsODg8=","s":123,"t":"one","y":
> "word"},{"e":8,"i":1,"s":5,"t":"two","y":"word"},{"e":22,"i":1,"s":20,"t":"three","y":
> "foobar"}]]}> but was:<{"[str":"test
> ąćęłńóśźż","tokens":[{"e":128,"i":22,"p":"DQ4KDQsODg8=","s":123,"t":"one","y":
> "word"},{"e":8,"i":1,"s":5,"t":"two","y":"word"},{"e":22,"i":1,"s":20,"t":"three","y":
> "foobar"}],"v":"1"]}>
> 
> Stack Trace:
> junit.framework.ComparisonFailure: expected:<{"[v":"1","str":"test
> ąćęłńóśźż","tokens":[{"e":128,"i":22,"p":"DQ4KDQsODg8=","s":123,"t":"one","y":
> "word"},{"e":8,"i":1,"s":5,"t":"two","y":"word"},{"e":22,"i":1,"s":20,"t":"three","y":
> "foobar"}]]}> but was:<{"[str":"test
> ąćęłńóśźż","tokens":[{"e":128,"i":22,"p":"DQ4KDQsODg8=","s":123,"t":"one","y":
> "word"},{"e":8,"i":1,"s":5,"t":"two","y":"word"},{"e":22,"i":1,"s":20,"t":"three","y":
> "foobar"}],"v":"1"]}>
> 	at junit.framework.Assert.assertEquals(Assert.java:85)
> 	at junit.framework.Assert.assertEquals(Assert.java:91)
> 	at
> org.apache.solr.schema.PreAnalyzedFieldTest.testParsers(PreAnalyzedFieldTest
> .java:145)
> 	at sun.reflect.NativeMethodAccessorImpl.invoke0(Native Method)
> 	at
> sun.reflect.NativeMethodAccessorImpl.invoke(NativeMethodAccessorImpl.java:
> 57)
> 	at
> sun.reflect.DelegatingMethodAccessorImpl.invoke(DelegatingMethodAccessorI
> mpl.java:43)
> 	at java.lang.reflect.Method.invoke(Method.java:474)
> 	at junit.framework.TestCase.runTest(TestCase.java:168)
> 	at junit.framework.TestCase.runBare(TestCase.java:134)
> 	at junit.framework.TestResult$1.protect(TestResult.java:110)
> 	at junit.framework.TestResult.runProtected(TestResult.java:128)
> 	at junit.framework.TestResult.run(TestResult.java:113)
> 	at junit.framework.TestCase.run(TestCase.java:124)
> 	at junit.framework.TestSuite.runTest(TestSuite.java:243)
> 	at junit.framework.TestSuite.run(TestSuite.java:238)
> 	at
> org.junit.internal.runners.JUnit38ClassRunner.run(JUnit38ClassRunner.java:83)
> 	at
> com.carrotsearch.ant.tasks.junit4.slave.SlaveMain.execute(SlaveMain.java:145)
> 	at
> com.carrotsearch.ant.tasks.junit4.slave.SlaveMain.main(SlaveMain.java:238)
> 	at
> com.carrotsearch.ant.tasks.junit4.slave.SlaveMainSafe.main(SlaveMainSafe.jav
> a:12)
> 
> 
> 
> 
> Build Log:
> [...truncated 14195 lines...]
>    [junit4] Suite: org.apache.solr.handler.component.SpellCheckComponentTest
>    [junit4]    > (@BeforeClass output)
>    [junit4]   2> 0 T128 oas.SolrTestCaseJ4.initCore ####initCore
>    [junit4]   2> Creating dataDir: /mnt/ssd/jenkins/workspace/Lucene-Solr-trunk-
> Linux-Java8-64/checkout/solr/build/solr-core/test/J1/./solrtest-
> SpellCheckComponentTest-1341162644177
>    [junit4]   2> 0 T128 oasc.SolrResourceLoader.<init> new SolrResourceLoader
> for directory: '/mnt/ssd/jenkins/workspace/Lucene-Solr-trunk-Linux-Java8-
> 64/checkout/solr/build/solr-core/test-files/solr/collection1/'
>    [junit4]   2> 1 T128 oasc.SolrResourceLoader.replaceClassLoader Adding
> 'file:/mnt/ssd/jenkins/workspace/Lucene-Solr-trunk-Linux-Java8-
> 64/checkout/solr/build/solr-core/test-files/solr/collection1/lib/classes/' to
> classloader
>    [junit4]   2> 1 T128 oasc.SolrResourceLoader.replaceClassLoader Adding
> 'file:/mnt/ssd/jenkins/workspace/Lucene-Solr-trunk-Linux-Java8-
> 64/checkout/solr/build/solr-core/test-files/solr/collection1/lib/README' to
> classloader
>    [junit4]   2> 18 T128 oasc.SolrConfig.<init> Using Lucene MatchVersion:
> LUCENE_50
>    [junit4]   2> 47 T128 oasc.SolrConfig.<init> Loaded SolrConfig: solrconfig-
> spellcheckcomponent.xml
>    [junit4]   2> 47 T128 oass.IndexSchema.readSchema Reading Solr Schema
>    [junit4]   2> 51 T128 oass.IndexSchema.readSchema Schema name=test
>    [junit4]   2> 419 T128 oass.OpenExchangeRatesOrgProvider.init Initialized
> with rates=open-exchange-rates.json, refreshInterval=1440.
>    [junit4]   2> 426 T128 oass.IndexSchema.readSchema default search field in
> schema is text
>    [junit4]   2> 429 T128 oass.IndexSchema.readSchema unique key field: id
>    [junit4]   2> 437 T128 oass.FileExchangeRateProvider.reload Reloading
> exchange rates from file currency.xml
>    [junit4]   2> 440 T128 oass.FileExchangeRateProvider.reload Reloading
> exchange rates from file currency.xml
>    [junit4]   2> 443 T128 oass.OpenExchangeRatesOrgProvider.reload Reloading
> exchange rates from open-exchange-rates.json
>    [junit4]   2> 444 T128 oass.OpenExchangeRatesOrgProvider.reload Reloading
> exchange rates from open-exchange-rates.json
>    [junit4]   2> 445 T128 oasc.SolrResourceLoader.locateSolrHome JNDI not
> configured for solr (NoInitialContextEx)
>    [junit4]   2> 445 T128 oasc.SolrResourceLoader.locateSolrHome using system
> property solr.solr.home: /mnt/ssd/jenkins/workspace/Lucene-Solr-trunk-Linux-
> Java8-64/checkout/solr/build/solr-core/test-files/solr
>    [junit4]   2> 445 T128 oasc.SolrResourceLoader.<init> new
> SolrResourceLoader for directory: '/mnt/ssd/jenkins/workspace/Lucene-Solr-
> trunk-Linux-Java8-64/checkout/solr/build/solr-core/test-files/solr/'
>    [junit4]   2> 446 T128 oasc.CoreContainer.<init> New CoreContainer
> 577261384
>    [junit4]   2> 446 T128 oasc.SolrCore.<init> [collection1] Opening new
> SolrCore at /mnt/ssd/jenkins/workspace/Lucene-Solr-trunk-Linux-Java8-
> 64/checkout/solr/build/solr-core/test-files/solr/collection1/,
> dataDir=/mnt/ssd/jenkins/workspace/Lucene-Solr-trunk-Linux-Java8-
> 64/checkout/solr/build/solr-core/test/J1/./solrtest-SpellCheckComponentTest-
> 1341162644177/
>    [junit4]   2> 446 T128 oasc.SolrCore.<init> JMX monitoring not detected for
> core: collection1
>    [junit4]   2> 446 T128 oasc.SolrCore.getNewIndexDir WARNING New index
> directory detected: old=null new=/mnt/ssd/jenkins/workspace/Lucene-Solr-
> trunk-Linux-Java8-64/checkout/solr/build/solr-core/test/J1/./solrtest-
> SpellCheckComponentTest-1341162644177/index/
>    [junit4]   2> 447 T128 oasc.SolrCore.initIndex WARNING [collection1] Solr
> index directory '/mnt/ssd/jenkins/workspace/Lucene-Solr-trunk-Linux-Java8-
> 64/checkout/solr/build/solr-core/test/J1/./solrtest-SpellCheckComponentTest-
> 1341162644177/index' doesn't exist. Creating new index...
>    [junit4]   2> 451 T128 oasc.SolrDeletionPolicy.onCommit
> SolrDeletionPolicy.onCommit: commits:num=1
>    [junit4]   2>
> 	commit{dir=MockDirWrapper(org.apache.lucene.store.MMapDirectory
> @/mnt/ssd/jenkins/workspace/Lucene-Solr-trunk-Linux-Java8-
> 64/checkout/solr/build/solr-core/test/J1/index6511165112tmp
> lockFactory=org.apache.lucene.store.NativeFSLockFactory@6272f16),segFN=se
> gments_1,generation=1,filenames=[segments_1]
>    [junit4]   2> 451 T128 oasc.SolrDeletionPolicy.updateCommits newest commit
> = 1
>    [junit4]   2> 452 T128 oasc.RequestHandlers.initHandlersFromConfig created
> standard: solr.StandardRequestHandler
>    [junit4]   2> 452 T128 oasc.RequestHandlers.initHandlersFromConfig created
> spellCheckCompRH: org.apache.solr.handler.component.SearchHandler
>    [junit4]   2> 453 T128 oasc.RequestHandlers.initHandlersFromConfig created
> spellCheckCompRH1: org.apache.solr.handler.component.SearchHandler
>    [junit4]   2> 453 T128 oasc.RequestHandlers.initHandlersFromConfig created
> spellCheckWithWordbreak: org.apache.solr.handler.component.SearchHandler
>    [junit4]   2> 477 T128 oass.SolrIndexSearcher.<init> Opening
> Searcher@519b1696 main
>    [junit4]   2> 477 T128 oass.SolrIndexSearcher.<init> WARNING WARNING:
> Directory impl does not support setting indexDir:
> org.apache.lucene.store.MockDirectoryWrapper
>    [junit4]   2> 477 T128 oasu.CommitTracker.<init> Hard AutoCommit: disabled
>    [junit4]   2> 478 T128 oasu.CommitTracker.<init> Soft AutoCommit: disabled
>    [junit4]   2> 478 T128 oashc.SpellCheckComponent.inform Initializing spell
> checkers
>    [junit4]   2> 491 T128 oashc.SpellCheckComponent.inform Registering
> newSearcher listener for spellchecker: default
>    [junit4]   2> 500 T128 oashc.SpellCheckComponent.inform Registering
> newSearcher listener for spellchecker: default_teststop
>    [junit4]   2> 503 T128 oass.DirectSolrSpellChecker.init init:
> {name=direct,classname=solr.DirectSolrSpellChecker,minQueryLength=3,maxQ
> ueryFrequency=100.0,field=teststop}
>    [junit4]   2> 504 T128 oass.DirectSolrSpellChecker.init init:
> {name=direct_lowerfilt,classname=solr.DirectSolrSpellChecker,minQueryLengt
> h=3,maxQueryFrequency=100.0,field=lowerfilt}
>    [junit4]   2> 509 T128 oashc.SpellCheckComponent.inform Registering
> newSearcher listener for spellchecker: threshold
>    [junit4]   2> 509 T128 oass.DirectSolrSpellChecker.init init:
> {name=threshold_direct,classname=solr.DirectSolrSpellChecker,field=lowerfilt,
> spellcheckIndexDir=spellcheckerThreshold,buildOnCommit=true,thresholdToke
> nFrequency=0.29}
>    [junit4]   2> 510 T128 oashc.SpellCheckComponent.inform Registering
> newSearcher listener for spellchecker: threshold_direct
>    [junit4]   2> 514 T128 oashc.SpellCheckComponent.inform Registering
> newSearcher listener for spellchecker: multipleFields
>    [junit4]   2> 533 T128 oashc.SpellCheckComponent.inform Registering
> newSearcher listener for spellchecker: freq
>    [junit4]   2> 538 T128 oashc.SpellCheckComponent.inform Registering
> newSearcher listener for spellchecker: fqcn
>    [junit4]   2> 539 T128 oashc.HttpShardHandlerFactory.getParameter Setting
> socketTimeout to: 0
>    [junit4]   2> 539 T128 oashc.HttpShardHandlerFactory.getParameter Setting
> urlScheme to: http://
>    [junit4]   2> 539 T128 oashc.HttpShardHandlerFactory.getParameter Setting
> connTimeout to: 0
>    [junit4]   2> 539 T128 oashc.HttpShardHandlerFactory.getParameter Setting
> maxConnectionsPerHost to: 20
>    [junit4]   2> 539 T128 oashc.HttpShardHandlerFactory.getParameter Setting
> corePoolSize to: 0
>    [junit4]   2> 540 T128 oashc.HttpShardHandlerFactory.getParameter Setting
> maximumPoolSize to: 2147483647
>    [junit4]   2> 540 T128 oashc.HttpShardHandlerFactory.getParameter Setting
> maxThreadIdleTime to: 5
>    [junit4]   2> 540 T128 oashc.HttpShardHandlerFactory.getParameter Setting
> sizeOfQueue to: -1
>    [junit4]   2> 540 T128 oashc.HttpShardHandlerFactory.getParameter Setting
> fairnessPolicy to: false
>    [junit4]   2> 540 T128 oascsi.HttpClientUtil.createClient Creating new http
> client,
> config:maxConnectionsPerHost=20&maxConnections=10000&socketTimeout=0
> &connTimeout=0&retry=false
>    [junit4]   2> 542 T129 oasc.SolrCore.registerSearcher [collection1] Registered
> new searcher Searcher@519b1696
> main{StandardDirectoryReader(segments_1:1)}
>    [junit4]   2> 542 T128 oasc.CoreContainer.register registering core:
> collection1
>    [junit4]   2> 543 T128 oas.SolrTestCaseJ4.initCore ####initCore end
>    [junit4]   2>
>    [junit4] ERROR   0.72s J1 | SpellCheckComponentTest.testPerDictionary
>    [junit4]    > Throwable #1: java.lang.RuntimeException: mismatch: '0'!='2' @
> spellcheck/suggestions/bar/startOffset
>    [junit4]    > 	at
> __randomizedtesting.SeedInfo.seed([CE81EF7A000D6B19:98F1BD208617E51]:0
> )
>    [junit4]    > 	at
> org.apache.solr.SolrTestCaseJ4.assertJQ(SolrTestCaseJ4.java:547)
>    [junit4]    > 	at
> org.apache.solr.SolrTestCaseJ4.assertJQ(SolrTestCaseJ4.java:495)
>    [junit4]    > 	at
> org.apache.solr.handler.component.SpellCheckComponentTest.testPerDictionar
> y(SpellCheckComponentTest.java:102)
>    [junit4]    > 	at sun.reflect.NativeMethodAccessorImpl.invoke0(Native
> Method)
>    [junit4]    > 	at
> sun.reflect.NativeMethodAccessorImpl.invoke(NativeMethodAccessorImpl.java:
> 57)
>    [junit4]    > 	at
> sun.reflect.DelegatingMethodAccessorImpl.invoke(DelegatingMethodAccessorI
> mpl.java:43)
>    [junit4]    > 	at java.lang.reflect.Method.invoke(Method.java:474)
>    [junit4]    > 	at
> com.carrotsearch.randomizedtesting.RandomizedRunner.invoke(RandomizedRu
> nner.java:1969)
>    [junit4]    > 	at
> com.carrotsearch.randomizedtesting.RandomizedRunner.access$1100(Random
> izedRunner.java:132)
>    [junit4]    > 	at
> com.carrotsearch.randomizedtesting.RandomizedRunner$6.evaluate(Randomiz
> edRunner.java:814)
>    [junit4]    > 	at
> com.carrotsearch.randomizedtesting.RandomizedRunner$7.evaluate(Randomiz
> edRunner.java:875)
>    [junit4]    > 	at
> com.carrotsearch.randomizedtesting.RandomizedRunner$8.evaluate(Randomiz
> edRunner.java:889)
>    [junit4]    > 	at
> com.carrotsearch.randomizedtesting.rules.SystemPropertiesRestoreRule$1.eval
> uate(SystemPropertiesRestoreRule.java:53)
>    [junit4]    > 	at
> org.apache.lucene.util.TestRuleSetupTeardownChained$1.evaluate(TestRuleSet
> upTeardownChained.java:50)
>    [junit4]    > 	at
> org.apache.lucene.util.TestRuleFieldCacheSanity$1.evaluate(TestRuleFieldCach
> eSanity.java:32)
>    [junit4]    > 	at
> org.apache.lucene.util.AbstractBeforeAfterRule$1.evaluate(AbstractBeforeAfte
> rRule.java:45)
>    [junit4]    > 	at
> com.carrotsearch.randomizedtesting.rules.SystemPropertiesInvariantRule$1.ev
> aluate(SystemPropertiesInvariantRule.java:55)
>    [junit4]    > 	at
> org.apache.lucene.util.TestRuleReportUncaughtExceptions$1.evaluate(TestRule
> ReportUncaughtExceptions.java:68)
>    [junit4]    > 	at
> org.apache.lucene.util.TestRuleThreadAndTestName$1.evaluate(TestRuleThrea
> dAndTestName.java:48)
>    [junit4]    > 	at
> org.apache.lucene.util.TestRuleIgnoreAfterMaxFailures$1.evaluate(TestRuleIgn
> oreAfterMaxFailures.java:70)
>    [junit4]    > 	at
> org.apache.lucene.util.TestRuleMarkFailure$1.evaluate(TestRuleMarkFailure.ja
> va:48)
>    [junit4]    > 	at
> com.carrotsearch.randomizedtesting.RandomizedRunner.runSingleTest(Rando
> mizedRunner.java:821)
>    [junit4]    > 	at
> com.carrotsearch.randomizedtesting.RandomizedRunner.access$700(Randomiz
> edRunner.java:132)
>    [junit4]    > 	at
> com.carrotsearch.randomizedtesting.RandomizedRunner$3$1.run(Randomized
> Runner.java:669)
>    [junit4]    > 	at
> com.carrotsearch.randomizedtesting.RandomizedRunner$3.evaluate(Randomiz
> edRunner.java:695)
>    [junit4]    > 	at
> com.carrotsearch.randomizedtesting.RandomizedRunner$4.evaluate(Randomiz
> edRunner.java:734)
>    [junit4]    > 	at
> com.carrotsearch.randomizedtesting.RandomizedRunner$5.evaluate(Randomiz
> edRunner.java:745)
>    [junit4]    > 	at
> com.carrotsearch.randomizedtesting.rules.SystemPropertiesRestoreRule$1.eval
> uate(SystemPropertiesRestoreRule.java:53)
>    [junit4]    > 	at
> org.apache.lucene.util.AbstractBeforeAfterRule$1.evaluate(AbstractBeforeAfte
> rRule.java:45)
>    [junit4]    > 	at
> org.apache.lucene.util.TestRuleReportUncaughtExceptions$1.evaluate(TestRule
> ReportUncaughtExceptions.java:68)
>    [junit4]    > 	at
> org.apache.lucene.util.TestRuleStoreClassName$1.evaluate(TestRuleStoreClass
> Name.java:38)
>    [junit4]    > 	at
> org.apache.lucene.util.TestRuleIcuHack$1.evaluate(TestRuleIcuHack.java:51)
>    [junit4]    > 	at
> com.carrotsearch.randomizedtesting.rules.SystemPropertiesInvariantRule$1.ev
> aluate(SystemPropertiesInvariantRule.java:55)
>    [junit4]    > 	at
> org.apache.lucene.util.TestRuleNoInstanceHooksOverrides$1.evaluate(TestRule
> NoInstanceHooksOverrides.java:53)
>    [junit4]    > 	at
> org.apache.lucene.util.TestRuleNoStaticHooksShadowing$1.evaluate(TestRuleN
> oStaticHooksShadowing.java:52)
>    [junit4]    > 	at
> org.apache.lucene.util.TestRuleAssertionsRequired$1.evaluate(TestRuleAssertio
> nsRequired.java:36)
>    [junit4]    > 	at
> org.apache.lucene.util.TestRuleMarkFailure$1.evaluate(TestRuleMarkFailure.ja
> va:48)
>    [junit4]    > 	at
> org.apache.lucene.util.TestRuleIgnoreAfterMaxFailures$1.evaluate(TestRuleIgn
> oreAfterMaxFailures.java:70)
>    [junit4]    > 	at
> org.apache.lucene.util.TestRuleIgnoreTestSuites$1.evaluate(TestRuleIgnoreTest
> Suites.java:55)
>    [junit4]    > 	at
> com.carrotsearch.randomizedtesting.RandomizedRunner.runSuite(Randomized
> Runner.java:605)
>    [junit4]    > 	at
> com.carrotsearch.randomizedtesting.RandomizedRunner.access$400(Randomiz
> edRunner.java:132)
>    [junit4]    > 	at
> com.carrotsearch.randomizedtesting.RandomizedRunner$2.run(RandomizedRu
> nner.java:551)
>    [junit4]    >
>    [junit4]   2> 547 T128 oas.SolrTestCaseJ4.setUp ###Starting testPerDictionary
>    [junit4]   2> ASYNC  NEW_CORE C10 name=collection1
> org.apache.solr.core.SolrCore@3abbafc7
>    [junit4]   2> 553 T128 C10 oasc.SolrDeletionPolicy.onInit
> SolrDeletionPolicy.onInit: commits:num=1
>    [junit4]   2>
> 	commit{dir=MockDirWrapper(org.apache.lucene.store.MMapDirectory
> @/mnt/ssd/jenkins/workspace/Lucene-Solr-trunk-Linux-Java8-
> 64/checkout/solr/build/solr-core/test/J1/index6511165112tmp
> lockFactory=org.apache.lucene.store.NativeFSLockFactory@6272f16),segFN=se
> gments_1,generation=1,filenames=[segments_1]
>    [junit4]   2> 553 T128 C10 oasc.SolrDeletionPolicy.updateCommits newest
> commit = 1
>    [junit4]   2> 555 T128 C10 UPDATE [collection1] webapp=null path=null
> params={} {add=[0]} 0 5
>    [junit4]   2> 563 T128 C10 UPDATE [collection1] webapp=null path=null
> params={} {add=[1]} 0 1
>    [junit4]   2> 570 T128 C10 UPDATE [collection1] webapp=null path=null
> params={} {add=[2]} 0 2
>    [junit4]   2> 577 T128 C10 UPDATE [collection1] webapp=null path=null
> params={} {add=[3]} 0 2
>    [junit4]   2> 583 T128 C10 UPDATE [collection1] webapp=null path=null
> params={} {add=[4]} 0 1
>    [junit4]   2> 589 T128 C10 UPDATE [collection1] webapp=null path=null
> params={} {add=[5]} 0 2
>    [junit4]   2> 595 T128 C10 UPDATE [collection1] webapp=null path=null
> params={} {add=[6]} 0 2
>    [junit4]   2> 602 T128 C10 UPDATE [collection1] webapp=null path=null
> params={} {add=[7]} 0 2
>    [junit4]   2> 608 T128 C10 UPDATE [collection1] webapp=null path=null
> params={} {add=[8]} 0 1
>    [junit4]   2> 614 T128 C10 UPDATE [collection1] webapp=null path=null
> params={} {add=[9]} 0 1
>    [junit4]   2> 619 T128 C10 oasu.DirectUpdateHandler2.commit start
> commit{flags=0,version=0,optimize=false,openSearcher=true,waitSearcher=tru
> e,expungeDeletes=false,softCommit=false}
>    [junit4]   2> 630 T128 C10 oasc.SolrDeletionPolicy.onCommit
> SolrDeletionPolicy.onCommit: commits:num=2
>    [junit4]   2>
> 	commit{dir=MockDirWrapper(org.apache.lucene.store.MMapDirectory
> @/mnt/ssd/jenkins/workspace/Lucene-Solr-trunk-Linux-Java8-
> 64/checkout/solr/build/solr-core/test/J1/index6511165112tmp
> lockFactory=org.apache.lucene.store.NativeFSLockFactory@6272f16),segFN=se
> gments_1,generation=1,filenames=[segments_1]
>    [junit4]   2>
> 	commit{dir=MockDirWrapper(org.apache.lucene.store.MMapDirectory
> @/mnt/ssd/jenkins/workspace/Lucene-Solr-trunk-Linux-Java8-
> 64/checkout/solr/build/solr-core/test/J1/index6511165112tmp
> lockFactory=org.apache.lucene.store.NativeFSLockFactory@6272f16),segFN=se
> gments_2,generation=2,filenames=[segments_2, _0_Lucene40_0.prx,
> _0_Lucene40_0.frq, _0_nrm.cfs, _0.fdx, _0_Lucene40_0.tim, _0.si, _0.fnm,
> _0.fdt, _0_Lucene40_0.tip, _0_nrm.cfe]
>    [junit4]   2> 630 T128 C10 oasc.SolrDeletionPolicy.updateCommits newest
> commit = 2
>    [junit4]   2> 636 T128 C10 oass.SolrIndexSearcher.<init> Opening
> Searcher@39d39f3b main
>    [junit4]   2> 636 T128 C10 oass.SolrIndexSearcher.<init> WARNING WARNING:
> Directory impl does not support setting indexDir:
> org.apache.lucene.store.MockDirectoryWrapper
>    [junit4]   2> 637 T129
> oashc.SpellCheckComponent$SpellCheckerListener.buildSpellIndex Building
> spell index for spell checker: default
>    [junit4]   2> 637 T128 C10 oasu.DirectUpdateHandler2.commit
> end_commit_flush
>    [junit4]   2> 803 T129
> oashc.SpellCheckComponent$SpellCheckerListener.buildSpellIndex Building
> spell index for spell checker: default_teststop
>    [junit4]   2> 817 T129
> oashc.SpellCheckComponent$SpellCheckerListener.buildSpellIndex Building
> spell index for spell checker: threshold
>    [junit4]   2> 905 T129
> oashc.SpellCheckComponent$SpellCheckerListener.buildSpellIndex Building
> spell index for spell checker: threshold_direct
>    [junit4]   2> 905 T129
> oashc.SpellCheckComponent$SpellCheckerListener.buildSpellIndex Building
> spell index for spell checker: multipleFields
>    [junit4]   2> 978 T129
> oashc.SpellCheckComponent$SpellCheckerListener.buildSpellIndex Building
> spell index for spell checker: freq
>    [junit4]   2> 1029 T129
> oashc.SpellCheckComponent$SpellCheckerListener.buildSpellIndex Building
> spell index for spell checker: fqcn
>    [junit4]   2> 1101 T129 oasc.SolrCore.registerSearcher [collection1]
> Registered new searcher Searcher@39d39f3b
> main{StandardDirectoryReader(segments_2:3 _0(5.0):C10)}
>    [junit4]   2> 1102 T128 C10 UPDATE [collection1] webapp=null path=null
> params={} {commit=} 0 483
>    [junit4]   2> 1117 T128 C10 REQ [collection1] webapp=null path=null
> params={spellcheck.dictionary=perDict&json.nl=map&spellcheck=true&qt=spell
> CheckCompRH&spellcheck..perDict.foo=bar&spellcheck.build=true&spellcheck.
> .perDict.bar=foo&q=documemt} hits=0 status=0 QTime=13
>    [junit4]   2> 1122 T128 oas.SolrTestCaseJ4.assertJQ SEVERE query failed JSON
> validation. error=mismatch: '0'!='2' @ spellcheck/suggestions/bar/startOffset
>    [junit4]   2> 	 expected =/spellcheck/suggestions/bar=={"numFound":1,
> "startOffset":0, "endOffset":1, "suggestion":["foo"]}
>    [junit4]   2> 	 response = {
>    [junit4]   2> 	  "responseHeader":{
>    [junit4]   2> 	    "status":0,
>    [junit4]   2> 	    "QTime":13},
>    [junit4]   2> 	  "command":"build",
>    [junit4]   2> 	  "response":{"numFound":0,"start":0,"docs":[]
>    [junit4]   2> 	  },
>    [junit4]   2> 	  "spellcheck":{
>    [junit4]   2> 	    "suggestions":{
>    [junit4]   2> 	      "foo":{
>    [junit4]   2> 	        "numFound":1,
>    [junit4]   2> 	        "startOffset":0,
>    [junit4]   2> 	        "endOffset":1,
>    [junit4]   2> 	        "suggestion":["bar"]},
>    [junit4]   2> 	      "bar":{
>    [junit4]   2> 	        "numFound":1,
>    [junit4]   2> 	        "startOffset":2,
>    [junit4]   2> 	        "endOffset":3,
>    [junit4]   2> 	        "suggestion":["foo"]}}}}
>    [junit4]   2>
>    [junit4]   2> 	 request =
> spellcheck.dictionary=perDict&json.nl=map&spellcheck=true&qt=spellCheckCo
> mpRH&spellcheck..perDict.foo=bar&spellcheck.build=true&spellcheck..perDict.
> bar=foo&q=documemt
>    [junit4]   2> 1122 T128 oas.SolrTestCaseJ4.tearDown ###Ending
> testPerDictionary
>    [junit4]   2> 1128 T128 C10 oasu.DirectUpdateHandler2.deleteAll
> [collection1] REMOVING ALL DOCUMENTS FROM INDEX
>    [junit4]   2> 1129 T128 C10 UPDATE [collection1] webapp=null path=null
> params={} {deleteByQuery=*:*} 0 1
>    [junit4]   2> 1137 T128 C10 oasu.DirectUpdateHandler2.commit start
> commit{flags=0,version=0,optimize=false,openSearcher=true,waitSearcher=tru
> e,expungeDeletes=false,softCommit=false}
>    [junit4]   2> 1141 T128 C10 oasc.SolrDeletionPolicy.onCommit
> SolrDeletionPolicy.onCommit: commits:num=2
>    [junit4]   2>
> 	commit{dir=MockDirWrapper(org.apache.lucene.store.MMapDirectory
> @/mnt/ssd/jenkins/workspace/Lucene-Solr-trunk-Linux-Java8-
> 64/checkout/solr/build/solr-core/test/J1/index6511165112tmp
> lockFactory=org.apache.lucene.store.NativeFSLockFactory@6272f16),segFN=se
> gments_2,generation=2,filenames=[segments_2, _0_Lucene40_0.prx,
> _0_Lucene40_0.frq, _0_nrm.cfs, _0.fdx, _0_Lucene40_0.tim, _0.si, _0.fnm,
> _0.fdt, _0_Lucene40_0.tip, _0_nrm.cfe]
>    [junit4]   2>
> 	commit{dir=MockDirWrapper(org.apache.lucene.store.MMapDirectory
> @/mnt/ssd/jenkins/workspace/Lucene-Solr-trunk-Linux-Java8-
> 64/checkout/solr/build/solr-core/test/J1/index6511165112tmp
> lockFactory=org.apache.lucene.store.NativeFSLockFactory@6272f16),segFN=se
> gments_3,generation=3,filenames=[segments_3]
>    [junit4]   2> 1141 T128 C10 oasc.SolrDeletionPolicy.updateCommits newest
> commit = 3
>    [junit4]   2> 1153 T128 C10 oass.SolrIndexSearcher.<init> Opening
> Searcher@6ebc4e13 main
>    [junit4]   2> 1154 T128 C10 oass.SolrIndexSearcher.<init> WARNING
> WARNING: Directory impl does not support setting indexDir:
> org.apache.lucene.store.MockDirectoryWrapper
>    [junit4]   2> 1155 T128 C10 oasu.DirectUpdateHandler2.commit
> end_commit_flush
>    [junit4]   2> 1155 T129
> oashc.SpellCheckComponent$SpellCheckerListener.buildSpellIndex Building
> spell index for spell checker: default
>    [junit4]   2> 1167 T129
> oashc.SpellCheckComponent$SpellCheckerListener.buildSpellIndex Building
> spell index for spell checker: default_teststop
>    [junit4]   2> 1175 T129
> oashc.SpellCheckComponent$SpellCheckerListener.buildSpellIndex Building
> spell index for spell checker: threshold
>    [junit4]   2> 1187 T129
> oashc.SpellCheckComponent$SpellCheckerListener.buildSpellIndex Building
> spell index for spell checker: threshold_direct
>    [junit4]   2> 1187 T129
> oashc.SpellCheckComponent$SpellCheckerListener.buildSpellIndex Building
> spell index for spell checker: multipleFields
>    [junit4]   2> 1198 T129
> oashc.SpellCheckComponent$SpellCheckerListener.buildSpellIndex Building
> spell index for spell checker: freq
>    [junit4]   2> 1213 T129
> oashc.SpellCheckComponent$SpellCheckerListener.buildSpellIndex Building
> spell index for spell checker: fqcn
>    [junit4]   2> 1226 T129 oasc.SolrCore.registerSearcher [collection1]
> Registered new searcher Searcher@6ebc4e13
> main{StandardDirectoryReader(segments_3:4)}
>    [junit4]   2> 1227 T128 C10 UPDATE [collection1] webapp=null path=null
> params={} {commit=} 0 90
>    [junit4]   2> NOTE: reproduce with: ant test  -
> Dtestcase=SpellCheckComponentTest -Dtests.method=testPerDictionary -
> Dtests.seed=CE81EF7A000D6B19 -Dtests.multiplier=3 -Dtests.slow=true -
> Dtests.locale=ru_RU -Dtests.timezone=Europe/Minsk -Dargs="-
> Dfile.encoding=UTF-8"
>    [junit4]   2>
>    [junit4]    > (@AfterClass output)
>    [junit4]   2> 5451 T128 oas.SolrTestCaseJ4.deleteCore ###deleteCore
>    [junit4]   2> 5451 T128 oasc.CoreContainer.shutdown Shutting down
> CoreContainer instance=577261384
>    [junit4]   2> 5451 T128 oasc.SolrCore.close [collection1]  CLOSING SolrCore
> org.apache.solr.core.SolrCore@3abbafc7
>    [junit4]   2> 5452 T128 oasc.SolrCore.closeSearcher [collection1] Closing
> main searcher on request.
>    [junit4]   2> 5452 T128 oasu.DirectUpdateHandler2.close closing
> DirectUpdateHandler2{commits=20,autocommits=0,soft
> autocommits=0,optimizes=0,rollbacks=0,expungeDeletes=0,docsPending=0,add
> s=0,deletesById=0,deletesByQuery=0,errors=0,cumulative_adds=92,cumulative
> _deletesById=0,cumulative_deletesByQuery=9,cumulative_errors=0}
>    [junit4]   2> NOTE: test params are: codec=Lucene40:
> {gram2=MockVariableIntBlock(baseBlockSize=66),
> end3=MockFixedIntBlock(blockSize=222),
> gram3=MockFixedIntBlock(blockSize=222),
> start1=PostingsFormat(name=MockRandom),
> start3=MockVariableIntBlock(baseBlockSize=66), end1=Pulsing40(freqCutoff=3
> minBlockSize=65 maxBlockSize=136), word=Pulsing40(freqCutoff=3
> minBlockSize=65 maxBlockSize=136),
> gram4=PostingsFormat(name=MockRandom),
> start2=MockFixedIntBlock(blockSize=222),
> end4=PostingsFormat(name=MockRandom),
> end2=MockVariableIntBlock(baseBlockSize=66), gram1=Pulsing40(freqCutoff=3
> minBlockSize=65 maxBlockSize=136), start4=Pulsing40(freqCutoff=3
> minBlockSize=65 maxBlockSize=136)},
> sim=RandomSimilarityProvider(queryNorm=true,coord=true): {}, locale=ru_RU,
> timezone=Europe/Minsk
>    [junit4]   2> NOTE: Linux 2.6.32-41-server amd64/Oracle Corporation 1.8.0-ea
> (64-bit)/cpus=8,threads=1,free=120501456,total=261488640
>    [junit4]   2> NOTE: All tests run in this JVM: [TestOmitPositions,
> DistributedTermsComponentTest, TestUAX29URLEmailTokenizerFactory,
> TestKeepFilterFactory, QueryParsingTest, SpellCheckComponentTest]
>    [junit4]   2>
>    [junit4] Completed on J1 in 5.48s, 9 tests, 1 error <<< FAILURES!
> 
> [...truncated 530 lines...]
>    [junit4] Suite:
> org.apache.solr.handler.component.DistributedQueryElevationComponentTest
>    [junit4] ERROR   1.23s J0 |
> DistributedQueryElevationComponentTest.testDistribSearch
>    [junit4]    > Throwable #1: java.lang.IndexOutOfBoundsException: Index: 18,
> Size: 18
>    [junit4]    > 	at
> __randomizedtesting.SeedInfo.seed([CE81EF7A000D6B19:4F67616277520B25]:
> 0)
>    [junit4]    > 	at java.util.ArrayList.rangeCheck(ArrayList.java:603)
>    [junit4]    > 	at java.util.ArrayList.get(ArrayList.java:381)
>    [junit4]    > 	at
> org.apache.solr.common.util.NamedList.getName(NamedList.java:127)
>    [junit4]    > 	at
> org.apache.solr.BaseDistributedSearchTestCase.compare(BaseDistributedSearc
> hTestCase.java:467)
>    [junit4]    > 	at
> org.apache.solr.BaseDistributedSearchTestCase.compare(BaseDistributedSearc
> hTestCase.java:613)
>    [junit4]    > 	at
> org.apache.solr.BaseDistributedSearchTestCase.compare(BaseDistributedSearc
> hTestCase.java:501)
>    [junit4]    > 	at
> org.apache.solr.BaseDistributedSearchTestCase.compare(BaseDistributedSearc
> hTestCase.java:613)
>    [junit4]    > 	at
> org.apache.solr.BaseDistributedSearchTestCase.compare(BaseDistributedSearc
> hTestCase.java:501)
>    [junit4]    > 	at
> org.apache.solr.BaseDistributedSearchTestCase.compareResponses(BaseDistrib
> utedSearchTestCase.java:668)
>    [junit4]    > 	at
> org.apache.solr.BaseDistributedSearchTestCase.query(BaseDistributedSearchTe
> stCase.java:393)
>    [junit4]    > 	at
> org.apache.solr.handler.component.DistributedQueryElevationComponentTest.
> doTest(DistributedQueryElevationComponentTest.java:81)
>    [junit4]    > 	at
> org.apache.solr.BaseDistributedSearchTestCase.testDistribSearch(BaseDistribut
> edSearchTestCase.java:680)
>    [junit4]    > 	at sun.reflect.NativeMethodAccessorImpl.invoke0(Native
> Method)
>    [junit4]    > 	at
> sun.reflect.NativeMethodAccessorImpl.invoke(NativeMethodAccessorImpl.java:
> 57)
>    [junit4]    > 	at
> sun.reflect.DelegatingMethodAccessorImpl.invoke(DelegatingMethodAccessorI
> mpl.java:43)
>    [junit4]    > 	at java.lang.reflect.Method.invoke(Method.java:474)
>    [junit4]    > 	at
> com.carrotsearch.randomizedtesting.RandomizedRunner.invoke(RandomizedRu
> nner.java:1969)
>    [junit4]    > 	at
> com.carrotsearch.randomizedtesting.RandomizedRunner.access$1100(Random
> izedRunner.java:132)
>    [junit4]    > 	at
> com.carrotsearch.randomizedtesting.RandomizedRunner$6.evaluate(Randomiz
> edRunner.java:814)
>    [junit4]    > 	at
> com.carrotsearch.randomizedtesting.RandomizedRunner$7.evaluate(Randomiz
> edRunner.java:875)
>    [junit4]    > 	at
> com.carrotsearch.randomizedtesting.RandomizedRunner$8.evaluate(Randomiz
> edRunner.java:889)
>    [junit4]    > 	at
> com.carrotsearch.randomizedtesting.rules.SystemPropertiesRestoreRule$1.eval
> uate(SystemPropertiesRestoreRule.java:53)
>    [junit4]    > 	at
> org.apache.lucene.util.TestRuleSetupTeardownChained$1.evaluate(TestRuleSet
> upTeardownChained.java:50)
>    [junit4]    > 	at
> org.apache.lucene.util.TestRuleFieldCacheSanity$1.evaluate(TestRuleFieldCach
> eSanity.java:32)
>    [junit4]    > 	at
> org.apache.lucene.util.AbstractBeforeAfterRule$1.evaluate(AbstractBeforeAfte
> rRule.java:45)
>    [junit4]    > 	at
> com.carrotsearch.randomizedtesting.rules.SystemPropertiesInvariantRule$1.ev
> aluate(SystemPropertiesInvariantRule.java:55)
>    [junit4]    > 	at
> org.apache.lucene.util.TestRuleReportUncaughtExceptions$1.evaluate(TestRule
> ReportUncaughtExceptions.java:68)
>    [junit4]    > 	at
> org.apache.lucene.util.TestRuleThreadAndTestName$1.evaluate(TestRuleThrea
> dAndTestName.java:48)
>    [junit4]    > 	at
> org.apache.lucene.util.TestRuleIgnoreAfterMaxFailures$1.evaluate(TestRuleIgn
> oreAfterMaxFailures.java:70)
>    [junit4]    > 	at
> org.apache.lucene.util.TestRuleMarkFailure$1.evaluate(TestRuleMarkFailure.ja
> va:48)
>    [junit4]    > 	at
> com.carrotsearch.randomizedtesting.RandomizedRunner.runSingleTest(Rando
> mizedRunner.java:821)
>    [junit4]    > 	at
> com.carrotsearch.randomizedtesting.RandomizedRunner.access$700(Randomiz
> edRunner.java:132)
>    [junit4]    > 	at
> com.carrotsearch.randomizedtesting.RandomizedRunner$3$1.run(Randomized
> Runner.java:669)
>    [junit4]    > 	at
> com.carrotsearch.randomizedtesting.RandomizedRunner$3.evaluate(Randomiz
> edRunner.java:695)
>    [junit4]    > 	at
> com.carrotsearch.randomizedtesting.RandomizedRunner$4.evaluate(Randomiz
> edRunner.java:734)
>    [junit4]    > 	at
> com.carrotsearch.randomizedtesting.RandomizedRunner$5.evaluate(Randomiz
> edRunner.java:745)
>    [junit4]    > 	at
> com.carrotsearch.randomizedtesting.rules.SystemPropertiesRestoreRule$1.eval
> uate(SystemPropertiesRestoreRule.java:53)
>    [junit4]    > 	at
> org.apache.lucene.util.AbstractBeforeAfterRule$1.evaluate(AbstractBeforeAfte
> rRule.java:45)
>    [junit4]    > 	at
> org.apache.lucene.util.TestRuleReportUncaughtExceptions$1.evaluate(TestRule
> ReportUncaughtExceptions.java:68)
>    [junit4]    > 	at
> org.apache.lucene.util.TestRuleStoreClassName$1.evaluate(TestRuleStoreClass
> Name.java:38)
>    [junit4]    > 	at
> org.apache.lucene.util.TestRuleIcuHack$1.evaluate(TestRuleIcuHack.java:51)
>    [junit4]    > 	at
> com.carrotsearch.randomizedtesting.rules.SystemPropertiesInvariantRule$1.ev
> aluate(SystemPropertiesInvariantRule.java:55)
>    [junit4]    > 	at
> org.apache.lucene.util.TestRuleNoInstanceHooksOverrides$1.evaluate(TestRule
> NoInstanceHooksOverrides.java:53)
>    [junit4]    > 	at
> org.apache.lucene.util.TestRuleNoStaticHooksShadowing$1.evaluate(TestRuleN
> oStaticHooksShadowing.java:52)
>    [junit4]    > 	at
> org.apache.lucene.util.TestRuleAssertionsRequired$1.evaluate(TestRuleAssertio
> nsRequired.java:36)
>    [junit4]    > 	at
> org.apache.lucene.util.TestRuleMarkFailure$1.evaluate(TestRuleMarkFailure.ja
> va:48)
>    [junit4]    > 	at
> org.apache.lucene.util.TestRuleIgnoreAfterMaxFailures$1.evaluate(TestRuleIgn
> oreAfterMaxFailures.java:70)
>    [junit4]    > 	at
> org.apache.lucene.util.TestRuleIgnoreTestSuites$1.evaluate(TestRuleIgnoreTest
> Suites.java:55)
>    [junit4]    > 	at
> com.carrotsearch.randomizedtesting.RandomizedRunner.runSuite(Randomized
> Runner.java:605)
>    [junit4]    > 	at
> com.carrotsearch.randomizedtesting.RandomizedRunner.access$400(Randomiz
> edRunner.java:132)
>    [junit4]    > 	at
> com.carrotsearch.randomizedtesting.RandomizedRunner$2.run(RandomizedRu
> nner.java:551)
>    [junit4]    >
>    [junit4]   2> 1 T773 oas.SolrTestCaseJ4.setUp ###Starting testDistribSearch
>    [junit4]   2> 2 T773 oejs.Server.doStart jetty-8.1.2.v20120308
>    [junit4]   2> 4 T773 oejs.AbstractConnector.doStart Started
> SocketConnector@0.0.0.0:33335
>    [junit4]   2> 4 T773 oasc.SolrResourceLoader.locateSolrHome JNDI not
> configured for solr (NoInitialContextEx)
>    [junit4]   2> 5 T773 oasc.SolrResourceLoader.locateSolrHome using system
> property solr.solr.home: /mnt/ssd/jenkins/workspace/Lucene-Solr-trunk-Linux-
> Java8-64/checkout/solr/build/solr-core/test-files/solr
>    [junit4]   2> 5 T773 oasc.SolrResourceLoader.<init> new SolrResourceLoader
> for deduced Solr Home: '/mnt/ssd/jenkins/workspace/Lucene-Solr-trunk-Linux-
> Java8-64/checkout/solr/build/solr-core/test-files/solr/'
>    [junit4]   2> 9 T773 oass.SolrDispatchFilter.init SolrDispatchFilter.init()
>    [junit4]   2> 9 T773 oasc.SolrResourceLoader.locateSolrHome JNDI not
> configured for solr (NoInitialContextEx)
>    [junit4]   2> 10 T773 oasc.SolrResourceLoader.locateSolrHome using system
> property solr.solr.home: /mnt/ssd/jenkins/workspace/Lucene-Solr-trunk-Linux-
> Java8-64/checkout/solr/build/solr-core/test-files/solr
>    [junit4]   2> 10 T773 oasc.CoreContainer$Initializer.initialize looking for
> solr.xml: /mnt/ssd/jenkins/workspace/Lucene-Solr-trunk-Linux-Java8-
> 64/checkout/solr/build/solr-core/test-files/solr/solr.xml
>    [junit4]   2> 10 T773 oasc.CoreContainer.<init> New CoreContainer
> 1863287496
>    [junit4]   2> 11 T773 oasc.CoreContainer.load Loading CoreContainer using
> Solr Home: '/mnt/ssd/jenkins/workspace/Lucene-Solr-trunk-Linux-Java8-
> 64/checkout/solr/build/solr-core/test-files/solr/'
>    [junit4]   2> 11 T773 oasc.SolrResourceLoader.<init> new SolrResourceLoader
> for directory: '/mnt/ssd/jenkins/workspace/Lucene-Solr-trunk-Linux-Java8-
> 64/checkout/solr/build/solr-core/test-files/solr/'
>    [junit4]   2> 18 T773 oasc.CoreContainer.load Registering Log Listener
>    [junit4]   2> 28 T773 oashc.HttpShardHandlerFactory.getParameter Setting
> socketTimeout to: 0
>    [junit4]   2> 29 T773 oashc.HttpShardHandlerFactory.getParameter Setting
> urlScheme to: http://
>    [junit4]   2> 29 T773 oashc.HttpShardHandlerFactory.getParameter Setting
> connTimeout to: 0
>    [junit4]   2> 29 T773 oashc.HttpShardHandlerFactory.getParameter Setting
> maxConnectionsPerHost to: 20
>    [junit4]   2> 30 T773 oashc.HttpShardHandlerFactory.getParameter Setting
> corePoolSize to: 0
>    [junit4]   2> 30 T773 oashc.HttpShardHandlerFactory.getParameter Setting
> maximumPoolSize to: 2147483647
>    [junit4]   2> 30 T773 oashc.HttpShardHandlerFactory.getParameter Setting
> maxThreadIdleTime to: 5
>    [junit4]   2> 30 T773 oashc.HttpShardHandlerFactory.getParameter Setting
> sizeOfQueue to: -1
>    [junit4]   2> 31 T773 oashc.HttpShardHandlerFactory.getParameter Setting
> fairnessPolicy to: false
>    [junit4]   2> 31 T773 oascsi.HttpClientUtil.createClient Creating new http
> client,
> config:maxConnectionsPerHost=20&maxConnections=10000&socketTimeout=0
> &connTimeout=0&retry=false
>    [junit4]   2> 37 T773 oasc.CoreContainer.create Creating SolrCore
> 'collection1' using instanceDir: /mnt/ssd/jenkins/workspace/Lucene-Solr-trunk-
> Linux-Java8-64/checkout/solr/build/solr-core/test-files/solr/collection1
>    [junit4]   2> 38 T773 oasc.SolrResourceLoader.<init> new SolrResourceLoader
> for directory: '/mnt/ssd/jenkins/workspace/Lucene-Solr-trunk-Linux-Java8-
> 64/checkout/solr/build/solr-core/test-files/solr/collection1/'
>    [junit4]   2> 38 T773 oasc.SolrResourceLoader.replaceClassLoader Adding
> 'file:/mnt/ssd/jenkins/workspace/Lucene-Solr-trunk-Linux-Java8-
> 64/checkout/solr/build/solr-core/test-files/solr/collection1/lib/classes/' to
> classloader
>    [junit4]   2> 39 T773 oasc.SolrResourceLoader.replaceClassLoader Adding
> 'file:/mnt/ssd/jenkins/workspace/Lucene-Solr-trunk-Linux-Java8-
> 64/checkout/solr/build/solr-core/test-files/solr/collection1/lib/README' to
> classloader
>    [junit4]   2> 60 T773 oasc.SolrConfig.<init> Using Lucene MatchVersion:
> LUCENE_50
>    [junit4]   2> 92 T773 oasc.SolrConfig.<init> Loaded SolrConfig: solrconfig-
> elevate.xml
>    [junit4]   2> 93 T773 oass.IndexSchema.readSchema Reading Solr Schema
>    [junit4]   2> 96 T773 oass.IndexSchema.readSchema Schema name=example
>    [junit4]   2> 214 T773 oass.IndexSchema.readSchema default search field in
> schema is text
>    [junit4]   2> 216 T773 oass.IndexSchema.readSchema unique key field: id
>    [junit4]   2> 218 T773 oasc.SolrCore.<init> [collection1] Opening new
> SolrCore at /mnt/ssd/jenkins/workspace/Lucene-Solr-trunk-Linux-Java8-
> 64/checkout/solr/build/solr-core/test-files/solr/collection1/,
> dataDir=./org.apache.solr.handler.component.DistributedQueryElevationComp
> onentTest-1341162869884/control/data/
>    [junit4]   2> 218 T773 oasc.JmxMonitoredMap.<init> JMX monitoring is
> enabled. Adding Solr mbeans to JMX Server:
> com.sun.jmx.mbeanserver.JmxMBeanServer@4395cbcb
>    [junit4]   2> 218 T773 oasc.SolrCore.getNewIndexDir WARNING New index
> directory detected: old=null
> new=./org.apache.solr.handler.component.DistributedQueryElevationCompone
> ntTest-1341162869884/control/data/index/
>    [junit4]   2> 219 T773 oasc.SolrCore.initIndex WARNING [collection1] Solr
> index directory
> './org.apache.solr.handler.component.DistributedQueryElevationComponentTes
> t-1341162869884/control/data/index' doesn't exist. Creating new index...
>    [junit4]   2> 220 T773 oasc.SolrDeletionPolicy.onCommit
> SolrDeletionPolicy.onCommit: commits:num=1
>    [junit4]   2>
> 	commit{dir=MockDirWrapper(org.apache.lucene.store.RAMDirectory
> @3549f0ba
> lockFactory=org.apache.lucene.store.SingleInstanceLockFactory@4da43159),se
> gFN=segments_1,generation=1,filenames=[segments_1]
>    [junit4]   2> 220 T773 oasc.SolrDeletionPolicy.updateCommits newest commit
> = 1
>    [junit4]   2> 221 T773 oasc.RequestHandlers.initHandlersFromConfig created
> /update: solr.UpdateRequestHandler
>    [junit4]   2> 221 T773 oasc.RequestHandlers.initHandlersFromConfig created
> /elevate: org.apache.solr.handler.component.SearchHandler
>    [junit4]   2> 222 T773 oasc.RequestHandlers.initHandlersFromConfig created
> /dataElevate: org.apache.solr.handler.component.SearchHandler
>    [junit4]   2> 222 T773 oashl.XMLLoader.init xsltCacheLifetimeSeconds=60
>    [junit4]   2> 222 T773 oasc.RequestHandlers.initHandlersFromConfig
> WARNING no default request handler is registered (either '/select' or
> 'standard')
>    [junit4]   2> 223 T773 oasc.SolrCore.initDeprecatedSupport WARNING
> solrconfig.xml uses deprecated <admin/gettableFiles>, Please update your
> config to use the ShowFileRequestHandler.
>    [junit4]   2> 224 T773 oasc.SolrCore.initDeprecatedSupport WARNING adding
> ShowFileRequestHandler with hidden files: [STOP-SNOWBALL.TXT,
> SOLRCONFIG-DELPOLICY2.XML, HYPHENATION.DTD, SOLRCONFIG-
> SIMPLELOCK.XML, SOLRCONFIG_CODEC.XML, SOLRCONFIG_PERF.XML,
> COMPOUNDDICTIONARY.TXT, SOLRCONFIG-QUERYSENDER.XML, SCHEMA-
> LUCENEMATCHVERSION.XML, DA_COMPOUNDDICTIONARY.TXT, SOLRCONFIG-
> REQHANDLER.INCL, WDFTYPES.TXT, BAD-SCHEMA-NOT-INDEXED-BUT-TF.XML,
> SCHEMA-PHRASESUGGEST.XML, SOLRCONFIG-BASIC.XML, BAD-SCHEMA-
> EXTERNAL-FILEFIELD.XML, SCHEMA-REPLICATION1.XML, SOLRCONFIG-
> UPDATE-PROCESSOR-CHAINS.XML, BAD-SCHEMA-NOT-INDEXED-BUT-POS.XML,
> SOLRCONFIG-SOLR-749.XML, STOPWORDSWRONGENCODING.TXT,
> SOLRCONFIG-ALTDIRECTORY.XML, SOLRCONFIG-PROPINJECT-
> INDEXDEFAULT.XML, SOLRCONFIG-MERGEPOLICY.XML, SOLRCONFIG-
> SPELLCHECKCOMPONENT.XML, SCHEMA-REQUIRED-FIELDS.XML, SCHEMA-
> BINARYFIELD.XML, SOLRCONFIG-MASTER1-KEEPONEBACKUP.XML,
> CURRENCY.XML, SOLRCONFIG-LAZYWRITER.XML, SOLRCONFIG-
> FUNCTIONQUERY.XML, BAD-SCHEMA-DUP-FIELD.XML, BAD-SCHEMA-
> UNIQUEKEY-IS-COPYFIELD-DEST.XML, SCHEMA-NUMERIC.XML, SOLRCONFIG-
> TRANSFORMERS.XML, SCHEMA-MINIMAL.XML, BAD_SOLRCONFIG.XML,
> SCHEMA-BM25.XML, OPEN-EXCHANGE-RATES.JSON, BAD-SCHEMA-NONTEXT-
> ANALYZER.XML, SOLRCONFIG-SPELLCHECKER.XML, SCHEMA-COLLATE.XML,
> DA_UTF8.XML, SCHEMA-REVERSED.XML, PROTWORDS.TXT, STOP-1.TXT,
> SCHEMA-TRIE.XML, SOLRCONFIG-SLAVE.XML, SCHEMA11.XML, SCHEMA-
> LMJELINEKMERCER.XML, SCHEMA-TFIDF.XML, SCHEMA-NOT-REQUIRED-
> UNIQUE-KEY.XML, XSLT, BAD-SCHEMA-OMIT-TF-BUT-NOT-POS.XML,
> SOLRCONFIG-HIGHLIGHT.XML, SCHEMA_CODEC.XML, SOLRCONFIG-
> NATIVELOCK.XML, SOLRCONFIG-REPEATER.XML, HUNSPELL-TEST.AFF,
> SOLRCONFIG-MASTER3.XML, OLD_SYNONYMS.TXT, SOLRCONFIG-
> ELEVATE.XML, SCHEMA-FOLDING.XML, SCHEMA-STOP-KEEP.XML,
> SOLRCONFIG-XINCLUDE.XML, KEEP-2.TXT, SCHEMASURROUND.XML,
> SOLRCONFIG-PROPINJECT.XML, BAD-SCHEMA-NOT-INDEXED-BUT-
> NORMS.XML, ELEVATE.XML, STOPTYPES-2.TXT, SOLRCONFIG-MASTER2.XML,
> SOLRCONFIG-CACHING.XML, SOLRCONFIG-PHRASESUGGEST.XML,
> SCHEMA15.XML, STOPWORDS.TXT, SOLRCONFIG-MASTER1.XML,
> STOPWITHBOM.TXT, SCHEMA12.XML, SOLRCONFIG-TERMINDEX.XML,
> SCHEMA-LMDIRICHLET.XML, SOLRCONFIG-TLOG.XML, SOLRCONFIG-
> QUERYSENDER-NOQUERY.XML, BAD-SCHEMA-SIM-GLOBAL-VS-FT-
> MISMATCH.XML, SCHEMA-SIM.XML, BAD-SCHEMA-DUP-DYNAMICFIELD.XML,
> SCHEMA-REPLICATION2.XML, SOLRCONFIG-MASTER.XML, KEEP-1.TXT, BAD-
> SCHEMA-UNIQUEKEY-USES-DEFAULT.XML, BAD-SCHEMA-DUP-FIELDTYPE.XML,
> FRENCHARTICLES.TXT, SOLRCONFIG-SOLCOREPROPERTIES.XML, MAPPING-
> ISOLATIN1ACCENT.TXT, STOPTYPES-1.TXT, BAD-MP-SOLRCONFIG.XML,
> HUNSPELL-TEST.DIC, SCHEMA-IB.XML, PHRASESUGGEST.TXT, SCHEMA-
> COPYFIELD-TEST.XML, SYNONYMS.TXT, STEMDICT.TXT, STOP-2.TXT,
> SOLRCONFIG-ENABLEPLUGIN.XML, SCHEMA-DFR.XML, SOLRCONFIG-
> DELPOLICY1.XML, SCHEMA-SPELLCHECKER.XML, SOLRCONFIG-NOCACHE.XML,
> SOLRCONFIG-SLAVE1.XML, SCHEMA.XML]
>    [junit4]   2> 225 T773 oass.SolrIndexSearcher.<init> Opening
> Searcher@4e91d25a main
>    [junit4]   2> 225 T773 oass.SolrIndexSearcher.<init> WARNING WARNING:
> Directory impl does not support setting indexDir:
> org.apache.lucene.store.MockDirectoryWrapper
>    [junit4]   2> 226 T773 oasu.CommitTracker.<init> Hard AutoCommit: disabled
>    [junit4]   2> 226 T773 oasu.CommitTracker.<init> Soft AutoCommit: disabled
>    [junit4]   2> 226 T773 oashc.QueryElevationComponent.inform Loading
> QueryElevation from: /mnt/ssd/jenkins/workspace/Lucene-Solr-trunk-Linux-
> Java8-64/checkout/solr/build/solr-core/test-
> files/solr/collection1/conf/elevate.xml
>    [junit4]   2> 232 T773 oashc.QueryElevationComponent.inform Loading
> QueryElevation from: /mnt/ssd/jenkins/workspace/Lucene-Solr-trunk-Linux-
> Java8-64/checkout/solr/build/solr-core/test-
> files/solr/collection1/conf/elevate.xml
>    [junit4]   2> 238 T783 oasc.SolrCore.registerSearcher [collection1] Registered
> new searcher Searcher@4e91d25a
> main{StandardDirectoryReader(segments_1:1)}
>    [junit4]   2> 238 T773 oasc.CoreContainer.register registering core:
> collection1
>    [junit4]   2> 239 T773 oass.SolrDispatchFilter.init
> user.dir=/mnt/ssd/jenkins/workspace/Lucene-Solr-trunk-Linux-Java8-
> 64/checkout/solr/build/solr-core/test/J0
>    [junit4]   2> 239 T773 oass.SolrDispatchFilter.init SolrDispatchFilter.init() done
>    [junit4]   2> 239 T773 oascsi.HttpClientUtil.createClient Creating new http
> client,
> config:maxConnections=128&maxConnectionsPerHost=32&followRedirects=fals
> e
>    [junit4]   2> 241 T773 oejs.Server.doStart jetty-8.1.2.v20120308
>    [junit4]   2> 243 T773 oejs.AbstractConnector.doStart Started
> SocketConnector@0.0.0.0:39310
>    [junit4]   2> 244 T773 oasc.SolrResourceLoader.locateSolrHome JNDI not
> configured for solr (NoInitialContextEx)
>    [junit4]   2> 244 T773 oasc.SolrResourceLoader.locateSolrHome using system
> property solr.solr.home: /mnt/ssd/jenkins/workspace/Lucene-Solr-trunk-Linux-
> Java8-64/checkout/solr/build/solr-core/test-files/solr
>    [junit4]   2> 244 T773 oasc.SolrResourceLoader.<init> new
> SolrResourceLoader for deduced Solr Home:
> '/mnt/ssd/jenkins/workspace/Lucene-Solr-trunk-Linux-Java8-
> 64/checkout/solr/build/solr-core/test-files/solr/'
>    [junit4]   2> 247 T773 oass.SolrDispatchFilter.init SolrDispatchFilter.init()
>    [junit4]   2> 247 T773 oasc.SolrResourceLoader.locateSolrHome JNDI not
> configured for solr (NoInitialContextEx)
>    [junit4]   2> 247 T773 oasc.SolrResourceLoader.locateSolrHome using system
> property solr.solr.home: /mnt/ssd/jenkins/workspace/Lucene-Solr-trunk-Linux-
> Java8-64/checkout/solr/build/solr-core/test-files/solr
>    [junit4]   2> 248 T773 oasc.CoreContainer$Initializer.initialize looking for
> solr.xml: /mnt/ssd/jenkins/workspace/Lucene-Solr-trunk-Linux-Java8-
> 64/checkout/solr/build/solr-core/test-files/solr/solr.xml
>    [junit4]   2> 248 T773 oasc.CoreContainer.<init> New CoreContainer
> 785955151
>    [junit4]   2> 248 T773 oasc.CoreContainer.load Loading CoreContainer using
> Solr Home: '/mnt/ssd/jenkins/workspace/Lucene-Solr-trunk-Linux-Java8-
> 64/checkout/solr/build/solr-core/test-files/solr/'
>    [junit4]   2> 248 T773 oasc.SolrResourceLoader.<init> new
> SolrResourceLoader for directory: '/mnt/ssd/jenkins/workspace/Lucene-Solr-
> trunk-Linux-Java8-64/checkout/solr/build/solr-core/test-files/solr/'
>    [junit4]   2> 253 T773 oasc.CoreContainer.load Registering Log Listener
>    [junit4]   2> 260 T773 oashc.HttpShardHandlerFactory.getParameter Setting
> socketTimeout to: 0
>    [junit4]   2> 261 T773 oashc.HttpShardHandlerFactory.getParameter Setting
> urlScheme to: http://
>    [junit4]   2> 261 T773 oashc.HttpShardHandlerFactory.getParameter Setting
> connTimeout to: 0
>    [junit4]   2> 261 T773 oashc.HttpShardHandlerFactory.getParameter Setting
> maxConnectionsPerHost to: 20
>    [junit4]   2> 261 T773 oashc.HttpShardHandlerFactory.getParameter Setting
> corePoolSize to: 0
>    [junit4]   2> 261 T773 oashc.HttpShardHandlerFactory.getParameter Setting
> maximumPoolSize to: 2147483647
>    [junit4]   2> 262 T773 oashc.HttpShardHandlerFactory.getParameter Setting
> maxThreadIdleTime to: 5
>    [junit4]   2> 262 T773 oashc.HttpShardHandlerFactory.getParameter Setting
> sizeOfQueue to: -1
>    [junit4]   2> 262 T773 oashc.HttpShardHandlerFactory.getParameter Setting
> fairnessPolicy to: false
>    [junit4]   2> 262 T773 oascsi.HttpClientUtil.createClient Creating new http
> client,
> config:maxConnectionsPerHost=20&maxConnections=10000&socketTimeout=0
> &connTimeout=0&retry=false
>    [junit4]   2> 266 T773 oasc.CoreContainer.create Creating SolrCore
> 'collection1' using instanceDir: /mnt/ssd/jenkins/workspace/Lucene-Solr-trunk-
> Linux-Java8-64/checkout/solr/build/solr-core/test-files/solr/collection1
>    [junit4]   2> 267 T773 oasc.SolrResourceLoader.<init> new
> SolrResourceLoader for directory: '/mnt/ssd/jenkins/workspace/Lucene-Solr-
> trunk-Linux-Java8-64/checkout/solr/build/solr-core/test-files/solr/collection1/'
>    [junit4]   2> 267 T773 oasc.SolrResourceLoader.replaceClassLoader Adding
> 'file:/mnt/ssd/jenkins/workspace/Lucene-Solr-trunk-Linux-Java8-
> 64/checkout/solr/build/solr-core/test-files/solr/collection1/lib/classes/' to
> classloader
>    [junit4]   2> 267 T773 oasc.SolrResourceLoader.replaceClassLoader Adding
> 'file:/mnt/ssd/jenkins/workspace/Lucene-Solr-trunk-Linux-Java8-
> 64/checkout/solr/build/solr-core/test-files/solr/collection1/lib/README' to
> classloader
>    [junit4]   2> 282 T773 oasc.SolrConfig.<init> Using Lucene MatchVersion:
> LUCENE_50
>    [junit4]   2> 310 T773 oasc.SolrConfig.<init> Loaded SolrConfig: solrconfig-
> elevate.xml
>    [junit4]   2> 310 T773 oass.IndexSchema.readSchema Reading Solr Schema
>    [junit4]   2> 312 T773 oass.IndexSchema.readSchema Schema name=example
>    [junit4]   2> 434 T773 oass.IndexSchema.readSchema default search field in
> schema is text
>    [junit4]   2> 436 T773 oass.IndexSchema.readSchema unique key field: id
>    [junit4]   2> 438 T773 oasc.SolrCore.<init> [collection1] Opening new
> SolrCore at /mnt/ssd/jenkins/workspace/Lucene-Solr-trunk-Linux-Java8-
> 64/checkout/solr/build/solr-core/test-files/solr/collection1/,
> dataDir=./org.apache.solr.handler.component.DistributedQueryElevationComp
> onentTest-1341162869884/shard0/data/
>    [junit4]   2> 438 T773 oasc.JmxMonitoredMap.<init> JMX monitoring is
> enabled. Adding Solr mbeans to JMX Server:
> com.sun.jmx.mbeanserver.JmxMBeanServer@4395cbcb
>    [junit4]   2> 439 T773 oasc.SolrCore.getNewIndexDir WARNING New index
> directory detected: old=null
> new=./org.apache.solr.handler.component.DistributedQueryElevationCompone
> ntTest-1341162869884/shard0/data/index/
>    [junit4]   2> 439 T773 oasc.SolrCore.initIndex WARNING [collection1] Solr
> index directory
> './org.apache.solr.handler.component.DistributedQueryElevationComponentTes
> t-1341162869884/shard0/data/index' doesn't exist. Creating new index...
>    [junit4]   2> 441 T773 oasc.SolrDeletionPolicy.onCommit
> SolrDeletionPolicy.onCommit: commits:num=1
>    [junit4]   2>
> 	commit{dir=MockDirWrapper(org.apache.lucene.store.RAMDirectory
> @38655e16
> lockFactory=org.apache.lucene.store.SingleInstanceLockFactory@1c8d9dea),se
> gFN=segments_1,generation=1,filenames=[segments_1]
>    [junit4]   2> 441 T773 oasc.SolrDeletionPolicy.updateCommits newest commit
> = 1
>    [junit4]   2> 442 T773 oasc.RequestHandlers.initHandlersFromConfig created
> /update: solr.UpdateRequestHandler
>    [junit4]   2> 442 T773 oasc.RequestHandlers.initHandlersFromConfig created
> /elevate: org.apache.solr.handler.component.SearchHandler
>    [junit4]   2> 443 T773 oasc.RequestHandlers.initHandlersFromConfig created
> /dataElevate: org.apache.solr.handler.component.SearchHandler
>    [junit4]   2> 443 T773 oashl.XMLLoader.init xsltCacheLifetimeSeconds=60
>    [junit4]   2> 443 T773 oasc.RequestHandlers.initHandlersFromConfig
> WARNING no default request handler is registered (either '/select' or
> 'standard')
>    [junit4]   2> 444 T773 oasc.SolrCore.initDeprecatedSupport WARNING
> solrconfig.xml uses deprecated <admin/gettableFiles>, Please update your
> config to use the ShowFileRequestHandler.
>    [junit4]   2> 445 T773 oasc.SolrCore.initDeprecatedSupport WARNING adding
> ShowFileRequestHandler with hidden files: [STOP-SNOWBALL.TXT,
> SOLRCONFIG-DELPOLICY2.XML, HYPHENATION.DTD, SOLRCONFIG-
> SIMPLELOCK.XML, SOLRCONFIG_CODEC.XML, SOLRCONFIG_PERF.XML,
> COMPOUNDDICTIONARY.TXT, SOLRCONFIG-QUERYSENDER.XML, SCHEMA-
> LUCENEMATCHVERSION.XML, DA_COMPOUNDDICTIONARY.TXT, SOLRCONFIG-
> REQHANDLER.INCL, WDFTYPES.TXT, BAD-SCHEMA-NOT-INDEXED-BUT-TF.XML,
> SCHEMA-PHRASESUGGEST.XML, SOLRCONFIG-BASIC.XML, BAD-SCHEMA-
> EXTERNAL-FILEFIELD.XML, SCHEMA-REPLICATION1.XML, SOLRCONFIG-
> UPDATE-PROCESSOR-CHAINS.XML, BAD-SCHEMA-NOT-INDEXED-BUT-POS.XML,
> SOLRCONFIG-SOLR-749.XML, STOPWORDSWRONGENCODING.TXT,
> SOLRCONFIG-ALTDIRECTORY.XML, SOLRCONFIG-PROPINJECT-
> INDEXDEFAULT.XML, SOLRCONFIG-MERGEPOLICY.XML, SOLRCONFIG-
> SPELLCHECKCOMPONENT.XML, SCHEMA-REQUIRED-FIELDS.XML, SCHEMA-
> BINARYFIELD.XML, SOLRCONFIG-MASTER1-KEEPONEBACKUP.XML,
> CURRENCY.XML, SOLRCONFIG-LAZYWRITER.XML, SOLRCONFIG-
> FUNCTIONQUERY.XML, BAD-SCHEMA-DUP-FIELD.XML, BAD-SCHEMA-
> UNIQUEKEY-IS-COPYFIELD-DEST.XML, SCHEMA-NUMERIC.XML, SOLRCONFIG-
> TRANSFORMERS.XML, SCHEMA-MINIMAL.XML, BAD_SOLRCONFIG.XML,
> SCHEMA-BM25.XML, OPEN-EXCHANGE-RATES.JSON, BAD-SCHEMA-NONTEXT-
> ANALYZER.XML, SOLRCONFIG-SPELLCHECKER.XML, SCHEMA-COLLATE.XML,
> DA_UTF8.XML, SCHEMA-REVERSED.XML, PROTWORDS.TXT, STOP-1.TXT,
> SCHEMA-TRIE.XML, SOLRCONFIG-SLAVE.XML, SCHEMA11.XML, SCHEMA-
> LMJELINEKMERCER.XML, SCHEMA-TFIDF.XML, SCHEMA-NOT-REQUIRED-
> UNIQUE-KEY.XML, XSLT, BAD-SCHEMA-OMIT-TF-BUT-NOT-POS.XML,
> SOLRCONFIG-HIGHLIGHT.XML, SCHEMA_CODEC.XML, SOLRCONFIG-
> NATIVELOCK.XML, SOLRCONFIG-REPEATER.XML, HUNSPELL-TEST.AFF,
> SOLRCONFIG-MASTER3.XML, OLD_SYNONYMS.TXT, SOLRCONFIG-
> ELEVATE.XML, SCHEMA-FOLDING.XML, SCHEMA-STOP-KEEP.XML,
> SOLRCONFIG-XINCLUDE.XML, KEEP-2.TXT, SCHEMASURROUND.XML,
> SOLRCONFIG-PROPINJECT.XML, BAD-SCHEMA-NOT-INDEXED-BUT-
> NORMS.XML, ELEVATE.XML, STOPTYPES-2.TXT, SOLRCONFIG-MASTER2.XML,
> SOLRCONFIG-CACHING.XML, SOLRCONFIG-PHRASESUGGEST.XML,
> SCHEMA15.XML, STOPWORDS.TXT, SOLRCONFIG-MASTER1.XML,
> STOPWITHBOM.TXT, SCHEMA12.XML, SOLRCONFIG-TERMINDEX.XML,
> SCHEMA-LMDIRICHLET.XML, SOLRCONFIG-TLOG.XML, SOLRCONFIG-
> QUERYSENDER-NOQUERY.XML, BAD-SCHEMA-SIM-GLOBAL-VS-FT-
> MISMATCH.XML, SCHEMA-SIM.XML, BAD-SCHEMA-DUP-DYNAMICFIELD.XML,
> SCHEMA-REPLICATION2.XML, SOLRCONFIG-MASTER.XML, KEEP-1.TXT, BAD-
> SCHEMA-UNIQUEKEY-USES-DEFAULT.XML, BAD-SCHEMA-DUP-FIELDTYPE.XML,
> FRENCHARTICLES.TXT, SOLRCONFIG-SOLCOREPROPERTIES.XML, MAPPING-
> ISOLATIN1ACCENT.TXT, STOPTYPES-1.TXT, BAD-MP-SOLRCONFIG.XML,
> HUNSPELL-TEST.DIC, SCHEMA-IB.XML, PHRASESUGGEST.TXT, SCHEMA-
> COPYFIELD-TEST.XML, SYNONYMS.TXT, STEMDICT.TXT, STOP-2.TXT,
> SOLRCONFIG-ENABLEPLUGIN.XML, SCHEMA-DFR.XML, SOLRCONFIG-
> DELPOLICY1.XML, SCHEMA-SPELLCHECKER.XML, SOLRCONFIG-NOCACHE.XML,
> SOLRCONFIG-SLAVE1.XML, SCHEMA.XML]
>    [junit4]   2> 447 T773 oass.SolrIndexSearcher.<init> Opening
> Searcher@5ad7fb56 main
>    [junit4]   2> 447 T773 oass.SolrIndexSearcher.<init> WARNING WARNING:
> Directory impl does not support setting indexDir:
> org.apache.lucene.store.MockDirectoryWrapper
>    [junit4]   2> 447 T773 oasu.CommitTracker.<init> Hard AutoCommit: disabled
>    [junit4]   2> 448 T773 oasu.CommitTracker.<init> Soft AutoCommit: disabled
>    [junit4]   2> 448 T773 oashc.QueryElevationComponent.inform Loading
> QueryElevation from: /mnt/ssd/jenkins/workspace/Lucene-Solr-trunk-Linux-
> Java8-64/checkout/solr/build/solr-core/test-
> files/solr/collection1/conf/elevate.xml
>    [junit4]   2> 456 T773 oashc.QueryElevationComponent.inform Loading
> QueryElevation from: /mnt/ssd/jenkins/workspace/Lucene-Solr-trunk-Linux-
> Java8-64/checkout/solr/build/solr-core/test-
> files/solr/collection1/conf/elevate.xml
>    [junit4]   2> 464 T793 oasc.SolrCore.registerSearcher [collection1] Registered
> new searcher Searcher@5ad7fb56
> main{StandardDirectoryReader(segments_1:1)}
>    [junit4]   2> 464 T773 oasc.CoreContainer.register registering core:
> collection1
>    [junit4]   2> 464 T773 oass.SolrDispatchFilter.init
> user.dir=/mnt/ssd/jenkins/workspace/Lucene-Solr-trunk-Linux-Java8-
> 64/checkout/solr/build/solr-core/test/J0
>    [junit4]   2> 465 T773 oass.SolrDispatchFilter.init SolrDispatchFilter.init() done
>    [junit4]   2> 465 T773 oascsi.HttpClientUtil.createClient Creating new http
> client,
> config:maxConnections=128&maxConnectionsPerHost=32&followRedirects=fals
> e
>    [junit4]   2> 468 T773 oejs.Server.doStart jetty-8.1.2.v20120308
>    [junit4]   2> 470 T773 oejs.AbstractConnector.doStart Started
> SocketConnector@0.0.0.0:37768
>    [junit4]   2> 470 T773 oasc.SolrResourceLoader.locateSolrHome JNDI not
> configured for solr (NoInitialContextEx)
>    [junit4]   2> 470 T773 oasc.SolrResourceLoader.locateSolrHome using system
> property solr.solr.home: /mnt/ssd/jenkins/workspace/Lucene-Solr-trunk-Linux-
> Java8-64/checkout/solr/build/solr-core/test-files/solr
>    [junit4]   2> 470 T773 oasc.SolrResourceLoader.<init> new
> SolrResourceLoader for deduced Solr Home:
> '/mnt/ssd/jenkins/workspace/Lucene-Solr-trunk-Linux-Java8-
> 64/checkout/solr/build/solr-core/test-files/solr/'
>    [junit4]   2> 473 T773 oass.SolrDispatchFilter.init SolrDispatchFilter.init()
>    [junit4]   2> 473 T773 oasc.SolrResourceLoader.locateSolrHome JNDI not
> configured for solr (NoInitialContextEx)
>    [junit4]   2> 473 T773 oasc.SolrResourceLoader.locateSolrHome using system
> property solr.solr.home: /mnt/ssd/jenkins/workspace/Lucene-Solr-trunk-Linux-
> Java8-64/checkout/solr/build/solr-core/test-files/solr
>    [junit4]   2> 474 T773 oasc.CoreContainer$Initializer.initialize looking for
> solr.xml: /mnt/ssd/jenkins/workspace/Lucene-Solr-trunk-Linux-Java8-
> 64/checkout/solr/build/solr-core/test-files/solr/solr.xml
>    [junit4]   2> 474 T773 oasc.CoreContainer.<init> New CoreContainer
> 486673483
>    [junit4]   2> 474 T773 oasc.CoreContainer.load Loading CoreContainer using
> Solr Home: '/mnt/ssd/jenkins/workspace/Lucene-Solr-trunk-Linux-Java8-
> 64/checkout/solr/build/solr-core/test-files/solr/'
>    [junit4]   2> 474 T773 oasc.SolrResourceLoader.<init> new
> SolrResourceLoader for directory: '/mnt/ssd/jenkins/workspace/Lucene-Solr-
> trunk-Linux-Java8-64/checkout/solr/build/solr-core/test-files/solr/'
>    [junit4]   2> 479 T773 oasc.CoreContainer.load Registering Log Listener
>    [junit4]   2> 485 T773 oashc.HttpShardHandlerFactory.getParameter Setting
> socketTimeout to: 0
>    [junit4]   2> 485 T773 oashc.HttpShardHandlerFactory.getParameter Setting
> urlScheme to: http://
>    [junit4]   2> 486 T773 oashc.HttpShardHandlerFactory.getParameter Setting
> connTimeout to: 0
>    [junit4]   2> 486 T773 oashc.HttpShardHandlerFactory.getParameter Setting
> maxConnectionsPerHost to: 20
>    [junit4]   2> 486 T773 oashc.HttpShardHandlerFactory.getParameter Setting
> corePoolSize to: 0
>    [junit4]   2> 486 T773 oashc.HttpShardHandlerFactory.getParameter Setting
> maximumPoolSize to: 2147483647
>    [junit4]   2> 486 T773 oashc.HttpShardHandlerFactory.getParameter Setting
> maxThreadIdleTime to: 5
>    [junit4]   2> 486 T773 oashc.HttpShardHandlerFactory.getParameter Setting
> sizeOfQueue to: -1
>    [junit4]   2> 487 T773 oashc.HttpShardHandlerFactory.getParameter Setting
> fairnessPolicy to: false
>    [junit4]   2> 487 T773 oascsi.HttpClientUtil.createClient Creating new http
> client,
> config:maxConnectionsPerHost=20&maxConnections=10000&socketTimeout=0
> &connTimeout=0&retry=false
>    [junit4]   2> 492 T773 oasc.CoreContainer.create Creating SolrCore
> 'collection1' using instanceDir: /mnt/ssd/jenkins/workspace/Lucene-Solr-trunk-
> Linux-Java8-64/checkout/solr/build/solr-core/test-files/solr/collection1
>    [junit4]   2> 492 T773 oasc.SolrResourceLoader.<init> new
> SolrResourceLoader for directory: '/mnt/ssd/jenkins/workspace/Lucene-Solr-
> trunk-Linux-Java8-64/checkout/solr/build/solr-core/test-files/solr/collection1/'
>    [junit4]   2> 492 T773 oasc.SolrResourceLoader.replaceClassLoader Adding
> 'file:/mnt/ssd/jenkins/workspace/Lucene-Solr-trunk-Linux-Java8-
> 64/checkout/solr/build/solr-core/test-files/solr/collection1/lib/classes/' to
> classloader
>    [junit4]   2> 493 T773 oasc.SolrResourceLoader.replaceClassLoader Adding
> 'file:/mnt/ssd/jenkins/workspace/Lucene-Solr-trunk-Linux-Java8-
> 64/checkout/solr/build/solr-core/test-files/solr/collection1/lib/README' to
> classloader
>    [junit4]   2> 506 T773 oasc.SolrConfig.<init> Using Lucene MatchVersion:
> LUCENE_50
>    [junit4]   2> 532 T773 oasc.SolrConfig.<init> Loaded SolrConfig: solrconfig-
> elevate.xml
>    [junit4]   2> 532 T773 oass.IndexSchema.readSchema Reading Solr Schema
>    [junit4]   2> 534 T773 oass.IndexSchema.readSchema Schema name=example
>    [junit4]   2> 642 T773 oass.IndexSchema.readSchema default search field in
> schema is text
>    [junit4]   2> 643 T773 oass.IndexSchema.readSchema unique key field: id
>    [junit4]   2> 646 T773 oasc.SolrCore.<init> [collection1] Opening new
> SolrCore at /mnt/ssd/jenkins/workspace/Lucene-Solr-trunk-Linux-Java8-
> 64/checkout/solr/build/solr-core/test-files/solr/collection1/,
> dataDir=./org.apache.solr.handler.component.DistributedQueryElevationComp
> onentTest-1341162869884/shard1/data/
>    [junit4]   2> 646 T773 oasc.JmxMonitoredMap.<init> JMX monitoring is
> enabled. Adding Solr mbeans to JMX Server:
> com.sun.jmx.mbeanserver.JmxMBeanServer@4395cbcb
>    [junit4]   2> 646 T773 oasc.SolrCore.getNewIndexDir WARNING New index
> directory detected: old=null
> new=./org.apache.solr.handler.component.DistributedQueryElevationCompone
> ntTest-1341162869884/shard1/data/index/
>    [junit4]   2> 647 T773 oasc.SolrCore.initIndex WARNING [collection1] Solr
> index directory
> './org.apache.solr.handler.component.DistributedQueryElevationComponentTes
> t-1341162869884/shard1/data/index' doesn't exist. Creating new index...
>    [junit4]   2> 648 T773 oasc.SolrDeletionPolicy.onCommit
> SolrDeletionPolicy.onCommit: commits:num=1
>    [junit4]   2>
> 	commit{dir=MockDirWrapper(org.apache.lucene.store.RAMDirectory
> @68b0797c
> lockFactory=org.apache.lucene.store.SingleInstanceLockFactory@6515bc2b),se
> gFN=segments_1,generation=1,filenames=[segments_1]
>    [junit4]   2> 648 T773 oasc.SolrDeletionPolicy.updateCommits newest commit
> = 1
>    [junit4]   2> 649 T773 oasc.RequestHandlers.initHandlersFromConfig created
> /update: solr.UpdateRequestHandler
>    [junit4]   2> 649 T773 oasc.RequestHandlers.initHandlersFromConfig created
> /elevate: org.apache.solr.handler.component.SearchHandler
>    [junit4]   2> 649 T773 oasc.RequestHandlers.initHandlersFromConfig created
> /dataElevate: org.apache.solr.handler.component.SearchHandler
>    [junit4]   2> 650 T773 oashl.XMLLoader.init xsltCacheLifetimeSeconds=60
>    [junit4]   2> 650 T773 oasc.RequestHandlers.initHandlersFromConfig
> WARNING no default request handler is registered (either '/select' or
> 'standard')
>    [junit4]   2> 651 T773 oasc.SolrCore.initDeprecatedSupport WARNING
> solrconfig.xml uses deprecated <admin/gettableFiles>, Please update your
> config to use the ShowFileRequestHandler.
>    [junit4]   2> 651 T773 oasc.SolrCore.initDeprecatedSupport WARNING adding
> ShowFileRequestHandler with hidden files: [STOP-SNOWBALL.TXT,
> SOLRCONFIG-DELPOLICY2.XML, HYPHENATION.DTD, SOLRCONFIG-
> SIMPLELOCK.XML, SOLRCONFIG_CODEC.XML, SOLRCONFIG_PERF.XML,
> COMPOUNDDICTIONARY.TXT, SOLRCONFIG-QUERYSENDER.XML, SCHEMA-
> LUCENEMATCHVERSION.XML, DA_COMPOUNDDICTIONARY.TXT, SOLRCONFIG-
> REQHANDLER.INCL, WDFTYPES.TXT, BAD-SCHEMA-NOT-INDEXED-BUT-TF.XML,
> SCHEMA-PHRASESUGGEST.XML, SOLRCONFIG-BASIC.XML, BAD-SCHEMA-
> EXTERNAL-FILEFIELD.XML, SCHEMA-REPLICATION1.XML, SOLRCONFIG-
> UPDATE-PROCESSOR-CHAINS.XML, BAD-SCHEMA-NOT-INDEXED-BUT-POS.XML,
> SOLRCONFIG-SOLR-749.XML, STOPWORDSWRONGENCODING.TXT,
> SOLRCONFIG-ALTDIRECTORY.XML, SOLRCONFIG-PROPINJECT-
> INDEXDEFAULT.XML, SOLRCONFIG-MERGEPOLICY.XML, SOLRCONFIG-
> SPELLCHECKCOMPONENT.XML, SCHEMA-REQUIRED-FIELDS.XML, SCHEMA-
> BINARYFIELD.XML, SOLRCONFIG-MASTER1-KEEPONEBACKUP.XML,
> CURRENCY.XML, SOLRCONFIG-LAZYWRITER.XML, SOLRCONFIG-
> FUNCTIONQUERY.XML, BAD-SCHEMA-DUP-FIELD.XML, BAD-SCHEMA-
> UNIQUEKEY-IS-COPYFIELD-DEST.XML, SCHEMA-NUMERIC.XML, SOLRCONFIG-
> TRANSFORMERS.XML, SCHEMA-MINIMAL.XML, BAD_SOLRCONFIG.XML,
> SCHEMA-BM25.XML, OPEN-EXCHANGE-RATES.JSON, BAD-SCHEMA-NONTEXT-
> ANALYZER.XML, SOLRCONFIG-SPELLCHECKER.XML, SCHEMA-COLLATE.XML,
> DA_UTF8.XML, SCHEMA-REVERSED.XML, PROTWORDS.TXT, STOP-1.TXT,
> SCHEMA-TRIE.XML, SOLRCONFIG-SLAVE.XML, SCHEMA11.XML, SCHEMA-
> LMJELINEKMERCER.XML, SCHEMA-TFIDF.XML, SCHEMA-NOT-REQUIRED-
> UNIQUE-KEY.XML, XSLT, BAD-SCHEMA-OMIT-TF-BUT-NOT-POS.XML,
> SOLRCONFIG-HIGHLIGHT.XML, SCHEMA_CODEC.XML, SOLRCONFIG-
> NATIVELOCK.XML, SOLRCONFIG-REPEATER.XML, HUNSPELL-TEST.AFF,
> SOLRCONFIG-MASTER3.XML, OLD_SYNONYMS.TXT, SOLRCONFIG-
> ELEVATE.XML, SCHEMA-FOLDING.XML, SCHEMA-STOP-KEEP.XML,
> SOLRCONFIG-XINCLUDE.XML, KEEP-2.TXT, SCHEMASURROUND.XML,
> SOLRCONFIG-PROPINJECT.XML, BAD-SCHEMA-NOT-INDEXED-BUT-
> NORMS.XML, ELEVATE.XML, STOPTYPES-2.TXT, SOLRCONFIG-MASTER2.XML,
> SOLRCONFIG-CACHING.XML, SOLRCONFIG-PHRASESUGGEST.XML,
> SCHEMA15.XML, STOPWORDS.TXT, SOLRCONFIG-MASTER1.XML,
> STOPWITHBOM.TXT, SCHEMA12.XML, SOLRCONFIG-TERMINDEX.XML,
> SCHEMA-LMDIRICHLET.XML, SOLRCONFIG-TLOG.XML, SOLRCONFIG-
> QUERYSENDER-NOQUERY.XML, BAD-SCHEMA-SIM-GLOBAL-VS-FT-
> MISMATCH.XML, SCHEMA-SIM.XML, BAD-SCHEMA-DUP-DYNAMICFIELD.XML,
> SCHEMA-REPLICATION2.XML, SOLRCONFIG-MASTER.XML, KEEP-1.TXT, BAD-
> SCHEMA-UNIQUEKEY-USES-DEFAULT.XML, BAD-SCHEMA-DUP-FIELDTYPE.XML,
> FRENCHARTICLES.TXT, SOLRCONFIG-SOLCOREPROPERTIES.XML, MAPPING-
> ISOLATIN1ACCENT.TXT, STOPTYPES-1.TXT, BAD-MP-SOLRCONFIG.XML,
> HUNSPELL-TEST.DIC, SCHEMA-IB.XML, PHRASESUGGEST.TXT, SCHEMA-
> COPYFIELD-TEST.XML, SYNONYMS.TXT, STEMDICT.TXT, STOP-2.TXT,
> SOLRCONFIG-ENABLEPLUGIN.XML, SCHEMA-DFR.XML, SOLRCONFIG-
> DELPOLICY1.XML, SCHEMA-SPELLCHECKER.XML, SOLRCONFIG-NOCACHE.XML,
> SOLRCONFIG-SLAVE1.XML, SCHEMA.XML]
>    [junit4]   2> 653 T773 oass.SolrIndexSearcher.<init> Opening
> Searcher@3d8aa55e main
>    [junit4]   2> 653 T773 oass.SolrIndexSearcher.<init> WARNING WARNING:
> Directory impl does not support setting indexDir:
> org.apache.lucene.store.MockDirectoryWrapper
>    [junit4]   2> 653 T773 oasu.CommitTracker.<init> Hard AutoCommit: disabled
>    [junit4]   2> 653 T773 oasu.CommitTracker.<init> Soft AutoCommit: disabled
>    [junit4]   2> 654 T773 oashc.QueryElevationComponent.inform Loading
> QueryElevation from: /mnt/ssd/jenkins/workspace/Lucene-Solr-trunk-Linux-
> Java8-64/checkout/solr/build/solr-core/test-
> files/solr/collection1/conf/elevate.xml
>    [junit4]   2> 659 T773 oashc.QueryElevationComponent.inform Loading
> QueryElevation from: /mnt/ssd/jenkins/workspace/Lucene-Solr-trunk-Linux-
> Java8-64/checkout/solr/build/solr-core/test-
> files/solr/collection1/conf/elevate.xml
>    [junit4]   2> 664 T803 oasc.SolrCore.registerSearcher [collection1] Registered
> new searcher Searcher@3d8aa55e
> main{StandardDirectoryReader(segments_1:1)}
>    [junit4]   2> 664 T773 oasc.CoreContainer.register registering core:
> collection1
>    [junit4]   2> 665 T773 oass.SolrDispatchFilter.init
> user.dir=/mnt/ssd/jenkins/workspace/Lucene-Solr-trunk-Linux-Java8-
> 64/checkout/solr/build/solr-core/test/J0
>    [junit4]   2> 665 T773 oass.SolrDispatchFilter.init SolrDispatchFilter.init() done
>    [junit4]   2> 665 T773 oascsi.HttpClientUtil.createClient Creating new http
> client,
> config:maxConnections=128&maxConnectionsPerHost=32&followRedirects=fals
> e
>    [junit4]   2> 667 T773 oejs.Server.doStart jetty-8.1.2.v20120308
>    [junit4]   2> 668 T773 oejs.AbstractConnector.doStart Started
> SocketConnector@0.0.0.0:57882
>    [junit4]   2> 669 T773 oasc.SolrResourceLoader.locateSolrHome JNDI not
> configured for solr (NoInitialContextEx)
>    [junit4]   2> 669 T773 oasc.SolrResourceLoader.locateSolrHome using system
> property solr.solr.home: /mnt/ssd/jenkins/workspace/Lucene-Solr-trunk-Linux-
> Java8-64/checkout/solr/build/solr-core/test-files/solr
>    [junit4]   2> 669 T773 oasc.SolrResourceLoader.<init> new
> SolrResourceLoader for deduced Solr Home:
> '/mnt/ssd/jenkins/workspace/Lucene-Solr-trunk-Linux-Java8-
> 64/checkout/solr/build/solr-core/test-files/solr/'
>    [junit4]   2> 672 T773 oass.SolrDispatchFilter.init SolrDispatchFilter.init()
>    [junit4]   2> 672 T773 oasc.SolrResourceLoader.locateSolrHome JNDI not
> configured for solr (NoInitialContextEx)
>    [junit4]   2> 672 T773 oasc.SolrResourceLoader.locateSolrHome using system
> property solr.solr.home: /mnt/ssd/jenkins/workspace/Lucene-Solr-trunk-Linux-
> Java8-64/checkout/solr/build/solr-core/test-files/solr
>    [junit4]   2> 674 T773 oasc.CoreContainer$Initializer.initialize looking for
> solr.xml: /mnt/ssd/jenkins/workspace/Lucene-Solr-trunk-Linux-Java8-
> 64/checkout/solr/build/solr-core/test-files/solr/solr.xml
>    [junit4]   2> 674 T773 oasc.CoreContainer.<init> New CoreContainer
> 31279745
>    [junit4]   2> 674 T773 oasc.CoreContainer.load Loading CoreContainer using
> Solr Home: '/mnt/ssd/jenkins/workspace/Lucene-Solr-trunk-Linux-Java8-
> 64/checkout/solr/build/solr-core/test-files/solr/'
>    [junit4]   2> 674 T773 oasc.SolrResourceLoader.<init> new
> SolrResourceLoader for directory: '/mnt/ssd/jenkins/workspace/Lucene-Solr-
> trunk-Linux-Java8-64/checkout/solr/build/solr-core/test-files/solr/'
>    [junit4]   2> 685 T773 oasc.CoreContainer.load Registering Log Listener
>    [junit4]   2> 691 T773 oashc.HttpShardHandlerFactory.getParameter Setting
> socketTimeout to: 0
>    [junit4]   2> 692 T773 oashc.HttpShardHandlerFactory.getParameter Setting
> urlScheme to: http://
>    [junit4]   2> 692 T773 oashc.HttpShardHandlerFactory.getParameter Setting
> connTimeout to: 0
>    [junit4]   2> 692 T773 oashc.HttpShardHandlerFactory.getParameter Setting
> maxConnectionsPerHost to: 20
>    [junit4]   2> 692 T773 oashc.HttpShardHandlerFactory.getParameter Setting
> corePoolSize to: 0
>    [junit4]   2> 692 T773 oashc.HttpShardHandlerFactory.getParameter Setting
> maximumPoolSize to: 2147483647
>    [junit4]   2> 693 T773 oashc.HttpShardHandlerFactory.getParameter Setting
> maxThreadIdleTime to: 5
>    [junit4]   2> 693 T773 oashc.HttpShardHandlerFactory.getParameter Setting
> sizeOfQueue to: -1
>    [junit4]   2> 693 T773 oashc.HttpShardHandlerFactory.getParameter Setting
> fairnessPolicy to: false
>    [junit4]   2> 693 T773 oascsi.HttpClientUtil.createClient Creating new http
> client,
> config:maxConnectionsPerHost=20&maxConnections=10000&socketTimeout=0
> &connTimeout=0&retry=false
>    [junit4]   2> 697 T773 oasc.CoreContainer.create Creating SolrCore
> 'collection1' using instanceDir: /mnt/ssd/jenkins/workspace/Lucene-Solr-trunk-
> Linux-Java8-64/checkout/solr/build/solr-core/test-files/solr/collection1
>    [junit4]   2> 697 T773 oasc.SolrResourceLoader.<init> new
> SolrResourceLoader for directory: '/mnt/ssd/jenkins/workspace/Lucene-Solr-
> trunk-Linux-Java8-64/checkout/solr/build/solr-core/test-files/solr/collection1/'
>    [junit4]   2> 698 T773 oasc.SolrResourceLoader.replaceClassLoader Adding
> 'file:/mnt/ssd/jenkins/workspace/Lucene-Solr-trunk-Linux-Java8-
> 64/checkout/solr/build/solr-core/test-files/solr/collection1/lib/classes/' to
> classloader
>    [junit4]   2> 698 T773 oasc.SolrResourceLoader.replaceClassLoader Adding
> 'file:/mnt/ssd/jenkins/workspace/Lucene-Solr-trunk-Linux-Java8-
> 64/checkout/solr/build/solr-core/test-files/solr/collection1/lib/README' to
> classloader
>    [junit4]   2> 713 T773 oasc.SolrConfig.<init> Using Lucene MatchVersion:
> LUCENE_50
>    [junit4]   2> 746 T773 oasc.SolrConfig.<init> Loaded SolrConfig: solrconfig-
> elevate.xml
>    [junit4]   2> 746 T773 oass.IndexSchema.readSchema Reading Solr Schema
>    [junit4]   2> 749 T773 oass.IndexSchema.readSchema Schema name=example
>    [junit4]   2> 857 T773 oass.IndexSchema.readSchema default search field in
> schema is text
>    [junit4]   2> 859 T773 oass.IndexSchema.readSchema unique key field: id
>    [junit4]   2> 861 T773 oasc.SolrCore.<init> [collection1] Opening new
> SolrCore at /mnt/ssd/jenkins/workspace/Lucene-Solr-trunk-Linux-Java8-
> 64/checkout/solr/build/solr-core/test-files/solr/collection1/,
> dataDir=./org.apache.solr.handler.component.DistributedQueryElevationComp
> onentTest-1341162869884/shard2/data/
>    [junit4]   2> 861 T773 oasc.JmxMonitoredMap.<init> JMX monitoring is
> enabled. Adding Solr mbeans to JMX Server:
> com.sun.jmx.mbeanserver.JmxMBeanServer@4395cbcb
>    [junit4]   2> 861 T773 oasc.SolrCore.getNewIndexDir WARNING New index
> directory detected: old=null
> new=./org.apache.solr.handler.component.DistributedQueryElevationCompone
> ntTest-1341162869884/shard2/data/index/
>    [junit4]   2> 862 T773 oasc.SolrCore.initIndex WARNING [collection1] Solr
> index directory
> './org.apache.solr.handler.component.DistributedQueryElevationComponentTes
> t-1341162869884/shard2/data/index' doesn't exist. Creating new index...
>    [junit4]   2> 863 T773 oasc.SolrDeletionPolicy.onCommit
> SolrDeletionPolicy.onCommit: commits:num=1
>    [junit4]   2>
> 	commit{dir=MockDirWrapper(org.apache.lucene.store.RAMDirectory
> @4ca5df0f
> lockFactory=org.apache.lucene.store.SingleInstanceLockFactory@2d4f679d),seg
> FN=segments_1,generation=1,filenames=[segments_1]
>    [junit4]   2> 863 T773 oasc.SolrDeletionPolicy.updateCommits newest commit
> = 1
>    [junit4]   2> 864 T773 oasc.RequestHandlers.initHandlersFromConfig created
> /update: solr.UpdateRequestHandler
>    [junit4]   2> 864 T773 oasc.RequestHandlers.initHandlersFromConfig created
> /elevate: org.apache.solr.handler.component.SearchHandler
>    [junit4]   2> 864 T773 oasc.RequestHandlers.initHandlersFromConfig created
> /dataElevate: org.apache.solr.handler.component.SearchHandler
>    [junit4]   2> 865 T773 oashl.XMLLoader.init xsltCacheLifetimeSeconds=60
>    [junit4]   2> 865 T773 oasc.RequestHandlers.initHandlersFromConfig
> WARNING no default request handler is registered (either '/select' or
> 'standard')
>    [junit4]   2> 866 T773 oasc.SolrCore.initDeprecatedSupport WARNING
> solrconfig.xml uses deprecated <admin/gettableFiles>, Please update your
> config to use the ShowFileRequestHandler.
>    [junit4]   2> 866 T773 oasc.SolrCore.initDeprecatedSupport WARNING adding
> ShowFileRequestHandler with hidden files: [STOP-SNOWBALL.TXT,
> SOLRCONFIG-DELPOLICY2.XML, HYPHENATION.DTD, SOLRCONFIG-
> SIMPLELOCK.XML, SOLRCONFIG_CODEC.XML, SOLRCONFIG_PERF.XML,
> COMPOUNDDICTIONARY.TXT, SOLRCONFIG-QUERYSENDER.XML, SCHEMA-
> LUCENEMATCHVERSION.XML, DA_COMPOUNDDICTIONARY.TXT, SOLRCONFIG-
> REQHANDLER.INCL, WDFTYPES.TXT, BAD-SCHEMA-NOT-INDEXED-BUT-TF.XML,
> SCHEMA-PHRASESUGGEST.XML, SOLRCONFIG-BASIC.XML, BAD-SCHEMA-
> EXTERNAL-FILEFIELD.XML, SCHEMA-REPLICATION1.XML, SOLRCONFIG-
> UPDATE-PROCESSOR-CHAINS.XML, BAD-SCHEMA-NOT-INDEXED-BUT-POS.XML,
> SOLRCONFIG-SOLR-749.XML, STOPWORDSWRONGENCODING.TXT,
> SOLRCONFIG-ALTDIRECTORY.XML, SOLRCONFIG-PROPINJECT-
> INDEXDEFAULT.XML, SOLRCONFIG-MERGEPOLICY.XML, SOLRCONFIG-
> SPELLCHECKCOMPONENT.XML, SCHEMA-REQUIRED-FIELDS.XML, SCHEMA-
> BINARYFIELD.XML, SOLRCONFIG-MASTER1-KEEPONEBACKUP.XML,
> CURRENCY.XML, SOLRCONFIG-LAZYWRITER.XML, SOLRCONFIG-
> FUNCTIONQUERY.XML, BAD-SCHEMA-DUP-FIELD.XML, BAD-SCHEMA-
> UNIQUEKEY-IS-COPYFIELD-DEST.XML, SCHEMA-NUMERIC.XML, SOLRCONFIG-
> TRANSFORMERS.XML, SCHEMA-MINIMAL.XML, BAD_SOLRCONFIG.XML,
> SCHEMA-BM25.XML, OPEN-EXCHANGE-RATES.JSON, BAD-SCHEMA-NONTEXT-
> ANALYZER.XML, SOLRCONFIG-SPELLCHECKER.XML, SCHEMA-COLLATE.XML,
> DA_UTF8.XML, SCHEMA-REVERSED.XML, PROTWORDS.TXT, STOP-1.TXT,
> SCHEMA-TRIE.XML, SOLRCONFIG-SLAVE.XML, SCHEMA11.XML, SCHEMA-
> LMJELINEKMERCER.XML, SCHEMA-TFIDF.XML, SCHEMA-NOT-REQUIRED-
> UNIQUE-KEY.XML, XSLT, BAD-SCHEMA-OMIT-TF-BUT-NOT-POS.XML,
> SOLRCONFIG-HIGHLIGHT.XML, SCHEMA_CODEC.XML, SOLRCONFIG-
> NATIVELOCK.XML, SOLRCONFIG-REPEATER.XML, HUNSPELL-TEST.AFF,
> SOLRCONFIG-MASTER3.XML, OLD_SYNONYMS.TXT, SOLRCONFIG-
> ELEVATE.XML, SCHEMA-FOLDING.XML, SCHEMA-STOP-KEEP.XML,
> SOLRCONFIG-XINCLUDE.XML, KEEP-2.TXT, SCHEMASURROUND.XML,
> SOLRCONFIG-PROPINJECT.XML, BAD-SCHEMA-NOT-INDEXED-BUT-
> NORMS.XML, ELEVATE.XML, STOPTYPES-2.TXT, SOLRCONFIG-MASTER2.XML,
> SOLRCONFIG-CACHING.XML, SOLRCONFIG-PHRASESUGGEST.XML,
> SCHEMA15.XML, STOPWORDS.TXT, SOLRCONFIG-MASTER1.XML,
> STOPWITHBOM.TXT, SCHEMA12.XML, SOLRCONFIG-TERMINDEX.XML,
> SCHEMA-LMDIRICHLET.XML, SOLRCONFIG-TLOG.XML, SOLRCONFIG-
> QUERYSENDER-NOQUERY.XML, BAD-SCHEMA-SIM-GLOBAL-VS-FT-
> MISMATCH.XML, SCHEMA-SIM.XML, BAD-SCHEMA-DUP-DYNAMICFIELD.XML,
> SCHEMA-REPLICATION2.XML, SOLRCONFIG-MASTER.XML, KEEP-1.TXT, BAD-
> SCHEMA-UNIQUEKEY-USES-DEFAULT.XML, BAD-SCHEMA-DUP-FIELDTYPE.XML,
> FRENCHARTICLES.TXT, SOLRCONFIG-SOLCOREPROPERTIES.XML, MAPPING-
> ISOLATIN1ACCENT.TXT, STOPTYPES-1.TXT, BAD-MP-SOLRCONFIG.XML,
> HUNSPELL-TEST.DIC, SCHEMA-IB.XML, PHRASESUGGEST.TXT, SCHEMA-
> COPYFIELD-TEST.XML, SYNONYMS.TXT, STEMDICT.TXT, STOP-2.TXT,
> SOLRCONFIG-ENABLEPLUGIN.XML, SCHEMA-DFR.XML, SOLRCONFIG-
> DELPOLICY1.XML, SCHEMA-SPELLCHECKER.XML, SOLRCONFIG-NOCACHE.XML,
> SOLRCONFIG-SLAVE1.XML, SCHEMA.XML]
>    [junit4]   2> 868 T773 oass.SolrIndexSearcher.<init> Opening
> Searcher@259a964d main
>    [junit4]   2> 868 T773 oass.SolrIndexSearcher.<init> WARNING WARNING:
> Directory impl does not support setting indexDir:
> org.apache.lucene.store.MockDirectoryWrapper
>    [junit4]   2> 868 T773 oasu.CommitTracker.<init> Hard AutoCommit: disabled
>    [junit4]   2> 868 T773 oasu.CommitTracker.<init> Soft AutoCommit: disabled
>    [junit4]   2> 869 T773 oashc.QueryElevationComponent.inform Loading
> QueryElevation from: /mnt/ssd/jenkins/workspace/Lucene-Solr-trunk-Linux-
> Java8-64/checkout/solr/build/solr-core/test-
> files/solr/collection1/conf/elevate.xml
>    [junit4]   2> 874 T773 oashc.QueryElevationComponent.inform Loading
> QueryElevation from: /mnt/ssd/jenkins/workspace/Lucene-Solr-trunk-Linux-
> Java8-64/checkout/solr/build/solr-core/test-
> files/solr/collection1/conf/elevate.xml
>    [junit4]   2> 879 T813 oasc.SolrCore.registerSearcher [collection1] Registered
> new searcher Searcher@259a964d
> main{StandardDirectoryReader(segments_1:1)}
>    [junit4]   2> 879 T773 oasc.CoreContainer.register registering core:
> collection1
>    [junit4]   2> 880 T773 oass.SolrDispatchFilter.init
> user.dir=/mnt/ssd/jenkins/workspace/Lucene-Solr-trunk-Linux-Java8-
> 64/checkout/solr/build/solr-core/test/J0
>    [junit4]   2> 880 T773 oass.SolrDispatchFilter.init SolrDispatchFilter.init() done
>    [junit4]   2> 880 T773 oascsi.HttpClientUtil.createClient Creating new http
> client,
> config:maxConnections=128&maxConnectionsPerHost=32&followRedirects=fals
> e
>    [junit4]   2> ASYNC  NEW_CORE C69 name=collection1
> org.apache.solr.core.SolrCore@12c2d56d
>    [junit4]   2> 887 T776 C69 oasu.DirectUpdateHandler2.deleteAll [collection1]
> REMOVING ALL DOCUMENTS FROM INDEX
>    [junit4]   2> 888 T776 C69 oasc.SolrDeletionPolicy.onInit
> SolrDeletionPolicy.onInit: commits:num=1
>    [junit4]   2>
> 	commit{dir=MockDirWrapper(org.apache.lucene.store.RAMDirectory
> @3549f0ba
> lockFactory=org.apache.lucene.store.SingleInstanceLockFactory@4da43159),se
> gFN=segments_1,generation=1,filenames=[segments_1]
>    [junit4]   2> 889 T776 C69 oasc.SolrDeletionPolicy.updateCommits newest
> commit = 1
>    [junit4]   2> 889 T776 C69 UPDATE [collection1] webapp=/solr path=/update
> params={wt=javabin&version=2} {deleteByQuery=*:*} 0 3
>    [junit4]   2> ASYNC  NEW_CORE C70 name=collection1
> org.apache.solr.core.SolrCore@2d39f67c
>    [junit4]   2> 893 T786 C70 oasu.DirectUpdateHandler2.deleteAll [collection1]
> REMOVING ALL DOCUMENTS FROM INDEX
>    [junit4]   2> 895 T786 C70 oasc.SolrDeletionPolicy.onInit
> SolrDeletionPolicy.onInit: commits:num=1
>    [junit4]   2>
> 	commit{dir=MockDirWrapper(org.apache.lucene.store.RAMDirectory
> @38655e16
> lockFactory=org.apache.lucene.store.SingleInstanceLockFactory@1c8d9dea),se
> gFN=segments_1,generation=1,filenames=[segments_1]
>    [junit4]   2> 895 T786 C70 oasc.SolrDeletionPolicy.updateCommits newest
> commit = 1
>    [junit4]   2> 895 T786 C70 UPDATE [collection1] webapp=/solr path=/update
> params={wt=javabin&version=2} {deleteByQuery=*:*} 0 2
>    [junit4]   2> ASYNC  NEW_CORE C71 name=collection1
> org.apache.solr.core.SolrCore@1f3f1d9a
>    [junit4]   2> 899 T796 C71 oasu.DirectUpdateHandler2.deleteAll [collection1]
> REMOVING ALL DOCUMENTS FROM INDEX
>    [junit4]   2> 901 T796 C71 oasc.SolrDeletionPolicy.onInit
> SolrDeletionPolicy.onInit: commits:num=1
>    [junit4]   2>
> 	commit{dir=MockDirWrapper(org.apache.lucene.store.RAMDirectory
> @68b0797c
> lockFactory=org.apache.lucene.store.SingleInstanceLockFactory@6515bc2b),se
> gFN=segments_1,generation=1,filenames=[segments_1]
>    [junit4]   2> 901 T796 C71 oasc.SolrDeletionPolicy.updateCommits newest
> commit = 1
>    [junit4]   2> 901 T796 C71 UPDATE [collection1] webapp=/solr path=/update
> params={wt=javabin&version=2} {deleteByQuery=*:*} 0 2
>    [junit4]   2> ASYNC  NEW_CORE C72 name=collection1
> org.apache.solr.core.SolrCore@41c290a3
>    [junit4]   2> 906 T806 C72 oasu.DirectUpdateHandler2.deleteAll [collection1]
> REMOVING ALL DOCUMENTS FROM INDEX
>    [junit4]   2> 907 T806 C72 oasc.SolrDeletionPolicy.onInit
> SolrDeletionPolicy.onInit: commits:num=1
>    [junit4]   2>
> 	commit{dir=MockDirWrapper(org.apache.lucene.store.RAMDirectory
> @4ca5df0f
> lockFactory=org.apache.lucene.store.SingleInstanceLockFactory@2d4f679d),seg
> FN=segments_1,generation=1,filenames=[segments_1]
>    [junit4]   2> 908 T806 C72 oasc.SolrDeletionPolicy.updateCommits newest
> commit = 1
>    [junit4]   2> 908 T806 C72 UPDATE [collection1] webapp=/solr path=/update
> params={wt=javabin&version=2} {deleteByQuery=*:*} 0 2
>    [junit4]   2> 911 T776 C69 UPDATE [collection1] webapp=/solr path=/update
> params={wt=javabin&version=2} {add=[1]} 0 1
>    [junit4]   2> 915 T786 C70 UPDATE [collection1] webapp=/solr path=/update
> params={wt=javabin&version=2} {add=[1]} 0 1
>    [junit4]   2> 918 T776 C69 UPDATE [collection1] webapp=/solr path=/update
> params={wt=javabin&version=2} {add=[2]} 0 1
>    [junit4]   2> 920 T796 C71 UPDATE [collection1] webapp=/solr path=/update
> params={wt=javabin&version=2} {add=[2]} 0 0
>    [junit4]   2> 922 T776 C69 UPDATE [collection1] webapp=/solr path=/update
> params={wt=javabin&version=2} {add=[3]} 0 0
>    [junit4]   2> 925 T806 C72 UPDATE [collection1] webapp=/solr path=/update
> params={wt=javabin&version=2} {add=[3]} 0 0
>    [junit4]   2> 928 T776 C69 UPDATE [collection1] webapp=/solr path=/update
> params={wt=javabin&version=2} {add=[4]} 0 0
>    [junit4]   2> 930 T786 C70 UPDATE [collection1] webapp=/solr path=/update
> params={wt=javabin&version=2} {add=[4]} 0 0
>    [junit4]   2> 932 T776 C69 UPDATE [collection1] webapp=/solr path=/update
> params={wt=javabin&version=2} {add=[5]} 0 0
>    [junit4]   2> 935 T796 C71 UPDATE [collection1] webapp=/solr path=/update
> params={wt=javabin&version=2} {add=[5]} 0 1
>    [junit4]   2> 937 T776 C69 UPDATE [collection1] webapp=/solr path=/update
> params={wt=javabin&version=2} {add=[6]} 0 0
>    [junit4]   2> 939 T806 C72 UPDATE [collection1] webapp=/solr path=/update
> params={wt=javabin&version=2} {add=[6]} 0 0
>    [junit4]   2> 942 T776 C69 UPDATE [collection1] webapp=/solr path=/update
> params={wt=javabin&version=2} {add=[7]} 0 0
>    [junit4]   2> 944 T806 C72 UPDATE [collection1] webapp=/solr path=/update
> params={wt=javabin&version=2} {add=[7]} 0 0
>    [junit4]   2> 947 T776 C69 oasu.DirectUpdateHandler2.commit start
> commit{flags=0,version=0,optimize=false,openSearcher=true,waitSearcher=tru
> e,expungeDeletes=false,softCommit=false}
>    [junit4]   2> 948 T776 C69 oasc.SolrDeletionPolicy.onCommit
> SolrDeletionPolicy.onCommit: commits:num=2
>    [junit4]   2>
> 	commit{dir=MockDirWrapper(org.apache.lucene.store.RAMDirectory
> @3549f0ba
> lockFactory=org.apache.lucene.store.SingleInstanceLockFactory@4da43159),se
> gFN=segments_1,generation=1,filenames=[segments_1]
>    [junit4]   2>
> 	commit{dir=MockDirWrapper(org.apache.lucene.store.RAMDirectory
> @3549f0ba
> lockFactory=org.apache.lucene.store.SingleInstanceLockFactory@4da43159),se
> gFN=segments_2,generation=2,filenames=[_0_Lucene40_0.frq,
> _0_Lucene40_0.prx, _0.fnm, _0_nrm.cfe, _0.si, _0_Lucene40_0.tim,
> _0_Lucene40_0.tip, segments_2, _0.fdx, _0_nrm.cfs, _0.fdt]
>    [junit4]   2> 949 T776 C69 oasc.SolrDeletionPolicy.updateCommits newest
> commit = 2
>    [junit4]   2> 949 T776 C69 oass.SolrIndexSearcher.<init> Opening
> Searcher@65ea348e main
>    [junit4]   2> 949 T776 C69 oass.SolrIndexSearcher.<init> WARNING WARNING:
> Directory impl does not support setting indexDir:
> org.apache.lucene.store.MockDirectoryWrapper
>    [junit4]   2> 949 T776 C69 oasu.DirectUpdateHandler2.commit
> end_commit_flush
>    [junit4]   2> 950 T783 oasc.SolrCore.registerSearcher [collection1] Registered
> new searcher Searcher@65ea348e
> main{StandardDirectoryReader(segments_2:4 _0(5.0):C7)}
>    [junit4]   2> 950 T776 C69 UPDATE [collection1] webapp=/solr path=/update
> params={wt=javabin&waitSearcher=true&version=2&softCommit=false&comm
> it=true} {commit=} 0 3
>    [junit4]   2> 952 T786 C70 oasu.DirectUpdateHandler2.commit start
> commit{flags=0,version=0,optimize=false,openSearcher=true,waitSearcher=tru
> e,expungeDeletes=false,softCommit=false}
>    [junit4]   2> 953 T786 C70 oasc.SolrDeletionPolicy.onCommit
> SolrDeletionPolicy.onCommit: commits:num=2
>    [junit4]   2>
> 	commit{dir=MockDirWrapper(org.apache.lucene.store.RAMDirectory
> @38655e16
> lockFactory=org.apache.lucene.store.SingleInstanceLockFactory@1c8d9dea),se
> gFN=segments_1,generation=1,filenames=[segments_1]
>    [junit4]   2>
> 	commit{dir=MockDirWrapper(org.apache.lucene.store.RAMDirectory
> @38655e16
> lockFactory=org.apache.lucene.store.SingleInstanceLockFactory@1c8d9dea),se
> gFN=segments_2,generation=2,filenames=[_0_Lucene40_0.frq,
> _0_Lucene40_0.prx, _0.fnm, _0_nrm.cfe, _0.si, _0_Lucene40_0.tim,
> _0_Lucene40_0.tip, segments_2, _0.fdx, _0_nrm.cfs, _0.fdt]
>    [junit4]   2> 953 T786 C70 oasc.SolrDeletionPolicy.updateCommits newest
> commit = 2
>    [junit4]   2> 954 T786 C70 oass.SolrIndexSearcher.<init> Opening
> Searcher@f8be4db main
>    [junit4]   2> 954 T786 C70 oass.SolrIndexSearcher.<init> WARNING WARNING:
> Directory impl does not support setting indexDir:
> org.apache.lucene.store.MockDirectoryWrapper
>    [junit4]   2> 955 T786 C70 oasu.DirectUpdateHandler2.commit
> end_commit_flush
>    [junit4]   2> 955 T793 oasc.SolrCore.registerSearcher [collection1] Registered
> new searcher Searcher@f8be4db
> main{StandardDirectoryReader(segments_2:4 _0(5.0):C2)}
>    [junit4]   2> 956 T786 C70 UPDATE [collection1] webapp=/solr path=/update
> params={wt=javabin&waitSearcher=true&version=2&softCommit=false&comm
> it=true} {commit=} 0 4
>    [junit4]   2> 959 T796 C71 oasu.DirectUpdateHandler2.commit start
> commit{flags=0,version=0,optimize=false,openSearcher=true,waitSearcher=tru
> e,expungeDeletes=false,softCommit=false}
>    [junit4]   2> 960 T796 C71 oasc.SolrDeletionPolicy.onCommit
> SolrDeletionPolicy.onCommit: commits:num=2
>    [junit4]   2>
> 	commit{dir=MockDirWrapper(org.apache.lucene.store.RAMDirectory
> @68b0797c
> lockFactory=org.apache.lucene.store.SingleInstanceLockFactory@6515bc2b),se
> gFN=segments_1,generation=1,filenames=[segments_1]
>    [junit4]   2>
> 	commit{dir=MockDirWrapper(org.apache.lucene.store.RAMDirectory
> @68b0797c
> lockFactory=org.apache.lucene.store.SingleInstanceLockFactory@6515bc2b),se
> gFN=segments_2,generation=2,filenames=[_0_Lucene40_0.frq,
> _0_Lucene40_0.prx, _0.fnm, _0_nrm.cfe, _0.si, _0_Lucene40_0.tim,
> _0_Lucene40_0.tip, segments_2, _0.fdx, _0_nrm.cfs, _0.fdt]
>    [junit4]   2> 960 T796 C71 oasc.SolrDeletionPolicy.updateCommits newest
> commit = 2
>    [junit4]   2> 961 T796 C71 oass.SolrIndexSearcher.<init> Opening
> Searcher@63ebe31a main
>    [junit4]   2> 961 T796 C71 oass.SolrIndexSearcher.<init> WARNING WARNING:
> Directory impl does not support setting indexDir:
> org.apache.lucene.store.MockDirectoryWrapper
>    [junit4]   2> 961 T796 C71 oasu.DirectUpdateHandler2.commit
> end_commit_flush
>    [junit4]   2> 961 T803 oasc.SolrCore.registerSearcher [collection1] Registered
> new searcher Searcher@63ebe31a
> main{StandardDirectoryReader(segments_2:4 _0(5.0):C2)}
>    [junit4]   2> 962 T796 C71 UPDATE [collection1] webapp=/solr path=/update
> params={wt=javabin&waitSearcher=true&version=2&softCommit=false&comm
> it=true} {commit=} 0 3
>    [junit4]   2> 970 T806 C72 oasu.DirectUpdateHandler2.commit start
> commit{flags=0,version=0,optimize=false,openSearcher=true,waitSearcher=tru
> e,expungeDeletes=false,softCommit=false}
>    [junit4]   2> 971 T806 C72 oasc.SolrDeletionPolicy.onCommit
> SolrDeletionPolicy.onCommit: commits:num=2
>    [junit4]   2>
> 	commit{dir=MockDirWrapper(org.apache.lucene.store.RAMDirectory
> @4ca5df0f
> lockFactory=org.apache.lucene.store.SingleInstanceLockFactory@2d4f679d),seg
> FN=segments_1,generation=1,filenames=[segments_1]
>    [junit4]   2>
> 	commit{dir=MockDirWrapper(org.apache.lucene.store.RAMDirectory
> @4ca5df0f
> lockFactory=org.apache.lucene.store.SingleInstanceLockFactory@2d4f679d),seg
> FN=segments_2,generation=2,filenames=[_0_Lucene40_0.frq,
> _0_Lucene40_0.prx, _0.fnm, _0_nrm.cfe, _0.si, _0_Lucene40_0.tim,
> _0_Lucene40_0.tip, segments_2, _0.fdx, _0_nrm.cfs, _0.fdt]
>    [junit4]   2> 971 T806 C72 oasc.SolrDeletionPolicy.updateCommits newest
> commit = 2
>    [junit4]   2> 972 T806 C72 oass.SolrIndexSearcher.<init> Opening
> Searcher@4c49e361 main
>    [junit4]   2> 972 T806 C72 oass.SolrIndexSearcher.<init> WARNING WARNING:
> Directory impl does not support setting indexDir:
> org.apache.lucene.store.MockDirectoryWrapper
>    [junit4]   2> 972 T806 C72 oasu.DirectUpdateHandler2.commit
> end_commit_flush
>    [junit4]   2> 972 T813 oasc.SolrCore.registerSearcher [collection1] Registered
> new searcher Searcher@4c49e361
> main{StandardDirectoryReader(segments_2:4 _0(5.0):C3)}
>    [junit4]   2> 973 T806 C72 UPDATE [collection1] webapp=/solr path=/update
> params={wt=javabin&waitSearcher=true&version=2&softCommit=false&comm
> it=true} {commit=} 0 3
>    [junit4]   2> 976 T776 C69 REQ [collection1] webapp=/solr path=/elevate
> params={sort=id+desc&rows=500&distrib=false&q=*:*&wt=javabin&fl=id,+scor
> e,+[elevated]&version=2&qt=/elevate&shards.qt=/elevate} hits=7 status=0
> QTime=1
>    [junit4]   2> 982 T797 C71 REQ [collection1] webapp=/solr path=/elevate
> params={distrib=false&wt=javabin&fsv=true&fl=id,score&version=2&shard.url=
> localhost:37768/solr|[::1]:33332/solr&NOW=1341162870862&isShard=true&qt
> =/elevate&start=0&sort=id+desc&rows=500&q=*:*&shards.qt=/elevate} hits=2
> status=0 QTime=1
>    [junit4]   2> 982 T787 C70 REQ [collection1] webapp=/solr path=/elevate
> params={distrib=false&wt=javabin&fsv=true&fl=id,score&version=2&shard.url=
> localhost:39310/solr&NOW=1341162870862&isShard=true&qt=/elevate&start=
> 0&sort=id+desc&rows=500&q=*:*&shards.qt=/elevate} hits=2 status=0
> QTime=1
>    [junit4]   2> 982 T807 C72 REQ [collection1] webapp=/solr path=/elevate
> params={distrib=false&wt=javabin&fsv=true&fl=id,score&version=2&shard.url=
> localhost:57882/solr&NOW=1341162870862&isShard=true&qt=/elevate&start=
> 0&sort=id+desc&rows=500&q=*:*&shards.qt=/elevate} hits=3 status=0
> QTime=1
>    [junit4]   2> 985 T807 C72 REQ [collection1] webapp=/solr path=/elevate
> params={distrib=false&wt=javabin&fl=id,+score,+[elevated]&version=2&shard.
> url=localhost:57882/solr&qt=/elevate&isShard=true&NOW=1341162870862&id
> s=7.0,6.0,3.0&rows=500&q=*:*&shards.qt=/elevate} status=0 QTime=0
>    [junit4]   2> 985 T787 C70 REQ [collection1] webapp=/solr path=/elevate
> params={distrib=false&wt=javabin&fl=id,+score,+[elevated]&version=2&shard.
> url=localhost:39310/solr&qt=/elevate&isShard=true&NOW=1341162870862&id
> s=1.0,4.0&rows=500&q=*:*&shards.qt=/elevate} status=0 QTime=0
>    [junit4]   2> 985 T797 C71 REQ [collection1] webapp=/solr path=/elevate
> params={distrib=false&wt=javabin&fl=id,+score,+[elevated]&version=2&shard.
> url=localhost:37768/solr|[::1]:33332/solr&qt=/elevate&isShard=true&NOW=13
> 41162870862&ids=2.0,5.0&rows=500&q=*:*&shards.qt=/elevate} status=0
> QTime=0
>    [junit4]   2> 986 T786 C70 REQ [collection1] webapp=/solr path=/elevate
> params={sort=id+desc&rows=500&q=*:*&wt=javabin&shards=localhost:39310/
> solr,localhost:37768/solr|[::1]:33332/solr,localhost:57882/solr&fl=id,+score,+[el
> evated]&version=2&qt=/elevate&shards.qt=/elevate} status=0 QTime=7
>    [junit4]   2> 986 T773 oasc.CoreContainer.shutdown Shutting down
> CoreContainer instance=1863287496
>    [junit4]   2> 987 T773 oasc.SolrCore.close [collection1]  CLOSING SolrCore
> org.apache.solr.core.SolrCore@12c2d56d
>    [junit4]   2> 987 T773 oasc.SolrCore.closeSearcher [collection1] Closing main
> searcher on request.
>    [junit4]   2> 987 T773 oasu.DirectUpdateHandler2.close closing
> DirectUpdateHandler2{commits=1,autocommits=0,soft
> autocommits=0,optimizes=0,rollbacks=0,expungeDeletes=0,docsPending=0,add
> s=0,deletesById=0,deletesByQuery=0,errors=0,cumulative_adds=7,cumulative_
> deletesById=0,cumulative_deletesByQuery=1,cumulative_errors=0}
>    [junit4]   2> 989 T773 oejsh.ContextHandler.doStop stopped
> o.e.j.s.ServletContextHandler{/solr,null}
>    [junit4]   2> 1040 T773 oasc.CoreContainer.shutdown Shutting down
> CoreContainer instance=785955151
>    [junit4]   2> 1041 T773 oasc.SolrCore.close [collection1]  CLOSING SolrCore
> org.apache.solr.core.SolrCore@2d39f67c
>    [junit4]   2> 1041 T773 oasc.SolrCore.closeSearcher [collection1] Closing
> main searcher on request.
>    [junit4]   2> 1042 T773 oasu.DirectUpdateHandler2.close closing
> DirectUpdateHandler2{commits=1,autocommits=0,soft
> autocommits=0,optimizes=0,rollbacks=0,expungeDeletes=0,docsPending=0,add
> s=0,deletesById=0,deletesByQuery=0,errors=0,cumulative_adds=2,cumulative_
> deletesById=0,cumulative_deletesByQuery=1,cumulative_errors=0}
>    [junit4]   2> 1044 T773 oejsh.ContextHandler.doStop stopped
> o.e.j.s.ServletContextHandler{/solr,null}
>    [junit4]   2> 1095 T773 oasc.CoreContainer.shutdown Shutting down
> CoreContainer instance=486673483
>    [junit4]   2> 1096 T773 oasc.SolrCore.close [collection1]  CLOSING SolrCore
> org.apache.solr.core.SolrCore@1f3f1d9a
>    [junit4]   2> 1096 T773 oasc.SolrCore.closeSearcher [collection1] Closing
> main searcher on request.
>    [junit4]   2> 1096 T773 oasu.DirectUpdateHandler2.close closing
> DirectUpdateHandler2{commits=1,autocommits=0,soft
> autocommits=0,optimizes=0,rollbacks=0,expungeDeletes=0,docsPending=0,add
> s=0,deletesById=0,deletesByQuery=0,errors=0,cumulative_adds=2,cumulative_
> deletesById=0,cumulative_deletesByQuery=1,cumulative_errors=0}
>    [junit4]   2> 1098 T773 oejsh.ContextHandler.doStop stopped
> o.e.j.s.ServletContextHandler{/solr,null}
>    [junit4]   2> 1149 T773 oasc.CoreContainer.shutdown Shutting down
> CoreContainer instance=31279745
>    [junit4]   2> 1150 T773 oasc.SolrCore.close [collection1]  CLOSING SolrCore
> org.apache.solr.core.SolrCore@41c290a3
>    [junit4]   2> 1150 T773 oasc.SolrCore.closeSearcher [collection1] Closing
> main searcher on request.
>    [junit4]   2> 1151 T773 oasu.DirectUpdateHandler2.close closing
> DirectUpdateHandler2{commits=1,autocommits=0,soft
> autocommits=0,optimizes=0,rollbacks=0,expungeDeletes=0,docsPending=0,add
> s=0,deletesById=0,deletesByQuery=0,errors=0,cumulative_adds=3,cumulative_
> deletesById=0,cumulative_deletesByQuery=1,cumulative_errors=0}
>    [junit4]   2> 1152 T773 oejsh.ContextHandler.doStop stopped
> o.e.j.s.ServletContextHandler{/solr,null}
>    [junit4]   2> 1203 T773 oas.SolrTestCaseJ4.tearDown ###Ending
> testDistribSearch
>    [junit4]   2> NOTE: reproduce with: ant test  -
> Dtestcase=DistributedQueryElevationComponentTest -
> Dtests.method=testDistribSearch -Dtests.seed=CE81EF7A000D6B19 -
> Dtests.multiplier=3 -Dtests.slow=true -Dtests.locale=es_MX -
> Dtests.timezone=America/Mexico_City -Dargs="-Dfile.encoding=UTF-8"
>    [junit4]   2>
>    [junit4]    > (@AfterClass output)
>    [junit4]   2> 1229 T773 oas.SolrTestCaseJ4.deleteCore ###deleteCore
>    [junit4]   2> NOTE: test params are: codec=Lucene40: {},
> sim=DefaultSimilarity, locale=es_MX, timezone=America/Mexico_City
>    [junit4]   2> NOTE: Linux 2.6.32-41-server amd64/Oracle Corporation 1.8.0-ea
> (64-bit)/cpus=8,threads=1,free=143602632,total=345178112
>    [junit4]   2> NOTE: All tests run in this JVM:
> [TestFinnishLightStemFilterFactory, SystemInfoHandlerTest, CopyFieldTest,
> TestFoldingMultitermQuery, TestFrenchLightStemFilterFactory, TestPropInject,
> TestBulgarianStemFilterFactory, TestStemmerOverrideFilterFactory,
> TestRemoveDuplicatesTokenFilterFactory, MoreLikeThisHandlerTest,
> TestCodecSupport, TestQueryUtils, TestIrishLowerCaseFilterFactory,
> TestUpdate, TestBinaryField, DefaultValueUpdateProcessorTest,
> TestIndexingPerformance, SuggesterWFSTTest, DateMathParserTest,
> OutputWriterTest, JSONWriterTest, CacheHeaderTest,
> TestJapaneseBaseFormFilterFactory, TestLFUCache, TestFiltering,
> CoreAdminHandlerTest, SimpleFacetsTest, TermsComponentTest,
> TestNorwegianLightStemFilterFactory, TestPatternTokenizerFactory,
> FullSolrCloudDistribCmdsTest, TestJapanesePartOfSpeechStopFilterFactory,
> EchoParamsTest, TestBM25SimilarityFactory, TestPerFieldSimilarity,
> TestDFRSimilarityFactory, IndexBasedSpellCheckerTest,
> XmlUpdateRequestHandlerTest, SpatialFilterTest,
> DistributedSpellCheckComponentTest, UpdateRequestProcessorFactoryTest,
> TestSolrCoreProperties, TestGreekLowerCaseFilterFactory,
> TestGermanLightStemFilterFactory, TestPhoneticFilterFactory,
> TestLatvianStemFilterFactory, TestSpanishLightStemFilterFactory,
> TestSynonymFilterFactory, TestHyphenationCompoundWordTokenFilterFactory,
> TestSurroundQueryParser, TestJoin, TestBadConfig, TestSearchPerf,
> QueryElevationComponentTest, TestPHPSerializedResponseWriter,
> SuggesterTest, TestExtendedDismaxParser, SolrCmdDistributorTest,
> TestJmxIntegration, TestReversedWildcardFilterFactory, RequiredFieldsTest,
> OpenExchangeRatesOrgProviderTest, TestTypeTokenFilterFactory,
> TestDelimitedPayloadTokenFilterFactory, TestGalicianStemFilterFactory,
> TestTrimFilterFactory, TestPhraseSuggestions, RequestHandlersTest,
> TestKStemFilterFactory, TestCapitalizationFilterFactory,
> DisMaxRequestHandlerTest, BasicFunctionalityTest,
> ShowFileRequestHandlerTest, TestQuerySenderListener,
> SnowballPorterFilterFactoryTest, DoubleMetaphoneFilterFactoryTest,
> SolrInfoMBeanTest, TestArabicFilters, TestPatternReplaceCharFilterFactory,
> TestBrazilianStemFilterFactory, ZkNodePropsTest, ConvertedLegacyTest,
> TestRandomFaceting, NumericFieldsTest, DirectUpdateHandlerOptimizeTest,
> SOLR749Test, TestFrenchMinimalStemFilterFactory,
> BinaryUpdateRequestHandlerTest, TestStandardFactories, DOMUtilTest,
> TestItalianLightStemFilterFactory, PrimitiveFieldTypeTest, TestHashPartitioner,
> SolrIndexConfigTest, TestSwedishLightStemFilterFactory, AutoCommitTest,
> DistributedQueryElevationComponentTest]
>    [junit4]   2>
>    [junit4] Completed on J0 in 1.24s, 1 test, 1 error <<< FAILURES!
> 
> [...truncated 220 lines...]
>    [junit4] Suite: org.apache.solr.schema.PreAnalyzedFieldTest
>    [junit4] FAILURE 0.01s J1 | PreAnalyzedFieldTest.testParsers
>    [junit4]    > Throwable #1: junit.framework.ComparisonFailure:
> expected:<{"[v":"1","str":"test
> ąćęłńóśźż","tokens":[{"e":128,"i":22,"p":"DQ4KDQsODg8=","s":123,"t":"one","y":
> "word"},{"e":8,"i":1,"s":5,"t":"two","y":"word"},{"e":22,"i":1,"s":20,"t":"three","y":
> "foobar"}]]}> but was:<{"[str":"test
> ąćęłńóśźż","tokens":[{"e":128,"i":22,"p":"DQ4KDQsODg8=","s":123,"t":"one","y":
> "word"},{"e":8,"i":1,"s":5,"t":"two","y":"word"},{"e":22,"i":1,"s":20,"t":"three","y":
> "foobar"}],"v":"1"]}>
>    [junit4]    > 	at junit.framework.Assert.assertEquals(Assert.java:85)
>    [junit4]    > 	at junit.framework.Assert.assertEquals(Assert.java:91)
>    [junit4]    > 	at
> org.apache.solr.schema.PreAnalyzedFieldTest.testParsers(PreAnalyzedFieldTest
> .java:145)
>    [junit4]    > 	at sun.reflect.NativeMethodAccessorImpl.invoke0(Native
> Method)
>    [junit4]    > 	at
> sun.reflect.NativeMethodAccessorImpl.invoke(NativeMethodAccessorImpl.java:
> 57)
>    [junit4]    > 	at
> sun.reflect.DelegatingMethodAccessorImpl.invoke(DelegatingMethodAccessorI
> mpl.java:43)
>    [junit4]    > 	at java.lang.reflect.Method.invoke(Method.java:474)
>    [junit4]    > 	at junit.framework.TestCase.runTest(TestCase.java:168)
>    [junit4]    > 	at junit.framework.TestCase.runBare(TestCase.java:134)
>    [junit4]    > 	at junit.framework.TestResult$1.protect(TestResult.java:110)
>    [junit4]    > 	at
> junit.framework.TestResult.runProtected(TestResult.java:128)
>    [junit4]    > 	at junit.framework.TestResult.run(TestResult.java:113)
>    [junit4]    > 	at junit.framework.TestCase.run(TestCase.java:124)
>    [junit4]    > 	at junit.framework.TestSuite.runTest(TestSuite.java:243)
>    [junit4]    > 	at junit.framework.TestSuite.run(TestSuite.java:238)
>    [junit4]    > 	at
> org.junit.internal.runners.JUnit38ClassRunner.run(JUnit38ClassRunner.java:83)
>    [junit4]    > 	at
> com.carrotsearch.ant.tasks.junit4.slave.SlaveMain.execute(SlaveMain.java:145)
>    [junit4]    > 	at
> com.carrotsearch.ant.tasks.junit4.slave.SlaveMain.main(SlaveMain.java:238)
>    [junit4]    > 	at
> com.carrotsearch.ant.tasks.junit4.slave.SlaveMainSafe.main(SlaveMainSafe.jav
> a:12)
>    [junit4]    >
>    [junit4] Completed on J1 in 0.02s, 3 tests, 1 failure <<< FAILURES!
> 
> [...truncated 14 lines...]
> BUILD FAILED
> /mnt/ssd/jenkins/workspace/Lucene-Solr-trunk-Linux-Java8-
> 64/checkout/build.xml:29: The following error occurred while executing this
> line:
> /mnt/ssd/jenkins/workspace/Lucene-Solr-trunk-Linux-Java8-
> 64/checkout/solr/build.xml:144: The following error occurred while executing
> this line:
> /mnt/ssd/jenkins/workspace/Lucene-Solr-trunk-Linux-Java8-
> 64/checkout/lucene/module-build.xml:62: The following error occurred while
> executing this line:
> /mnt/ssd/jenkins/workspace/Lucene-Solr-trunk-Linux-Java8-
> 64/checkout/lucene/common-build.xml:1047: The following error occurred
> while executing this line:
> /mnt/ssd/jenkins/workspace/Lucene-Solr-trunk-Linux-Java8-
> 64/checkout/lucene/common-build.xml:760: There were test failures: 282
> suites, 1021 tests, 2 errors, 1 failure, 5 ignored
> 
> Total time: 20 minutes 29 seconds
> Build step 'Execute shell' marked build as failure
> Archiving artifacts
> Recording test results
> Email was triggered for: Failure
> Sending email for trigger: Failure
> 
> 



---------------------------------------------------------------------
To unsubscribe, e-mail: dev-unsubscribe@lucene.apache.org
For additional commands, e-mail: dev-help@lucene.apache.org


Mime
View raw message