lucene-dev mailing list archives

Site index · List index
Message view « Date » · « Thread »
Top « Date » · « Thread »
From Robert Muir <rcm...@gmail.com>
Subject Re: [JENKINS] Lucene-Solr-4.x-Windows-Java7-64 - Build # 52 - Still Failing!
Date Wed, 13 Jun 2012 18:22:01 GMT
it could be as simple as a flaky DNS or something: e.g. on my internet
connection when this happens, my ISP (verizon) returns 404. So that
would fail this test, because the content would be different.

Ill commit a change for the test to assume(httpCode == 200).

On Tue, Jun 12, 2012 at 10:26 PM,  <jenkins@sd-datasolutions.de> wrote:
> Build: http://jenkins.sd-datasolutions.de/job/Lucene-Solr-4.x-Windows-Java7-64/52/
>
> 1 tests failed.
> FAILED:  org.apache.solr.common.util.ContentStreamTest.testURLStream
>
> Error Message:
>
>
> Stack Trace:
> java.lang.AssertionError
>        at __randomizedtesting.SeedInfo.seed([50828D73D92F3889:60069A5A2D9BEE0D]:0)
>        at org.junit.Assert.fail(Assert.java:92)
>        at org.junit.Assert.assertTrue(Assert.java:43)
>        at org.junit.Assert.assertTrue(Assert.java:54)
>        at org.apache.solr.common.util.ContentStreamTest.testURLStream(ContentStreamTest.java:109)
>        at sun.reflect.NativeMethodAccessorImpl.invoke0(Native Method)
>        at sun.reflect.NativeMethodAccessorImpl.invoke(NativeMethodAccessorImpl.java:57)
>        at sun.reflect.DelegatingMethodAccessorImpl.invoke(DelegatingMethodAccessorImpl.java:43)
>        at java.lang.reflect.Method.invoke(Method.java:601)
>        at com.carrotsearch.randomizedtesting.RandomizedRunner.invoke(RandomizedRunner.java:1969)
>        at com.carrotsearch.randomizedtesting.RandomizedRunner.access$1100(RandomizedRunner.java:132)
>        at com.carrotsearch.randomizedtesting.RandomizedRunner$6.evaluate(RandomizedRunner.java:814)
>        at com.carrotsearch.randomizedtesting.RandomizedRunner$7.evaluate(RandomizedRunner.java:875)
>        at com.carrotsearch.randomizedtesting.RandomizedRunner$8.evaluate(RandomizedRunner.java:889)
>        at org.apache.lucene.util.TestRuleSetupTeardownChained$1.evaluate(TestRuleSetupTeardownChained.java:50)
>        at org.apache.lucene.util.TestRuleFieldCacheSanity$1.evaluate(TestRuleFieldCacheSanity.java:32)
>        at org.apache.lucene.util.AbstractBeforeAfterRule$1.evaluate(AbstractBeforeAfterRule.java:45)
>        at com.carrotsearch.randomizedtesting.rules.SystemPropertiesInvariantRule$1.evaluate(SystemPropertiesInvariantRule.java:55)
>        at org.apache.lucene.util.TestRuleReportUncaughtExceptions$1.evaluate(TestRuleReportUncaughtExceptions.java:68)
>        at org.apache.lucene.util.TestRuleThreadAndTestName$1.evaluate(TestRuleThreadAndTestName.java:48)
>        at org.apache.lucene.util.TestRuleMarkFailure$1.evaluate(TestRuleMarkFailure.java:48)
>        at com.carrotsearch.randomizedtesting.RandomizedRunner.runSingleTest(RandomizedRunner.java:821)
>        at com.carrotsearch.randomizedtesting.RandomizedRunner.access$700(RandomizedRunner.java:132)
>        at com.carrotsearch.randomizedtesting.RandomizedRunner$3$1.run(RandomizedRunner.java:669)
>        at com.carrotsearch.randomizedtesting.RandomizedRunner$3.evaluate(RandomizedRunner.java:695)
>        at com.carrotsearch.randomizedtesting.RandomizedRunner$4.evaluate(RandomizedRunner.java:734)
>        at com.carrotsearch.randomizedtesting.RandomizedRunner$5.evaluate(RandomizedRunner.java:745)
>        at org.apache.lucene.util.AbstractBeforeAfterRule$1.evaluate(AbstractBeforeAfterRule.java:45)
>        at org.apache.lucene.util.TestRuleReportUncaughtExceptions$1.evaluate(TestRuleReportUncaughtExceptions.java:68)
>        at org.apache.lucene.util.TestRuleStoreClassName$1.evaluate(TestRuleStoreClassName.java:38)
>        at org.apache.lucene.util.TestRuleIcuHack$1.evaluate(TestRuleIcuHack.java:51)
>        at com.carrotsearch.randomizedtesting.rules.SystemPropertiesInvariantRule$1.evaluate(SystemPropertiesInvariantRule.java:55)
>        at org.apache.lucene.util.TestRuleNoInstanceHooksOverrides$1.evaluate(TestRuleNoInstanceHooksOverrides.java:53)
>        at org.apache.lucene.util.TestRuleNoStaticHooksShadowing$1.evaluate(TestRuleNoStaticHooksShadowing.java:52)
>        at org.apache.lucene.util.TestRuleAssertionsRequired$1.evaluate(TestRuleAssertionsRequired.java:36)
>        at org.apache.lucene.util.TestRuleMarkFailure$1.evaluate(TestRuleMarkFailure.java:48)
>        at org.apache.lucene.util.TestRuleIgnoreTestSuites$1.evaluate(TestRuleIgnoreTestSuites.java:56)
>        at com.carrotsearch.randomizedtesting.RandomizedRunner.runSuite(RandomizedRunner.java:605)
>        at com.carrotsearch.randomizedtesting.RandomizedRunner.access$400(RandomizedRunner.java:132)
>        at com.carrotsearch.randomizedtesting.RandomizedRunner$2.run(RandomizedRunner.java:551)
>
>
>
>
> Build Log:
> [...truncated 11889 lines...]
>   [junit4]
>   [junit4] Suite: org.apache.solr.client.solrj.SolrExampleBinaryTest
>   [junit4] Completed in 8.13s, 21 tests
>   [junit4]
>   [junit4] Suite: org.apache.solr.common.util.NamedListTest
>   [junit4] Completed in 0.01s, 1 test
>   [junit4]
>   [junit4] Suite: org.apache.solr.client.solrj.embedded.SolrExampleStreamingTest
>   [junit4] Completed in 12.32s, 21 tests
>   [junit4]
>   [junit4] Suite: org.apache.solr.client.solrj.TestLBHttpSolrServer
>   [junit4] Completed in 14.05s, 3 tests
>   [junit4]
>   [junit4] Suite: org.apache.solr.client.solrj.embedded.SolrExampleJettyTest
>   [junit4] Completed in 7.35s, 22 tests
>   [junit4]
>   [junit4] Suite: org.apache.solr.client.solrj.embedded.JettyWebappTest
>   [junit4] Completed in 2.54s, 1 test
>   [junit4]
>   [junit4] Suite: org.apache.solr.client.solrj.embedded.TestSolrProperties
>   [junit4] Completed in 2.78s, 1 test
>   [junit4]
>   [junit4] Suite: org.apache.solr.client.solrj.response.TestSpellCheckResponse
>   [junit4] Completed in 2.23s, 3 tests
>   [junit4]
>   [junit4] Suite: org.apache.solr.client.solrj.impl.BasicHttpSolrServerTest
>   [junit4] Completed in 5.54s, 8 tests
>   [junit4]
>   [junit4] Suite: org.apache.solr.client.solrj.embedded.SolrExampleStreamingBinaryTest
>   [junit4] Completed in 12.66s, 21 tests
>   [junit4]
>   [junit4] Suite: org.apache.solr.client.solrj.response.QueryResponseTest
>   [junit4] Completed in 0.04s, 3 tests
>   [junit4]
>   [junit4] Suite: org.apache.solr.client.solrj.SolrQueryTest
>   [junit4] Completed in 0.05s, 9 tests
>   [junit4]
>   [junit4] Suite: org.apache.solr.client.solrj.embedded.MultiCoreExampleJettyTest
>   [junit4] Completed in 2.01s, 2 tests
>   [junit4]
>   [junit4] Suite: org.apache.solr.client.solrj.embedded.LargeVolumeEmbeddedTest
>   [junit4] Completed in 1.83s, 1 test
>   [junit4]
>   [junit4] Suite: org.apache.solr.client.solrj.embedded.MultiCoreEmbeddedTest
>   [junit4] Completed in 0.76s, 1 test
>   [junit4]
>   [junit4] Suite: org.apache.solr.client.solrj.SolrExceptionTest
>   [junit4] Completed in 0.07s, 1 test
>   [junit4]
>   [junit4] Suite: org.apache.solr.common.util.ContentStreamTest
>   [junit4] FAILURE 0.72s | ContentStreamTest.testURLStream
>   [junit4]    > Throwable #1: java.lang.AssertionError
>   [junit4]    >        at __randomizedtesting.SeedInfo.seed([50828D73D92F3889:60069A5A2D9BEE0D]:0)
>   [junit4]    >        at org.junit.Assert.fail(Assert.java:92)
>   [junit4]    >        at org.junit.Assert.assertTrue(Assert.java:43)
>   [junit4]    >        at org.junit.Assert.assertTrue(Assert.java:54)
>   [junit4]    >        at org.apache.solr.common.util.ContentStreamTest.testURLStream(ContentStreamTest.java:109)
>   [junit4]    >        at sun.reflect.NativeMethodAccessorImpl.invoke0(Native
Method)
>   [junit4]    >        at sun.reflect.NativeMethodAccessorImpl.invoke(NativeMethodAccessorImpl.java:57)
>   [junit4]    >        at sun.reflect.DelegatingMethodAccessorImpl.invoke(DelegatingMethodAccessorImpl.java:43)
>   [junit4]    >        at java.lang.reflect.Method.invoke(Method.java:601)
>   [junit4]    >        at com.carrotsearch.randomizedtesting.RandomizedRunner.invoke(RandomizedRunner.java:1969)
>   [junit4]    >        at com.carrotsearch.randomizedtesting.RandomizedRunner.access$1100(RandomizedRunner.java:132)
>   [junit4]    >        at com.carrotsearch.randomizedtesting.RandomizedRunner$6.evaluate(RandomizedRunner.java:814)
>   [junit4]    >        at com.carrotsearch.randomizedtesting.RandomizedRunner$7.evaluate(RandomizedRunner.java:875)
>   [junit4]    >        at com.carrotsearch.randomizedtesting.RandomizedRunner$8.evaluate(RandomizedRunner.java:889)
>   [junit4]    >        at org.apache.lucene.util.TestRuleSetupTeardownChained$1.evaluate(TestRuleSetupTeardownChained.java:50)
>   [junit4]    >        at org.apache.lucene.util.TestRuleFieldCacheSanity$1.evaluate(TestRuleFieldCacheSanity.java:32)
>   [junit4]    >        at org.apache.lucene.util.AbstractBeforeAfterRule$1.evaluate(AbstractBeforeAfterRule.java:45)
>   [junit4]    >        at com.carrotsearch.randomizedtesting.rules.SystemPropertiesInvariantRule$1.evaluate(SystemPropertiesInvariantRule.java:55)
>   [junit4]    >        at org.apache.lucene.util.TestRuleReportUncaughtExceptions$1.evaluate(TestRuleReportUncaughtExceptions.java:68)
>   [junit4]    >        at org.apache.lucene.util.TestRuleThreadAndTestName$1.evaluate(TestRuleThreadAndTestName.java:48)
>   [junit4]    >        at org.apache.lucene.util.TestRuleMarkFailure$1.evaluate(TestRuleMarkFailure.java:48)
>   [junit4]    >        at com.carrotsearch.randomizedtesting.RandomizedRunner.runSingleTest(RandomizedRunner.java:821)
>   [junit4]    >        at com.carrotsearch.randomizedtesting.RandomizedRunner.access$700(RandomizedRunner.java:132)
>   [junit4]    >        at com.carrotsearch.randomizedtesting.RandomizedRunner$3$1.run(RandomizedRunner.java:669)
>   [junit4]    >        at com.carrotsearch.randomizedtesting.RandomizedRunner$3.evaluate(RandomizedRunner.java:695)
>   [junit4]    >        at com.carrotsearch.randomizedtesting.RandomizedRunner$4.evaluate(RandomizedRunner.java:734)
>   [junit4]    >        at com.carrotsearch.randomizedtesting.RandomizedRunner$5.evaluate(RandomizedRunner.java:745)
>   [junit4]    >        at org.apache.lucene.util.AbstractBeforeAfterRule$1.evaluate(AbstractBeforeAfterRule.java:45)
>   [junit4]    >        at org.apache.lucene.util.TestRuleReportUncaughtExceptions$1.evaluate(TestRuleReportUncaughtExceptions.java:68)
>   [junit4]    >        at org.apache.lucene.util.TestRuleStoreClassName$1.evaluate(TestRuleStoreClassName.java:38)
>   [junit4]    >        at org.apache.lucene.util.TestRuleIcuHack$1.evaluate(TestRuleIcuHack.java:51)
>   [junit4]    >        at com.carrotsearch.randomizedtesting.rules.SystemPropertiesInvariantRule$1.evaluate(SystemPropertiesInvariantRule.java:55)
>   [junit4]    >        at org.apache.lucene.util.TestRuleNoInstanceHooksOverrides$1.evaluate(TestRuleNoInstanceHooksOverrides.java:53)
>   [junit4]    >        at org.apache.lucene.util.TestRuleNoStaticHooksShadowing$1.evaluate(TestRuleNoStaticHooksShadowing.java:52)
>   [junit4]    >        at org.apache.lucene.util.TestRuleAssertionsRequired$1.evaluate(TestRuleAssertionsRequired.java:36)
>   [junit4]    >        at org.apache.lucene.util.TestRuleMarkFailure$1.evaluate(TestRuleMarkFailure.java:48)
>   [junit4]    >        at org.apache.lucene.util.TestRuleIgnoreTestSuites$1.evaluate(TestRuleIgnoreTestSuites.java:56)
>   [junit4]    >        at com.carrotsearch.randomizedtesting.RandomizedRunner.runSuite(RandomizedRunner.java:605)
>   [junit4]    >        at com.carrotsearch.randomizedtesting.RandomizedRunner.access$400(RandomizedRunner.java:132)
>   [junit4]    >        at com.carrotsearch.randomizedtesting.RandomizedRunner$2.run(RandomizedRunner.java:551)
>   [junit4]    >
>   [junit4]   2> NOTE: reproduce with: ant test  -Dtestcase=ContentStreamTest -Dtests.method=testURLStream
-Dtests.seed=50828D73D92F3889 -Dtests.locale=th_TH -Dtests.timezone=Canada/Mountain -Dargs="-Dfile.encoding=Cp1252"
>   [junit4]   2>
>   [junit4]    > (@AfterClass output)
>   [junit4]   2> NOTE: test params are: codec=Lucene40: {}, sim=RandomSimilarityProvider(queryNorm=true,coord=true):
{}, locale=th_TH, timezone=Canada/Mountain
>   [junit4]   2> NOTE: Windows 7 6.1 amd64/Oracle Corporation 1.7.0_04 (64-bit)/cpus=2,threads=1,free=34607032,total=204734464
>   [junit4]   2> NOTE: All tests run in this JVM: [SolrExampleEmbeddedTest, TestFastInputStream,
TestUpdateRequestCodec, SolrParamTest, TestBatchUpdate, TestNamedListCodec, ClientUtilsTest,
SolrDocumentTest, TestXMLEscaping, LargeVolumeJettyTest, TestHash, ModifiableSolrParamsTest,
MergeIndexesEmbeddedTest, TermsResponseTest, TestEmbeddedSolrServer, SolrExampleXMLTest, LargeVolumeBinaryJettyTest,
FieldAnalysisResponseTest, SolrExampleBinaryTest, NamedListTest, SolrExampleStreamingTest,
TestLBHttpSolrServer, SolrExampleJettyTest, JettyWebappTest, TestSolrProperties, TestSpellCheckResponse,
BasicHttpSolrServerTest, SolrExampleStreamingBinaryTest, QueryResponseTest, SolrQueryTest,
MultiCoreExampleJettyTest, LargeVolumeEmbeddedTest, MultiCoreEmbeddedTest, SolrExceptionTest,
ContentStreamTest]
>   [junit4]   2>
>   [junit4] Completed in 0.73s, 3 tests, 1 failure <<< FAILURES!
> [...truncated 35 lines...]
>
> [...truncated 12025 lines...]
>
> [...truncated 12025 lines...]
>
> [...truncated 12025 lines...]
>
> [...truncated 12025 lines...]
>
> [...truncated 12025 lines...]
>
>
>
>
> ---------------------------------------------------------------------
> To unsubscribe, e-mail: dev-unsubscribe@lucene.apache.org
> For additional commands, e-mail: dev-help@lucene.apache.org



-- 
lucidimagination.com

---------------------------------------------------------------------
To unsubscribe, e-mail: dev-unsubscribe@lucene.apache.org
For additional commands, e-mail: dev-help@lucene.apache.org


Mime
View raw message