lucene-dev mailing list archives

Site index · List index
Message view « Date » · « Thread »
Top « Date » · « Thread »
From Robert Muir <rcm...@gmail.com>
Subject Re: [JENKINS] Lucene-Solr-tests-only-4.x - Build # 33 - Failure
Date Fri, 08 Jun 2012 23:08:46 GMT
I'll take care of this

On Fri, Jun 8, 2012 at 6:55 PM, Apache Jenkins Server
<jenkins@builds.apache.org> wrote:
> Build: https://builds.apache.org/job/Lucene-Solr-tests-only-4.x/33/
>
> 1 tests failed.
> REGRESSION:  org.apache.lucene.index.TestNorms.testIllegalCustomEncoder
>
> Error Message:
> Codec only supports single byte norm values. Type give: FLOAT_32
>
> Stack Trace:
> java.lang.UnsupportedOperationException: Codec only supports single byte norm values.
Type give: FLOAT_32
>        at __randomizedtesting.SeedInfo.seed([42B9C1A0322AF4FF:C09BF33B28225A50]:0)
>        at org.apache.lucene.codecs.lucene3x.PreFlexRWNormsConsumer.addValuesField(PreFlexRWNormsConsumer.java:96)
>        at org.apache.lucene.index.NormsConsumer.newConsumer(NormsConsumer.java:106)
>        at org.apache.lucene.index.NormsConsumerPerField.getConsumer(NormsConsumerPerField.java:74)
>        at org.apache.lucene.index.NormsConsumerPerField.finish(NormsConsumerPerField.java:56)
>        at org.apache.lucene.index.DocInverterPerField.processFields(DocInverterPerField.java:164)
>        at org.apache.lucene.index.DocFieldProcessor.processDocument(DocFieldProcessor.java:307)
>        at org.apache.lucene.index.DocumentsWriterPerThread.updateDocument(DocumentsWriterPerThread.java:242)
>        at org.apache.lucene.index.DocumentsWriter.updateDocument(DocumentsWriter.java:376)
>        at org.apache.lucene.index.IndexWriter.updateDocument(IndexWriter.java:1338)
>        at org.apache.lucene.index.IndexWriter.addDocument(IndexWriter.java:1089)
>        at org.apache.lucene.index.RandomIndexWriter.addDocument(RandomIndexWriter.java:186)
>        at org.apache.lucene.index.RandomIndexWriter.addDocument(RandomIndexWriter.java:145)
>        at org.apache.lucene.index.TestNorms.testIllegalCustomEncoder(TestNorms.java:196)
>        at sun.reflect.NativeMethodAccessorImpl.invoke0(Native Method)
>        at sun.reflect.NativeMethodAccessorImpl.invoke(NativeMethodAccessorImpl.java:57)
>        at sun.reflect.DelegatingMethodAccessorImpl.invoke(DelegatingMethodAccessorImpl.java:43)
>        at java.lang.reflect.Method.invoke(Method.java:616)
>        at com.carrotsearch.randomizedtesting.RandomizedRunner.invoke(RandomizedRunner.java:1969)
>        at com.carrotsearch.randomizedtesting.RandomizedRunner.access$1100(RandomizedRunner.java:132)
>        at com.carrotsearch.randomizedtesting.RandomizedRunner$6.evaluate(RandomizedRunner.java:814)
>        at com.carrotsearch.randomizedtesting.RandomizedRunner$7.evaluate(RandomizedRunner.java:875)
>        at com.carrotsearch.randomizedtesting.RandomizedRunner$8.evaluate(RandomizedRunner.java:889)
>        at org.apache.lucene.util.TestRuleSetupTeardownChained$1.evaluate(TestRuleSetupTeardownChained.java:50)
>        at org.apache.lucene.util.TestRuleFieldCacheSanity$1.evaluate(TestRuleFieldCacheSanity.java:32)
>        at org.apache.lucene.util.AbstractBeforeAfterRule$1.evaluate(AbstractBeforeAfterRule.java:45)
>        at com.carrotsearch.randomizedtesting.rules.SystemPropertiesInvariantRule$1.evaluate(SystemPropertiesInvariantRule.java:55)
>        at org.apache.lucene.util.TestRuleReportUncaughtExceptions$1.evaluate(TestRuleReportUncaughtExceptions.java:68)
>        at org.apache.lucene.util.TestRuleThreadAndTestName$1.evaluate(TestRuleThreadAndTestName.java:48)
>        at org.apache.lucene.util.TestRuleMarkFailure$1.evaluate(TestRuleMarkFailure.java:48)
>        at com.carrotsearch.randomizedtesting.RandomizedRunner.runSingleTest(RandomizedRunner.java:821)
>        at com.carrotsearch.randomizedtesting.RandomizedRunner.access$700(RandomizedRunner.java:132)
>        at com.carrotsearch.randomizedtesting.RandomizedRunner$3$1.run(RandomizedRunner.java:669)
>        at com.carrotsearch.randomizedtesting.RandomizedRunner$3.evaluate(RandomizedRunner.java:695)
>        at com.carrotsearch.randomizedtesting.RandomizedRunner$4.evaluate(RandomizedRunner.java:734)
>        at com.carrotsearch.randomizedtesting.RandomizedRunner$5.evaluate(RandomizedRunner.java:745)
>        at org.apache.lucene.util.AbstractBeforeAfterRule$1.evaluate(AbstractBeforeAfterRule.java:45)
>        at org.apache.lucene.util.TestRuleReportUncaughtExceptions$1.evaluate(TestRuleReportUncaughtExceptions.java:68)
>        at org.apache.lucene.util.TestRuleStoreClassName$1.evaluate(TestRuleStoreClassName.java:38)
>        at org.apache.lucene.util.TestRuleIcuHack$1.evaluate(TestRuleIcuHack.java:51)
>        at com.carrotsearch.randomizedtesting.rules.SystemPropertiesInvariantRule$1.evaluate(SystemPropertiesInvariantRule.java:55)
>        at org.apache.lucene.util.TestRuleNoInstanceHooksOverrides$1.evaluate(TestRuleNoInstanceHooksOverrides.java:53)
>        at org.apache.lucene.util.TestRuleNoStaticHooksShadowing$1.evaluate(TestRuleNoStaticHooksShadowing.java:52)
>        at org.apache.lucene.util.TestRuleAssertionsRequired$1.evaluate(TestRuleAssertionsRequired.java:36)
>        at org.apache.lucene.util.TestRuleMarkFailure$1.evaluate(TestRuleMarkFailure.java:48)
>        at org.apache.lucene.util.TestRuleIgnoreTestSuites$1.evaluate(TestRuleIgnoreTestSuites.java:56)
>        at com.carrotsearch.randomizedtesting.RandomizedRunner.runSuite(RandomizedRunner.java:605)
>        at com.carrotsearch.randomizedtesting.RandomizedRunner.access$400(RandomizedRunner.java:132)
>        at com.carrotsearch.randomizedtesting.RandomizedRunner$2.run(RandomizedRunner.java:551)
>
>
>
>
> Build Log:
> [...truncated 668 lines...]
>   [junit4]
>   [junit4] Suite: org.apache.lucene.index.TestNoMergePolicy
>   [junit4] Completed on J1 in 0.01s, 4 tests
>   [junit4]
>   [junit4] Suite: org.apache.lucene.codecs.appending.TestAppendingCodec
>   [junit4] Completed on J0 in 0.05s, 2 tests
>   [junit4]
>   [junit4] Suite: org.apache.lucene.search.TestSearcherManager
>   [junit4] Completed on J0 in 14.08s, 6 tests
>   [junit4]
>   [junit4] Suite: org.apache.lucene.util.TestBytesRef
>   [junit4] Completed on J1 in 0.01s, 5 tests
>   [junit4]
>   [junit4] Suite: org.apache.lucene.search.TestSloppyPhraseQuery
>   [junit4] Completed on J1 in 1.60s, 9 tests
>   [junit4]
>   [junit4] Suite: org.apache.lucene.analysis.tokenattributes.TestCharTermAttributeImpl
>   [junit4] Completed on J1 in 0.52s, 12 tests
>   [junit4]
>   [junit4] Suite: org.apache.lucene.store.TestBufferedIndexInput
>   [junit4] Completed on J1 in 2.12s, 4 tests
>   [junit4]
>   [junit4] Suite: org.apache.lucene.codecs.lucene40.values.TestDocValues
>   [junit4] Completed on J1 in 0.36s, 14 tests
>   [junit4]
>   [junit4] Suite: org.apache.lucene.search.spans.TestNearSpansOrdered
>   [junit4] Completed on J1 in 0.12s, 10 tests
>   [junit4]
>   [junit4] Suite: org.apache.lucene.index.TestCodecs
>   [junit4] Completed on J1 in 0.96s, 3 tests
>   [junit4]
>   [junit4] Suite: org.apache.lucene.util.TestIOUtils
>   [junit4] Completed on J1 in 0.01s, 1 test
>   [junit4]
>   [junit4] Suite: org.apache.lucene.search.TestTopDocsCollector
>   [junit4] Completed on J1 in 0.06s, 8 tests
>   [junit4]
>   [junit4] Suite: org.apache.lucene.index.TestNorms
>   [junit4]    > (@BeforeClass output)
>   [junit4]   2> NOTE: Suppressing codecs [SimpleText, Memory] for TestNorms.
>   [junit4]   2>
>   [junit4] ERROR   0.03s J0 | TestNorms.testIllegalCustomEncoder
>   [junit4]    > Throwable #1: java.lang.UnsupportedOperationException: Codec only
supports single byte norm values. Type give: FLOAT_32
>   [junit4]    >        at __randomizedtesting.SeedInfo.seed([42B9C1A0322AF4FF:C09BF33B28225A50]:0)
>   [junit4]    >        at org.apache.lucene.codecs.lucene3x.PreFlexRWNormsConsumer.addValuesField(PreFlexRWNormsConsumer.java:96)
>   [junit4]    >        at org.apache.lucene.index.NormsConsumer.newConsumer(NormsConsumer.java:106)
>   [junit4]    >        at org.apache.lucene.index.NormsConsumerPerField.getConsumer(NormsConsumerPerField.java:74)
>   [junit4]    >        at org.apache.lucene.index.NormsConsumerPerField.finish(NormsConsumerPerField.java:56)
>   [junit4]    >        at org.apache.lucene.index.DocInverterPerField.processFields(DocInverterPerField.java:164)
>   [junit4]    >        at org.apache.lucene.index.DocFieldProcessor.processDocument(DocFieldProcessor.java:307)
>   [junit4]    >        at org.apache.lucene.index.DocumentsWriterPerThread.updateDocument(DocumentsWriterPerThread.java:242)
>   [junit4]    >        at org.apache.lucene.index.DocumentsWriter.updateDocument(DocumentsWriter.java:376)
>   [junit4]    >        at org.apache.lucene.index.IndexWriter.updateDocument(IndexWriter.java:1338)
>   [junit4]    >        at org.apache.lucene.index.IndexWriter.addDocument(IndexWriter.java:1089)
>   [junit4]    >        at org.apache.lucene.index.RandomIndexWriter.addDocument(RandomIndexWriter.java:186)
>   [junit4]    >        at org.apache.lucene.index.RandomIndexWriter.addDocument(RandomIndexWriter.java:145)
>   [junit4]    >        at org.apache.lucene.index.TestNorms.testIllegalCustomEncoder(TestNorms.java:196)
>   [junit4]    >        at sun.reflect.NativeMethodAccessorImpl.invoke0(Native
Method)
>   [junit4]    >        at sun.reflect.NativeMethodAccessorImpl.invoke(NativeMethodAccessorImpl.java:57)
>   [junit4]    >        at sun.reflect.DelegatingMethodAccessorImpl.invoke(DelegatingMethodAccessorImpl.java:43)
>   [junit4]    >        at java.lang.reflect.Method.invoke(Method.java:616)
>   [junit4]    >        at com.carrotsearch.randomizedtesting.RandomizedRunner.invoke(RandomizedRunner.java:1969)
>   [junit4]    >        at com.carrotsearch.randomizedtesting.RandomizedRunner.access$1100(RandomizedRunner.java:132)
>   [junit4]    >        at com.carrotsearch.randomizedtesting.RandomizedRunner$6.evaluate(RandomizedRunner.java:814)
>   [junit4]    >        at com.carrotsearch.randomizedtesting.RandomizedRunner$7.evaluate(RandomizedRunner.java:875)
>   [junit4]    >        at com.carrotsearch.randomizedtesting.RandomizedRunner$8.evaluate(RandomizedRunner.java:889)
>   [junit4]    >        at org.apache.lucene.util.TestRuleSetupTeardownChained$1.evaluate(TestRuleSetupTeardownChained.java:50)
>   [junit4]    >        at org.apache.lucene.util.TestRuleFieldCacheSanity$1.evaluate(TestRuleFieldCacheSanity.java:32)
>   [junit4]    >        at org.apache.lucene.util.AbstractBeforeAfterRule$1.evaluate(AbstractBeforeAfterRule.java:45)
>   [junit4]    >        at com.carrotsearch.randomizedtesting.rules.SystemPropertiesInvariantRule$1.evaluate(SystemPropertiesInvariantRule.java:55)
>   [junit4]    >        at org.apache.lucene.util.TestRuleReportUncaughtExceptions$1.evaluate(TestRuleReportUncaughtExceptions.java:68)
>   [junit4]    >        at org.apache.lucene.util.TestRuleThreadAndTestName$1.evaluate(TestRuleThreadAndTestName.java:48)
>   [junit4]    >        at org.apache.lucene.util.TestRuleMarkFailure$1.evaluate(TestRuleMarkFailure.java:48)
>   [junit4]    >        at com.carrotsearch.randomizedtesting.RandomizedRunner.runSingleTest(RandomizedRunner.java:821)
>   [junit4]    >        at com.carrotsearch.randomizedtesting.RandomizedRunner.access$700(RandomizedRunner.java:132)
>   [junit4]    >        at com.carrotsearch.randomizedtesting.RandomizedRunner$3$1.run(RandomizedRunner.java:669)
>   [junit4]    >        at com.carrotsearch.randomizedtesting.RandomizedRunner$3.evaluate(RandomizedRunner.java:695)
>   [junit4]    >        at com.carrotsearch.randomizedtesting.RandomizedRunner$4.evaluate(RandomizedRunner.java:734)
>   [junit4]    >        at com.carrotsearch.randomizedtesting.RandomizedRunner$5.evaluate(RandomizedRunner.java:745)
>   [junit4]    >        at org.apache.lucene.util.AbstractBeforeAfterRule$1.evaluate(AbstractBeforeAfterRule.java:45)
>   [junit4]    >        at org.apache.lucene.util.TestRuleReportUncaughtExceptions$1.evaluate(TestRuleReportUncaughtExceptions.java:68)
>   [junit4]    >        at org.apache.lucene.util.TestRuleStoreClassName$1.evaluate(TestRuleStoreClassName.java:38)
>   [junit4]    >        at org.apache.lucene.util.TestRuleIcuHack$1.evaluate(TestRuleIcuHack.java:51)
>   [junit4]    >        at com.carrotsearch.randomizedtesting.rules.SystemPropertiesInvariantRule$1.evaluate(SystemPropertiesInvariantRule.java:55)
>   [junit4]    >        at org.apache.lucene.util.TestRuleNoInstanceHooksOverrides$1.evaluate(TestRuleNoInstanceHooksOverrides.java:53)
>   [junit4]    >        at org.apache.lucene.util.TestRuleNoStaticHooksShadowing$1.evaluate(TestRuleNoStaticHooksShadowing.java:52)
>   [junit4]    >        at org.apache.lucene.util.TestRuleAssertionsRequired$1.evaluate(TestRuleAssertionsRequired.java:36)
>   [junit4]    >        at org.apache.lucene.util.TestRuleMarkFailure$1.evaluate(TestRuleMarkFailure.java:48)
>   [junit4]    >        at org.apache.lucene.util.TestRuleIgnoreTestSuites$1.evaluate(TestRuleIgnoreTestSuites.java:56)
>   [junit4]    >        at com.carrotsearch.randomizedtesting.RandomizedRunner.runSuite(RandomizedRunner.java:605)
>   [junit4]    >        at com.carrotsearch.randomizedtesting.RandomizedRunner.access$400(RandomizedRunner.java:132)
>   [junit4]    >        at com.carrotsearch.randomizedtesting.RandomizedRunner$2.run(RandomizedRunner.java:551)
>   [junit4]    >
>   [junit4]   2> NOTE: reproduce with: ant test  -Dtestcase=TestNorms -Dtests.method=testIllegalCustomEncoder
-Dtests.seed=42B9C1A0322AF4FF -Dtests.multiplier=3 -Dtests.locale=pt_BR -Dtests.timezone=Japan
-Dargs="-Dfile.encoding=ISO8859-1"
>   [junit4]   2>
>   [junit4]    > (@AfterClass output)
>   [junit4]   2> NOTE: test params are: codec=Lucene3x, sim=DefaultSimilarity, locale=pt_BR,
timezone=Japan
>   [junit4]   2> NOTE: FreeBSD 9.0-RELEASE amd64/Sun Microsystems Inc. 1.6.0_32 (64-bit)/cpus=16,threads=1,free=173943144,total=349765632
>   [junit4]   2> NOTE: All tests run in this JVM: [TestPulsingReuse, TestDocValuesScoring,
TestConsistentFieldNumbers, TestPackedInts, TestConcurrentMergeScheduler, TestTerm, TestByteSlices,
TestAppendingCodec, TestSearcherManager, TestNorms]
>   [junit4]   2>
>   [junit4] Completed on J0 in 11.42s, 4 tests, 1 error <<< FAILURES!
> [...truncated 822 lines...]
>
> [...truncated 1591 lines...]
>
> [...truncated 1591 lines...]
>
> [...truncated 1591 lines...]
>
> [...truncated 1591 lines...]
>
> [...truncated 1591 lines...]
>
>
>
>
> ---------------------------------------------------------------------
> To unsubscribe, e-mail: dev-unsubscribe@lucene.apache.org
> For additional commands, e-mail: dev-help@lucene.apache.org



-- 
lucidimagination.com

---------------------------------------------------------------------
To unsubscribe, e-mail: dev-unsubscribe@lucene.apache.org
For additional commands, e-mail: dev-help@lucene.apache.org


Mime
View raw message