lucene-dev mailing list archives

Site index · List index
Message view « Date » · « Thread »
Top « Date » · « Thread »
From Robert Muir <rcm...@gmail.com>
Subject Re: [JENKINS] Lucene-Solr-4.x-Linux-Java6-64 - Build # 104 - Failure!
Date Wed, 13 Jun 2012 18:59:59 GMT
I committed a fix for this. its the same as LUCENE-4135

On Wed, Jun 13, 2012 at 12:15 PM,  <jenkins@sd-datasolutions.de> wrote:
> Build: http://jenkins.sd-datasolutions.de/job/Lucene-Solr-4.x-Linux-Java6-64/104/
>
> 2 tests failed.
> FAILED:  junit.framework.TestSuite.org.apache.lucene.queryparser.flexible.standard.TestNumericQueryParser
>
> Error Message:
> Unparseable date: "1864.08.28 9:23  44 -0500 1864"
>
> Stack Trace:
> java.text.ParseException: Unparseable date: "1864.08.28 9:23  44 -0500 1864"
>        at __randomizedtesting.SeedInfo.seed([1E7C0CA76C1EE65C]:0)
>        at __randomizedtesting.SeedInfo.seed([1E7C0CA76C1EE65C]:0)
>        at java.text.DateFormat.parse(DateFormat.java:337)
>        at org.apache.lucene.queryparser.flexible.standard.TestNumericQueryParser.checkDateFormatSanity(TestNumericQueryParser.java:93)
>        at org.apache.lucene.queryparser.flexible.standard.TestNumericQueryParser.beforeClass(TestNumericQueryParser.java:150)
>        at sun.reflect.NativeMethodAccessorImpl.invoke0(Native Method)
>        at sun.reflect.NativeMethodAccessorImpl.invoke(NativeMethodAccessorImpl.java:39)
>        at sun.reflect.DelegatingMethodAccessorImpl.invoke(DelegatingMethodAccessorImpl.java:25)
>        at java.lang.reflect.Method.invoke(Method.java:597)
>        at com.carrotsearch.randomizedtesting.RandomizedRunner.invoke(RandomizedRunner.java:1969)
>        at com.carrotsearch.randomizedtesting.RandomizedRunner.access$1100(RandomizedRunner.java:132)
>        at com.carrotsearch.randomizedtesting.RandomizedRunner$4.evaluate(RandomizedRunner.java:729)
>        at com.carrotsearch.randomizedtesting.RandomizedRunner$5.evaluate(RandomizedRunner.java:745)
>        at org.apache.lucene.util.AbstractBeforeAfterRule$1.evaluate(AbstractBeforeAfterRule.java:45)
>        at org.apache.lucene.util.TestRuleReportUncaughtExceptions$1.evaluate(TestRuleReportUncaughtExceptions.java:68)
>        at org.apache.lucene.util.TestRuleStoreClassName$1.evaluate(TestRuleStoreClassName.java:38)
>        at org.apache.lucene.util.TestRuleIcuHack$1.evaluate(TestRuleIcuHack.java:51)
>        at com.carrotsearch.randomizedtesting.rules.SystemPropertiesInvariantRule$1.evaluate(SystemPropertiesInvariantRule.java:55)
>        at org.apache.lucene.util.TestRuleNoInstanceHooksOverrides$1.evaluate(TestRuleNoInstanceHooksOverrides.java:53)
>        at org.apache.lucene.util.TestRuleNoStaticHooksShadowing$1.evaluate(TestRuleNoStaticHooksShadowing.java:52)
>        at org.apache.lucene.util.TestRuleAssertionsRequired$1.evaluate(TestRuleAssertionsRequired.java:36)
>        at org.apache.lucene.util.TestRuleMarkFailure$1.evaluate(TestRuleMarkFailure.java:48)
>        at org.apache.lucene.util.TestRuleIgnoreTestSuites$1.evaluate(TestRuleIgnoreTestSuites.java:56)
>        at com.carrotsearch.randomizedtesting.RandomizedRunner.runSuite(RandomizedRunner.java:605)
>        at com.carrotsearch.randomizedtesting.RandomizedRunner.access$400(RandomizedRunner.java:132)
>        at com.carrotsearch.randomizedtesting.RandomizedRunner$2.run(RandomizedRunner.java:551)
>
>
> FAILED:  junit.framework.TestSuite.org.apache.lucene.queryparser.flexible.standard.TestNumericQueryParser
>
> Error Message:
>
>
> Stack Trace:
> java.lang.NullPointerException
>        at __randomizedtesting.SeedInfo.seed([1E7C0CA76C1EE65C]:0)
>        at org.apache.lucene.queryparser.flexible.standard.TestNumericQueryParser.afterClass(TestNumericQueryParser.java:521)
>        at sun.reflect.NativeMethodAccessorImpl.invoke0(Native Method)
>        at sun.reflect.NativeMethodAccessorImpl.invoke(NativeMethodAccessorImpl.java:39)
>        at sun.reflect.DelegatingMethodAccessorImpl.invoke(DelegatingMethodAccessorImpl.java:25)
>        at java.lang.reflect.Method.invoke(Method.java:597)
>        at com.carrotsearch.randomizedtesting.RandomizedRunner.invoke(RandomizedRunner.java:1969)
>        at com.carrotsearch.randomizedtesting.RandomizedRunner.access$1100(RandomizedRunner.java:132)
>        at com.carrotsearch.randomizedtesting.RandomizedRunner$5.evaluate(RandomizedRunner.java:752)
>        at org.apache.lucene.util.AbstractBeforeAfterRule$1.evaluate(AbstractBeforeAfterRule.java:45)
>        at org.apache.lucene.util.TestRuleReportUncaughtExceptions$1.evaluate(TestRuleReportUncaughtExceptions.java:68)
>        at org.apache.lucene.util.TestRuleStoreClassName$1.evaluate(TestRuleStoreClassName.java:38)
>        at org.apache.lucene.util.TestRuleIcuHack$1.evaluate(TestRuleIcuHack.java:51)
>        at com.carrotsearch.randomizedtesting.rules.SystemPropertiesInvariantRule$1.evaluate(SystemPropertiesInvariantRule.java:55)
>        at org.apache.lucene.util.TestRuleNoInstanceHooksOverrides$1.evaluate(TestRuleNoInstanceHooksOverrides.java:53)
>        at org.apache.lucene.util.TestRuleNoStaticHooksShadowing$1.evaluate(TestRuleNoStaticHooksShadowing.java:52)
>        at org.apache.lucene.util.TestRuleAssertionsRequired$1.evaluate(TestRuleAssertionsRequired.java:36)
>        at org.apache.lucene.util.TestRuleMarkFailure$1.evaluate(TestRuleMarkFailure.java:48)
>        at org.apache.lucene.util.TestRuleIgnoreTestSuites$1.evaluate(TestRuleIgnoreTestSuites.java:56)
>        at com.carrotsearch.randomizedtesting.RandomizedRunner.runSuite(RandomizedRunner.java:605)
>        at com.carrotsearch.randomizedtesting.RandomizedRunner.access$400(RandomizedRunner.java:132)
>        at com.carrotsearch.randomizedtesting.RandomizedRunner$2.run(RandomizedRunner.java:551)
>
>
>
>
> Build Log:
> [...truncated 7957 lines...]
>
> ivy-availability-check:
>
> ivy-fail:
>
> ivy-configure:
>
> resolve:
> [ivy:retrieve] :: loading settings :: url = jar:file:/var/lib/jenkins/.ant/lib/ivy-2.2.0.jar!/org/apache/ivy/core/settings/ivysettings.xml
>
> init:
>
> compile-lucene-core:
>
> compile-core:
>
> common.compile-test:
>
> install-junit4-taskdef:
>
> validate:
>
> common.test:
>    [mkdir] Created dir: /mnt/ssd/jenkins/workspace/Lucene-Solr-4.x-Linux-Java6-64/checkout/lucene/build/queryparser/test
>   [junit4] <JUnit4> says hi! Master seed: 1E7C0CA76C1EE65C
>   [junit4] Executing 26 suites with 2 JVMs.
>   [junit4] Suite: org.apache.lucene.queryparser.flexible.standard.TestMultiAnalyzerQPHelper
>   [junit4] Completed on J1 in 0.38s, 2 tests
>   [junit4]
>   [junit4] Suite: org.apache.lucene.queryparser.classic.TestMultiPhraseQueryParsing
>   [junit4] Completed on J1 in 0.03s, 1 test
>   [junit4]
>   [junit4] Suite: org.apache.lucene.queryparser.flexible.core.builders.TestQueryTreeBuilder
>   [junit4] Completed on J1 in 0.03s, 1 test
>   [junit4]
>   [junit4] Suite: org.apache.lucene.queryparser.surround.query.SrndQueryTest
>   [junit4] Completed on J0 in 0.49s, 1 test
>   [junit4]
>   [junit4] Suite: org.apache.lucene.queryparser.flexible.messages.TestNLS
>   [junit4] Completed on J0 in 0.08s, 6 tests
>   [junit4]
>   [junit4] Suite: org.apache.lucene.queryparser.flexible.standard.TestNumericQueryParser
>   [junit4]    > (@BeforeClass output)
>   [junit4]   2> NOTE: test params are: codec=Appending, sim=RandomSimilarityProvider(queryNorm=false,coord=true):
{}, locale=lt, timezone=Atlantic/Cape_Verde
>   [junit4]   2> NOTE: Linux 2.6.32-41-server amd64/Sun Microsystems Inc. 1.6.0_32
(64-bit)/cpus=8,threads=1,free=114830080,total=125566976
>   [junit4]   2> NOTE: All tests run in this JVM: [SrndQueryTest, TestNLS, TestNumericQueryParser]
>   [junit4]   2> NOTE: reproduce with: ant test  -Dtestcase=TestNumericQueryParser
-Dtests.seed=1E7C0CA76C1EE65C -Dtests.multiplier=3 -Dtests.locale=lt -Dtests.timezone=Atlantic/Cape_Verde
-Dargs="-Dfile.encoding=UTF-8"
>   [junit4]   2>
>   [junit4] ERROR   0.00s J0 | TestNumericQueryParser (suite)
>   [junit4]    > Throwable #1: java.text.ParseException: Unparseable date: "1864.08.28
9:23  44 -0500 1864"
>   [junit4]    >        at __randomizedtesting.SeedInfo.seed([1E7C0CA76C1EE65C]:0)
>   [junit4]    >        at __randomizedtesting.SeedInfo.seed([1E7C0CA76C1EE65C]:0)
>   [junit4]    >        at java.text.DateFormat.parse(DateFormat.java:337)
>   [junit4]    >        at org.apache.lucene.queryparser.flexible.standard.TestNumericQueryParser.checkDateFormatSanity(TestNumericQueryParser.java:93)
>   [junit4]    >        at org.apache.lucene.queryparser.flexible.standard.TestNumericQueryParser.beforeClass(TestNumericQueryParser.java:150)
>   [junit4]    >        at sun.reflect.NativeMethodAccessorImpl.invoke0(Native
Method)
>   [junit4]    >        at sun.reflect.NativeMethodAccessorImpl.invoke(NativeMethodAccessorImpl.java:39)
>   [junit4]    >        at sun.reflect.DelegatingMethodAccessorImpl.invoke(DelegatingMethodAccessorImpl.java:25)
>   [junit4]    >        at java.lang.reflect.Method.invoke(Method.java:597)
>   [junit4]    >        at com.carrotsearch.randomizedtesting.RandomizedRunner.invoke(RandomizedRunner.java:1969)
>   [junit4]    >        at com.carrotsearch.randomizedtesting.RandomizedRunner.access$1100(RandomizedRunner.java:132)
>   [junit4]    >        at com.carrotsearch.randomizedtesting.RandomizedRunner$4.evaluate(RandomizedRunner.java:729)
>   [junit4]    >        at com.carrotsearch.randomizedtesting.RandomizedRunner$5.evaluate(RandomizedRunner.java:745)
>   [junit4]    >        at org.apache.lucene.util.AbstractBeforeAfterRule$1.evaluate(AbstractBeforeAfterRule.java:45)
>   [junit4]    >        at org.apache.lucene.util.TestRuleReportUncaughtExceptions$1.evaluate(TestRuleReportUncaughtExceptions.java:68)
>   [junit4]    >        at org.apache.lucene.util.TestRuleStoreClassName$1.evaluate(TestRuleStoreClassName.java:38)
>   [junit4]    >        at org.apache.lucene.util.TestRuleIcuHack$1.evaluate(TestRuleIcuHack.java:51)
>   [junit4]    >        at com.carrotsearch.randomizedtesting.rules.SystemPropertiesInvariantRule$1.evaluate(SystemPropertiesInvariantRule.java:55)
>   [junit4]    >        at org.apache.lucene.util.TestRuleNoInstanceHooksOverrides$1.evaluate(TestRuleNoInstanceHooksOverrides.java:53)
>   [junit4]    >        at org.apache.lucene.util.TestRuleNoStaticHooksShadowing$1.evaluate(TestRuleNoStaticHooksShadowing.java:52)
>   [junit4]    >        at org.apache.lucene.util.TestRuleAssertionsRequired$1.evaluate(TestRuleAssertionsRequired.java:36)
>   [junit4]    >        at org.apache.lucene.util.TestRuleMarkFailure$1.evaluate(TestRuleMarkFailure.java:48)
>   [junit4]    >        at org.apache.lucene.util.TestRuleIgnoreTestSuites$1.evaluate(TestRuleIgnoreTestSuites.java:56)
>   [junit4]    >        at com.carrotsearch.randomizedtesting.RandomizedRunner.runSuite(RandomizedRunner.java:605)
>   [junit4]    >        at com.carrotsearch.randomizedtesting.RandomizedRunner.access$400(RandomizedRunner.java:132)
>   [junit4]    >        at com.carrotsearch.randomizedtesting.RandomizedRunner$2.run(RandomizedRunner.java:551)
>   [junit4]    > Throwable #2: java.lang.NullPointerException
>   [junit4]    >        at __randomizedtesting.SeedInfo.seed([1E7C0CA76C1EE65C]:0)
>   [junit4]    >        at org.apache.lucene.queryparser.flexible.standard.TestNumericQueryParser.afterClass(TestNumericQueryParser.java:521)
>   [junit4]    >        at sun.reflect.NativeMethodAccessorImpl.invoke0(Native
Method)
>   [junit4]    >        at sun.reflect.NativeMethodAccessorImpl.invoke(NativeMethodAccessorImpl.java:39)
>   [junit4]    >        at sun.reflect.DelegatingMethodAccessorImpl.invoke(DelegatingMethodAccessorImpl.java:25)
>   [junit4]    >        at java.lang.reflect.Method.invoke(Method.java:597)
>   [junit4]    >        at com.carrotsearch.randomizedtesting.RandomizedRunner.invoke(RandomizedRunner.java:1969)
>   [junit4]    >        at com.carrotsearch.randomizedtesting.RandomizedRunner.access$1100(RandomizedRunner.java:132)
>   [junit4]    >        at com.carrotsearch.randomizedtesting.RandomizedRunner$5.evaluate(RandomizedRunner.java:752)
>   [junit4]    >        at org.apache.lucene.util.AbstractBeforeAfterRule$1.evaluate(AbstractBeforeAfterRule.java:45)
>   [junit4]    >        at org.apache.lucene.util.TestRuleReportUncaughtExceptions$1.evaluate(TestRuleReportUncaughtExceptions.java:68)
>   [junit4]    >        at org.apache.lucene.util.TestRuleStoreClassName$1.evaluate(TestRuleStoreClassName.java:38)
>   [junit4]    >        at org.apache.lucene.util.TestRuleIcuHack$1.evaluate(TestRuleIcuHack.java:51)
>   [junit4]    >        at com.carrotsearch.randomizedtesting.rules.SystemPropertiesInvariantRule$1.evaluate(SystemPropertiesInvariantRule.java:55)
>   [junit4]    >        at org.apache.lucene.util.TestRuleNoInstanceHooksOverrides$1.evaluate(TestRuleNoInstanceHooksOverrides.java:53)
>   [junit4]    >        at org.apache.lucene.util.TestRuleNoStaticHooksShadowing$1.evaluate(TestRuleNoStaticHooksShadowing.java:52)
>   [junit4]    >        at org.apache.lucene.util.TestRuleAssertionsRequired$1.evaluate(TestRuleAssertionsRequired.java:36)
>   [junit4]    >        at org.apache.lucene.util.TestRuleMarkFailure$1.evaluate(TestRuleMarkFailure.java:48)
>   [junit4]    >        at org.apache.lucene.util.TestRuleIgnoreTestSuites$1.evaluate(TestRuleIgnoreTestSuites.java:56)
>   [junit4]    >        at com.carrotsearch.randomizedtesting.RandomizedRunner.runSuite(RandomizedRunner.java:605)
>   [junit4]    >        at com.carrotsearch.randomizedtesting.RandomizedRunner.access$400(RandomizedRunner.java:132)
>   [junit4]    >        at com.carrotsearch.randomizedtesting.RandomizedRunner$2.run(RandomizedRunner.java:551)
>   [junit4]    >
>   [junit4] Completed on J0 in 0.13s, 0 tests, 2 errors <<< FAILURES!
> [...truncated 84 lines...]
>
> [...truncated 8142 lines...]
>
> [...truncated 8142 lines...]
>
> [...truncated 8142 lines...]
>
> [...truncated 8142 lines...]
>
> [...truncated 8142 lines...]
>
>
>
>
> ---------------------------------------------------------------------
> To unsubscribe, e-mail: dev-unsubscribe@lucene.apache.org
> For additional commands, e-mail: dev-help@lucene.apache.org



-- 
lucidimagination.com

---------------------------------------------------------------------
To unsubscribe, e-mail: dev-unsubscribe@lucene.apache.org
For additional commands, e-mail: dev-help@lucene.apache.org


Mime
View raw message